nixbot

builds

cancelled checks.aarch64-linux.ext-pg_net build #132 · raw · eval 7.3 s · 1.1 GiB allocated · ·

1these 80 derivations will be built:2  /nix/store/0n0iaya9csx9by2pimrx1yglzw8dp4zs-pg_net-0.13.0.drv3  /nix/store/25f3j4f5ialq0qwpdpc7gya55q9i2mai-pg_net-0.11.0.drv4  /nix/store/5xdj291zxpgm4qhx0749x7j0wwlfilf4-pg_net-0.1.drv5  /nix/store/6nzc8mspw5i4qqlvgriv2l1439xlh68v-pg_net-0.10.0.drv6  /nix/store/7iq4z475k625nsn9wc9nf4vxa7x1f1qd-pg_net-0.19.5.drv7  /nix/store/cfrc2vk3cgabx1447j2n7s3zxraq6395-pg_net-0.14.0.drv8  /nix/store/cwpx76dbd4wgmzvp89rp59qf113rhaxl-pg_net-0.20.4.drv9  /nix/store/iwq28h7yniccm9ra8q6dc0wma0l6hnqn-pg_net-0.6.drv10  /nix/store/nw3d144zhshkgx1z66g9g2wg5829w36n-pg_net-0.7.1.drv11  /nix/store/nwcnf7x9i2zdx48936w9ixsnxzhbab16-pg_net-0.20.0.drv12  /nix/store/rfdqkjkjdwz7ydrwlfn9cdy68zz9z6rf-pg_net-0.7.drv13  /nix/store/whvqb38akl195470ks3jads9kmq2i9gj-pg_net-0.8.0.drv14  /nix/store/ynxf31b3a513l6c880hkv4438bia0099-pg_net-0.2.drv15  /nix/store/zy29jzcj1bsz7760wbmlg78czaddsrni-pg_net-0.20.3.drv16  /nix/store/q7ak647qv213m4vc4fnr43i09azs1b0p-pg_net.drv17  /nix/store/1a1qnr1vlfld9ccz74ha0a8azqdwjw88-postgresql-15-pg_net.drv18  /nix/store/0nn0jglvy3w5hd868rilks6acxx242hj-pg_net-0.19.5.drv19  /nix/store/83ycsfk9ivb7sah3lq89d8hy5rxj5vpp-pg_net-0.20.3.drv20  /nix/store/a0ldx82cv1chkbdks86c8mjp8ps4lfgn-pg_net-0.20.0.drv21  /nix/store/b0270km6h57kbdxfkhagcpsilp239adm-pg_net-0.11.0.drv22  /nix/store/lbqp8bfrqa2xm82ma6wyq1gijyajh6kh-pg_net-0.13.0.drv23  /nix/store/rdglczxf0sk4hhwsppqw13zl43vf5wr0-pg_net-0.14.0.drv24  /nix/store/w7547z9slhcibw4s6cwkag6w1f49317s-pg_net-0.20.4.drv25  /nix/store/vvs47f973jig6lflvm7cidm6m20glpy5-pg_net.drv26  /nix/store/3va8cnvmsy7yy6484xp00h00q2782js6-postgresql-orioledb-17-pg_net.drv27  /nix/store/7kzvizgkbdmixlgvdjsvzlxrwj6p80a8-pg_net-0.20.4.drv28  /nix/store/al6g5cvx86v4ljmh3sg6hmlsl3ab3bwf-pg_net-0.20.3.drv29  /nix/store/b1pyvgjyn940h95bbnsp15qmb0qli5gd-pg_net-0.20.0.drv30  /nix/store/cl8ikglrq6jdd2cp01jad7n483mvqj8g-pg_net-0.11.0.drv31  /nix/store/g6nfp5n056kw2jvfzldzxrrrxfpfcka0-pg_net-0.13.0.drv32  /nix/store/xwiwd8fzjgv67zb2ji446a8vxjj3s7bs-pg_net-0.14.0.drv33  /nix/store/yf5z0qi17vprkjz68rqyp804sx929g9n-pg_net-0.19.5.drv34  /nix/store/y02vszvrhs7b6kn8llgwzdmnmhqiymzk-pg_net.drv35  /nix/store/ihfd6321rkb08ldslxkvkkkryxzhcnaj-postgresql-17-pg_net.drv36  /nix/store/9lhfy5qmzar65jprk9kp04vka42mwbg6-postgresql-configfile-check.drv37  /nix/store/x35zc9l5qndwmq9009gjij92i6lzshdz-system-path.drv38  /nix/store/41abwlsxl1wxvzy03xz9lkrns89lz7hg-dbus-1.drv39  /nix/store/xlnvqlilz2kbi4a1g8m2z6accgnc1piv-X-Restart-Triggers-dbus.drv40  /nix/store/1w7vlbiqj13ddykgllq80q4bcnsknfnv-unit-dbus.service.drv41  /nix/store/kwf0zbd4a57rg54w7bk44nxsng0aq3rj-user-units.drv42  /nix/store/0lf4x0my2i4wyx9lq8f4kahvc271sspj-unit-postgresql.service.drv43  /nix/store/pmmnrhp85bqx3abn8j5nv9491n3p53gr-unit-script-postgresql-migrate-start.drv44  /nix/store/4fnz4a1mxllv94wkgif96ldz5xf7n9bv-unit-postgresql-migrate.service.drv45  /nix/store/5sn3my2gywmjx099kv88g93mf0rm027q-unit-dbus.service.drv46  /nix/store/k2kz5ircvn9fscsg528ila2scfqv973k-unit-postgresql-setup.service.drv47  /nix/store/x90y5fzqjfk2y17x68ghf3da7wwhhply-system-units.drv48  /nix/store/n2frqfc1kylk2xbhqv3r4gj2vxxgvlfm-etc.drv49  /nix/store/ffrn2h8xhmqdx5wkyvfjsyf1vax0rg2y-activate.drv50  /nix/store/57flrny3rq7rc9rv3h77kggv0hysfsgq-nixos-system-server-test.drv51  /nix/store/5j4p6hdzsa07nlnxfsdpr247idvlhsys-postgresql-configfile-check.drv52  /nix/store/d1n9y6glfg776zp45dqfa1ryrwrlfknf-system-path.drv53  /nix/store/36anhgawm3wlfpxkrxb4i7sc5zw75cg0-dbus-1.drv54  /nix/store/35if5xjxvpzcjkxpfizsmkirpk7jgg4s-unit-postgresql-setup.service.drv55  /nix/store/bk1xa15q19dfv5hp0c08k5h5qg46vd07-unit-postgresql.service.drv56  /nix/store/rni3fjyl9gb5zpb88kfvnic52h36w8xh-X-Restart-Triggers-dbus.drv57  /nix/store/s71669b8p3al15pl3cv5pgvd2mlr2lyq-unit-dbus.service.drv58  /nix/store/cqv29j3d8l7jxw83zb1wh5zaaa1ggpm5-system-units.drv59  /nix/store/17pcpb1y2cq8f6k8fbhjxfsy1gl66563-unit-dbus.service.drv60  /nix/store/jkxxp5c8ywln8bxc00lb3ww3767309b1-user-units.drv61  /nix/store/i7mhymcwfr6v6rl8id080bx9qw7dk1sq-etc.drv62  /nix/store/qd6hhvs3dzvdgi367972d9402s2hb7c1-activate.drv63  /nix/store/bpv9n6bl39932kj5fp4i6j9vbm4m35wh-nixos-system-server-test.drv64  /nix/store/65pcag4cdsa8f7f9xy9l6pkgijhn13dp-unit-postgresql.service.drv65  /nix/store/h4h3k2qrd28xwa33ynx57x9yvjjj055a-system-path.drv66  /nix/store/l5vzbn3lwbrj1x2f6kvk2vmaf872x3q3-dbus-1.drv67  /nix/store/rav6ifamvjw5zhdrbzc54950rhj4a1g2-X-Restart-Triggers-dbus.drv68  /nix/store/9sbxqx3l25qlzl96sq7kwz6a6kljfgxq-unit-dbus.service.drv69  /nix/store/iig751xbs970xdhbka47gkh27x0nc2y7-unit-postgresql-setup.service.drv70  /nix/store/b2q4z0pa53l331dlcp0fry7kml8xqbmd-system-units.drv71  /nix/store/hrd9nivqqfipa7wcch4navia6a8hpsa1-unit-dbus.service.drv72  /nix/store/fzv58jzvy8vydp9qv66p0rpimk7iafn0-user-units.drv73  /nix/store/vlf5zj4lhvzfappa7mjiszcqs2z45cq4-etc.drv74  /nix/store/c0pw8adyfxl9h10h7i60clh6j4wp0ihv-activate.drv75  /nix/store/drmwc4fv2sc972x5d9xhhx4v4747dd3l-postgresql-configfile-check.drv76  /nix/store/cr9gqp360aag74h0zxnby8lmrkakaa89-nixos-system-server-test.drv77  /nix/store/hva8a05prgcnig8fs0qfdgjb2qi2m851-closure-info.drv78  /nix/store/fl43w0ns5ahvwn1nfw1ijgy2dfvhdvw1-run-nixos-vm.drv79  /nix/store/zchaivrvnd0znakz1wym2zdp5vpdn34m-nixos-vm.drv80  /nix/store/3pdfhngjis8zda7lpz818wcxasj06l9m-nixos-test-driver-pg_net.drv81  /nix/store/0613kg0kjkzgjmnq823x9qcn51j4dq04-vm-test-run-pg_net.drv82these 13 paths will be fetched (372.3 KiB download, 1.9 MiB unpacked):83  /nix/store/1pmpb4d8spv3qv4rr3xm4fxqs27wp56h-libuv-1.51.0-dev84  /nix/store/11fc13s6n3jp1hv44a6akllgjwhd1ds3-source85  /nix/store/3783i7yhcfqnyv5ndli22gcr11ap151m-source86  /nix/store/4b83ydwymbdf21y911hb9xi7p5nysjdp-source87  /nix/store/5zgdqy3bz93jyn79pizxc1hks0cdcadw-source88  /nix/store/80y4c5pqzr1p2kiqq50i52xfbhg58384-source89  /nix/store/bxdzbzjn4yi7ch55dlcgzk6npzx2p4jz-source90  /nix/store/cijlkfxy6vfh6pbq2nd4v8pc51nxn75y-source91  /nix/store/fdvpi9rrahp0pzx91srrjghjahx1kw43-source92  /nix/store/k8c3rak9kd6wykgvhwk6xjzc8yh22yva-source93  /nix/store/mb6v9fi1zbgrvwacb7qfg7a446jgd7rq-source94  /nix/store/rrgb0fks0hl8fs1y22icckm3r0gq13di-source95  /nix/store/wyisw4pmqj8gjmbxnwlqkiccx6xbnm3g-source96building '/nix/store/7kzvizgkbdmixlgvdjsvzlxrwj6p80a8-pg_net-0.20.4.drv' on 'ssh-ng://nixbot-remote-build@78.232.36.247'97building '/nix/store/cwpx76dbd4wgmzvp89rp59qf113rhaxl-pg_net-0.20.4.drv' on 'ssh-ng://nixbot-remote-build@78.232.36.247'98building '/nix/store/cwpx76dbd4wgmzvp89rp59qf113rhaxl-pg_net-0.20.4.drv'99pg_net-0.20.4> Running phase: unpackPhase100pg_net-0.20.4> unpacking source archive /nix/store/29pmmzv8rhqja1mwjzsnxdm8vy2f6iqh-source101pg_net-0.20.4> source root is source102pg_net-0.20.4> Running phase: patchPhase103pg_net-0.20.4> Running phase: updateAutotoolsGnuConfigScriptsPhase104pg_net-0.20.4> Running phase: configurePhase105pg_net-0.20.4> no configure script, doing nothing106pg_net-0.20.4> Running phase: buildPhase107pg_net-0.20.4> gcc -Wall -Wmissing-prototypes -Wpointer-arith -Wdeclaration-after-statement -Werror=vla -Wendif-labels -Wmissing-format-attribute -Wimplicit-fallthrough=3 -Wcast-function-type -Wformat-security -fno-strict-aliasing -fwrapv -fexcess-precision=standard -Wno-deprecated-non-prototype -Wno-format-truncation -Wno-stringop-truncation -g -O2 -std=gnu17 -std=c11 -Wextra -Wall -Werror -Wno-declaration-after-statement -Wno-vla -Wno-long-long -Wmissing-variable-declarations -fPIC  -DEXTVERSION=\"0.20.4\" -I. -I./ -I/nix/store/48l45fvi99n90x6p9i4cs1lmzby6cb73-postgresql-15.19/include/server -I/nix/store/48l45fvi99n90x6p9i4cs1lmzby6cb73-postgresql-15.19/include/internal -D_GNU_SOURCE  -I/nix/store/p17klc3qq4nl9ihfwqfpi8cnqvcf92xz-libxml2-2.15.1-dev/include/libxml2 -I/nix/store/mglbi4dy4kpx7v1dcgf6iincp5x38hsc-lz4-1.10.0-dev/include -I/nix/store/g41q9md9rdcr3lkydi6f8zd6fza3h1q4-zstd-1.5.7-dev/include -I/nix/store/n2vnr7ycfk6midbzxcwd28qj3bgb50cz-icu4c-75.1-dev/include  -c -o src/core.o src/core.c108pg_net-0.20.4> gcc -Wall -Wmissing-prototypes -Wpointer-arith -Wdeclaration-after-statement -Werror=vla -Wendif-labels -Wmissing-format-attribute -Wimplicit-fallthrough=3 -Wcast-function-type -Wformat-security -fno-strict-aliasing -fwrapv -fexcess-precision=standard -Wno-deprecated-non-prototype -Wno-format-truncation -Wno-stringop-truncation -g -O2 -std=gnu17 -std=c11 -Wextra -Wall -Werror -Wno-declaration-after-statement -Wno-vla -Wno-long-long -Wmissing-variable-declarations -fPIC  -DEXTVERSION=\"0.20.4\" -I. -I./ -I/nix/store/48l45fvi99n90x6p9i4cs1lmzby6cb73-postgresql-15.19/include/server -I/nix/store/48l45fvi99n90x6p9i4cs1lmzby6cb73-postgresql-15.19/include/internal -D_GNU_SOURCE  -I/nix/store/p17klc3qq4nl9ihfwqfpi8cnqvcf92xz-libxml2-2.15.1-dev/include/libxml2 -I/nix/store/mglbi4dy4kpx7v1dcgf6iincp5x38hsc-lz4-1.10.0-dev/include -I/nix/store/g41q9md9rdcr3lkydi6f8zd6fza3h1q4-zstd-1.5.7-dev/include -I/nix/store/n2vnr7ycfk6midbzxcwd28qj3bgb50cz-icu4c-75.1-dev/include  -c -o src/errors.o src/errors.c109pg_net-0.20.4> gcc -Wall -Wmissing-prototypes -Wpointer-arith -Wdeclaration-after-statement -Werror=vla -Wendif-labels -Wmissing-format-attribute -Wimplicit-fallthrough=3 -Wcast-function-type -Wformat-security -fno-strict-aliasing -fwrapv -fexcess-precision=standard -Wno-deprecated-non-prototype -Wno-format-truncation -Wno-stringop-truncation -g -O2 -std=gnu17 -std=c11 -Wextra -Wall -Werror -Wno-declaration-after-statement -Wno-vla -Wno-long-long -Wmissing-variable-declarations -fPIC  -DEXTVERSION=\"0.20.4\" -I. -I./ -I/nix/store/48l45fvi99n90x6p9i4cs1lmzby6cb73-postgresql-15.19/include/server -I/nix/store/48l45fvi99n90x6p9i4cs1lmzby6cb73-postgresql-15.19/include/internal -D_GNU_SOURCE  -I/nix/store/p17klc3qq4nl9ihfwqfpi8cnqvcf92xz-libxml2-2.15.1-dev/include/libxml2 -I/nix/store/mglbi4dy4kpx7v1dcgf6iincp5x38hsc-lz4-1.10.0-dev/include -I/nix/store/g41q9md9rdcr3lkydi6f8zd6fza3h1q4-zstd-1.5.7-dev/include -I/nix/store/n2vnr7ycfk6midbzxcwd28qj3bgb50cz-icu4c-75.1-dev/include  -c -o src/event.o src/event.c110pg_net-0.20.4> gcc -Wall -Wmissing-prototypes -Wpointer-arith -Wdeclaration-after-statement -Werror=vla -Wendif-labels -Wmissing-format-attribute -Wimplicit-fallthrough=3 -Wcast-function-type -Wformat-security -fno-strict-aliasing -fwrapv -fexcess-precision=standard -Wno-deprecated-non-prototype -Wno-format-truncation -Wno-stringop-truncation -g -O2 -std=gnu17 -std=c11 -Wextra -Wall -Werror -Wno-declaration-after-statement -Wno-vla -Wno-long-long -Wmissing-variable-declarations -fPIC  -DEXTVERSION=\"0.20.4\" -I. -I./ -I/nix/store/48l45fvi99n90x6p9i4cs1lmzby6cb73-postgresql-15.19/include/server -I/nix/store/48l45fvi99n90x6p9i4cs1lmzby6cb73-postgresql-15.19/include/internal -D_GNU_SOURCE  -I/nix/store/p17klc3qq4nl9ihfwqfpi8cnqvcf92xz-libxml2-2.15.1-dev/include/libxml2 -I/nix/store/mglbi4dy4kpx7v1dcgf6iincp5x38hsc-lz4-1.10.0-dev/include -I/nix/store/g41q9md9rdcr3lkydi6f8zd6fza3h1q4-zstd-1.5.7-dev/include -I/nix/store/n2vnr7ycfk6midbzxcwd28qj3bgb50cz-icu4c-75.1-dev/include  -c -o src/util.o src/util.c111pg_net-0.20.4> gcc -Wall -Wmissing-prototypes -Wpointer-arith -Wdeclaration-after-statement -Werror=vla -Wendif-labels -Wmissing-format-attribute -Wimplicit-fallthrough=3 -Wcast-function-type -Wformat-security -fno-strict-aliasing -fwrapv -fexcess-precision=standard -Wno-deprecated-non-prototype -Wno-format-truncation -Wno-stringop-truncation -g -O2 -std=gnu17 -std=c11 -Wextra -Wall -Werror -Wno-declaration-after-statement -Wno-vla -Wno-long-long -Wmissing-variable-declarations -fPIC  -DEXTVERSION=\"0.20.4\" -I. -I./ -I/nix/store/48l45fvi99n90x6p9i4cs1lmzby6cb73-postgresql-15.19/include/server -I/nix/store/48l45fvi99n90x6p9i4cs1lmzby6cb73-postgresql-15.19/include/internal -D_GNU_SOURCE  -I/nix/store/p17klc3qq4nl9ihfwqfpi8cnqvcf92xz-libxml2-2.15.1-dev/include/libxml2 -I/nix/store/mglbi4dy4kpx7v1dcgf6iincp5x38hsc-lz4-1.10.0-dev/include -I/nix/store/g41q9md9rdcr3lkydi6f8zd6fza3h1q4-zstd-1.5.7-dev/include -I/nix/store/n2vnr7ycfk6midbzxcwd28qj3bgb50cz-icu4c-75.1-dev/include  -c -o src/worker.o src/worker.c112pg_net-0.20.4> gcc -Wall -Wmissing-prototypes -Wpointer-arith -Wdeclaration-after-statement -Werror=vla -Wendif-labels -Wmissing-format-attribute -Wimplicit-fallthrough=3 -Wcast-function-type -Wformat-security -fno-strict-aliasing -fwrapv -fexcess-precision=standard -Wno-deprecated-non-prototype -Wno-format-truncation -Wno-stringop-truncation -g -O2 -std=gnu17 -std=c11 -Wextra -Wall -Werror -Wno-declaration-after-statement -Wno-vla -Wno-long-long -Wmissing-variable-declarations -fPIC -shared -o pg_net.so  src/core.o  src/errors.o  src/event.o  src/util.o  src/worker.o  -L/nix/store/k4dpm55d68aq0df72hjk046xy1124lhn-postgresql-15.19-lib/lib    -L/nix/store/wfk1mrpj1r5f7iyihjnh0jjixr900z7y-libxml2-2.15.1/lib -L/nix/store/62b24z1igfh6ws654fhsgnm3fm7j1z3c-lz4-1.10.0-lib/lib -L/nix/store/fqy9nkaahib56gcy0r77qjk7n03cvnfs-zstd-1.5.7/lib -Wl,--as-needed -Wl,-rpath,'/nix/store/k4dpm55d68aq0df72hjk046xy1124lhn-postgresql-15.19-lib/lib',--enable-new-dtags  -lcurl 113pg_net-0.20.4> cp sql/pg_net.sql sql/pg_net--0.20.4.sql114pg_net-0.20.4> sed "s/@EXTVERSION@/0.20.4/g" pg_net.control.in > pg_net.control115pg_net-0.20.4> Running phase: installPhase116pg_net-0.20.4> Running phase: fixupPhase117pg_net-0.20.4> shrinking RPATHs of ELF executables and libraries in /nix/store/k3qg7nrhl8gf524lk6yn9r167gw43c9f-pg_net-0.20.4118pg_net-0.20.4> shrinking /nix/store/k3qg7nrhl8gf524lk6yn9r167gw43c9f-pg_net-0.20.4/lib/pg_net-0.20.4.so119pg_net-0.20.4> checking for references to /build/ in /nix/store/k3qg7nrhl8gf524lk6yn9r167gw43c9f-pg_net-0.20.4...120pg_net-0.20.4> patching script interpreter paths in /nix/store/k3qg7nrhl8gf524lk6yn9r167gw43c9f-pg_net-0.20.4121pg_net-0.20.4> stripping (with command strip and flags -S -p) in  /nix/store/k3qg7nrhl8gf524lk6yn9r167gw43c9f-pg_net-0.20.4/lib122building '/nix/store/5xdj291zxpgm4qhx0749x7j0wwlfilf4-pg_net-0.1.drv' on 'ssh-ng://nixbot-remote-build@78.232.36.247'123building '/nix/store/5xdj291zxpgm4qhx0749x7j0wwlfilf4-pg_net-0.1.drv'124pg_net-0.1> Running phase: unpackPhase125pg_net-0.1> unpacking source archive /nix/store/k8c3rak9kd6wykgvhwk6xjzc8yh22yva-source126pg_net-0.1> source root is source127pg_net-0.1> Running phase: patchPhase128pg_net-0.1> Running phase: updateAutotoolsGnuConfigScriptsPhase129pg_net-0.1> Running phase: configurePhase130pg_net-0.1> no configure script, doing nothing131pg_net-0.1> Running phase: buildPhase132pg_net-0.1> gcc -Wall -Wmissing-prototypes -Wpointer-arith -Wdeclaration-after-statement -Werror=vla -Wendif-labels -Wmissing-format-attribute -Wimplicit-fallthrough=3 -Wcast-function-type -Wformat-security -fno-strict-aliasing -fwrapv -fexcess-precision=standard -Wno-deprecated-non-prototype -Wno-format-truncation -Wno-stringop-truncation -g -O2 -std=gnu17 -fPIC -I. -I./ -I/nix/store/48l45fvi99n90x6p9i4cs1lmzby6cb73-postgresql-15.19/include/server -I/nix/store/48l45fvi99n90x6p9i4cs1lmzby6cb73-postgresql-15.19/include/internal -D_GNU_SOURCE  -I/nix/store/p17klc3qq4nl9ihfwqfpi8cnqvcf92xz-libxml2-2.15.1-dev/include/libxml2 -I/nix/store/mglbi4dy4kpx7v1dcgf6iincp5x38hsc-lz4-1.10.0-dev/include -I/nix/store/g41q9md9rdcr3lkydi6f8zd6fza3h1q4-zstd-1.5.7-dev/include -I/nix/store/n2vnr7ycfk6midbzxcwd28qj3bgb50cz-icu4c-75.1-dev/include  -c -o src/worker.o src/worker.c133pg_net-0.1> src/worker.c: In function 'init':134pg_net-0.1> src/worker.c:187:9: warning: 'CURLOPT_PROTOCOLS' is deprecated: since 7.85.0. Use CURLOPT_PROTOCOLS_STR [-Wdeprecated-declarations]135pg_net-0.1>   187 |         curl_easy_setopt(eh, CURLOPT_PROTOCOLS, CURLPROTO_HTTP | CURLPROTO_HTTPS);136pg_net-0.1>       |         ^~~~~~~~~~~~~~~~137pg_net-0.1> In file included from src/worker.c:28:138pg_net-0.1> /nix/store/jviasb44hibgh09829gbmbssbz2jjnhz-curl-8.17.0-dev/include/curl/curl.h:1786:3: note: declared here139pg_net-0.1>  1786 |   CURLOPTDEPRECATED(CURLOPT_PROTOCOLS, CURLOPTTYPE_LONG, 181,140pg_net-0.1>       |   ^~~~~~~~~~~~~~~~~141pg_net-0.1> gcc -Wall -Wmissing-prototypes -Wpointer-arith -Wdeclaration-after-statement -Werror=vla -Wendif-labels -Wmissing-format-attribute -Wimplicit-fallthrough=3 -Wcast-function-type -Wformat-security -fno-strict-aliasing -fwrapv -fexcess-precision=standard -Wno-deprecated-non-prototype -Wno-format-truncation -Wno-stringop-truncation -g -O2 -std=gnu17 -fPIC -shared -o pg_net.so src/worker.o -L/nix/store/k4dpm55d68aq0df72hjk046xy1124lhn-postgresql-15.19-lib/lib    -L/nix/store/wfk1mrpj1r5f7iyihjnh0jjixr900z7y-libxml2-2.15.1/lib -L/nix/store/62b24z1igfh6ws654fhsgnm3fm7j1z3c-lz4-1.10.0-lib/lib -L/nix/store/fqy9nkaahib56gcy0r77qjk7n03cvnfs-zstd-1.5.7/lib -Wl,--as-needed -Wl,-rpath,'/nix/store/k4dpm55d68aq0df72hjk046xy1124lhn-postgresql-15.19-lib/lib',--enable-new-dtags  -lcurl 142pg_net-0.1> Running phase: installPhase143pg_net-0.1> Running phase: fixupPhase144pg_net-0.1> shrinking RPATHs of ELF executables and libraries in /nix/store/c3q55l7amv1vk7q0xr7yiv111wjj67qq-pg_net-0.1145pg_net-0.1> shrinking /nix/store/c3q55l7amv1vk7q0xr7yiv111wjj67qq-pg_net-0.1/lib/pg_net-0.1.so146pg_net-0.1> checking for references to /build/ in /nix/store/c3q55l7amv1vk7q0xr7yiv111wjj67qq-pg_net-0.1...147pg_net-0.1> patching script interpreter paths in /nix/store/c3q55l7amv1vk7q0xr7yiv111wjj67qq-pg_net-0.1148pg_net-0.1> stripping (with command strip and flags -S -p) in  /nix/store/c3q55l7amv1vk7q0xr7yiv111wjj67qq-pg_net-0.1/lib149building '/nix/store/6nzc8mspw5i4qqlvgriv2l1439xlh68v-pg_net-0.10.0.drv' on 'ssh-ng://nixbot-remote-build@78.232.36.247'150building '/nix/store/6nzc8mspw5i4qqlvgriv2l1439xlh68v-pg_net-0.10.0.drv'151pg_net-0.10.0> Running phase: unpackPhase152pg_net-0.10.0> unpacking source archive /nix/store/4b83ydwymbdf21y911hb9xi7p5nysjdp-source153pg_net-0.10.0> source root is source154pg_net-0.10.0> Running phase: patchPhase155pg_net-0.10.0> Running phase: updateAutotoolsGnuConfigScriptsPhase156pg_net-0.10.0> Running phase: configurePhase157pg_net-0.10.0> no configure script, doing nothing158pg_net-0.10.0> Running phase: buildPhase159pg_net-0.10.0> gcc -Wall -Wmissing-prototypes -Wpointer-arith -Wdeclaration-after-statement -Werror=vla -Wendif-labels -Wmissing-format-attribute -Wimplicit-fallthrough=3 -Wcast-function-type -Wformat-security -fno-strict-aliasing -fwrapv -fexcess-precision=standard -Wno-deprecated-non-prototype -Wno-format-truncation -Wno-stringop-truncation -g -O2 -std=gnu17 -Werror -Wno-declaration-after-statement -fPIC  -DEXTVERSION=\"0.10.0\" -I. -I./ -I/nix/store/48l45fvi99n90x6p9i4cs1lmzby6cb73-postgresql-15.19/include/server -I/nix/store/48l45fvi99n90x6p9i4cs1lmzby6cb73-postgresql-15.19/include/internal -D_GNU_SOURCE  -I/nix/store/p17klc3qq4nl9ihfwqfpi8cnqvcf92xz-libxml2-2.15.1-dev/include/libxml2 -I/nix/store/mglbi4dy4kpx7v1dcgf6iincp5x38hsc-lz4-1.10.0-dev/include -I/nix/store/g41q9md9rdcr3lkydi6f8zd6fza3h1q4-zstd-1.5.7-dev/include -I/nix/store/n2vnr7ycfk6midbzxcwd28qj3bgb50cz-icu4c-75.1-dev/include  -c -o src/worker.o src/worker.c160pg_net-0.10.0> In file included from src/worker.c:23:161pg_net-0.10.0> In function 'init_curl_handle',162pg_net-0.10.0>     inlined from 'consume_request_queue' at src/worker.c:267:5,163pg_net-0.10.0>     inlined from 'pg_net_worker' at src/worker.c:394:5:164pg_net-0.10.0> src/util.h:6:11: warning: call to 'Wcurl_easy_setopt_err_long' declared with attribute warning: curl_easy_setopt expects a long argument [-Wattribute-warning]165pg_net-0.10.0>     6 |       if (curl_easy_setopt(hdl, opt, prm) != CURLE_OK) \166pg_net-0.10.0>       |           ^~~~~~~~~~~~~~~~167pg_net-0.10.0> src/worker.c:176:7: note: in expansion of macro 'CURL_EZ_SETOPT'168pg_net-0.10.0>   176 |       CURL_EZ_SETOPT(curl_ez_handle, CURLOPT_POST, 1);169pg_net-0.10.0>       |       ^~~~~~~~~~~~~~170pg_net-0.10.0> src/util.h:6:11: warning: call to 'Wcurl_easy_setopt_err_long' declared with attribute warning: curl_easy_setopt expects a long argument [-Wattribute-warning]171pg_net-0.10.0>     6 |       if (curl_easy_setopt(hdl, opt, prm) != CURLE_OK) \172pg_net-0.10.0>       |           ^~~~~~~~~~~~~~~~173pg_net-0.10.0> src/worker.c:177:7: note: in expansion of macro 'CURL_EZ_SETOPT'174pg_net-0.10.0>   177 |       CURL_EZ_SETOPT(curl_ez_handle, CURLOPT_POSTFIELDSIZE, 0);175pg_net-0.10.0>       |       ^~~~~~~~~~~~~~176pg_net-0.10.0> src/util.h:6:11: warning: call to 'Wcurl_easy_setopt_err_long' declared with attribute warning: curl_easy_setopt expects a long argument [-Wattribute-warning]177pg_net-0.10.0>     6 |       if (curl_easy_setopt(hdl, opt, prm) != CURLE_OK) \178pg_net-0.10.0>       |           ^~~~~~~~~~~~~~~~179pg_net-0.10.0> src/worker.c:190:3: note: in expansion of macro 'CURL_EZ_SETOPT'180pg_net-0.10.0>   190 |   CURL_EZ_SETOPT(curl_ez_handle, CURLOPT_TIMEOUT_MS, timeout_milliseconds);181pg_net-0.10.0>       |   ^~~~~~~~~~~~~~182pg_net-0.10.0> src/util.h:6:11: warning: call to 'Wcurl_easy_setopt_err_long' declared with attribute warning: curl_easy_setopt expects a long argument [-Wattribute-warning]183pg_net-0.10.0>     6 |       if (curl_easy_setopt(hdl, opt, prm) != CURLE_OK) \184pg_net-0.10.0>       |           ^~~~~~~~~~~~~~~~185pg_net-0.10.0> src/worker.c:192:3: note: in expansion of macro 'CURL_EZ_SETOPT'186pg_net-0.10.0>   192 |   CURL_EZ_SETOPT(curl_ez_handle, CURLOPT_FOLLOWLOCATION, true);187pg_net-0.10.0>       |   ^~~~~~~~~~~~~~188pg_net-0.10.0> gcc -Wall -Wmissing-prototypes -Wpointer-arith -Wdeclaration-after-statement -Werror=vla -Wendif-labels -Wmissing-format-attribute -Wimplicit-fallthrough=3 -Wcast-function-type -Wformat-security -fno-strict-aliasing -fwrapv -fexcess-precision=standard -Wno-deprecated-non-prototype -Wno-format-truncation -Wno-stringop-truncation -g -O2 -std=gnu17 -Werror -Wno-declaration-after-statement -fPIC  -DEXTVERSION=\"0.10.0\" -I. -I./ -I/nix/store/48l45fvi99n90x6p9i4cs1lmzby6cb73-postgresql-15.19/include/server -I/nix/store/48l45fvi99n90x6p9i4cs1lmzby6cb73-postgresql-15.19/include/internal -D_GNU_SOURCE  -I/nix/store/p17klc3qq4nl9ihfwqfpi8cnqvcf92xz-libxml2-2.15.1-dev/include/libxml2 -I/nix/store/mglbi4dy4kpx7v1dcgf6iincp5x38hsc-lz4-1.10.0-dev/include -I/nix/store/g41q9md9rdcr3lkydi6f8zd6fza3h1q4-zstd-1.5.7-dev/include -I/nix/store/n2vnr7ycfk6midbzxcwd28qj3bgb50cz-icu4c-75.1-dev/include  -c -o src/util.o src/util.c189pg_net-0.10.0> gcc -Wall -Wmissing-prototypes -Wpointer-arith -Wdeclaration-after-statement -Werror=vla -Wendif-labels -Wmissing-format-attribute -Wimplicit-fallthrough=3 -Wcast-function-type -Wformat-security -fno-strict-aliasing -fwrapv -fexcess-precision=standard -Wno-deprecated-non-prototype -Wno-format-truncation -Wno-stringop-truncation -g -O2 -std=gnu17 -Werror -Wno-declaration-after-statement -fPIC -shared -o pg_net.so src/worker.o src/util.o -L/nix/store/k4dpm55d68aq0df72hjk046xy1124lhn-postgresql-15.19-lib/lib    -L/nix/store/wfk1mrpj1r5f7iyihjnh0jjixr900z7y-libxml2-2.15.1/lib -L/nix/store/62b24z1igfh6ws654fhsgnm3fm7j1z3c-lz4-1.10.0-lib/lib -L/nix/store/fqy9nkaahib56gcy0r77qjk7n03cvnfs-zstd-1.5.7/lib -Wl,--as-needed -Wl,-rpath,'/nix/store/k4dpm55d68aq0df72hjk046xy1124lhn-postgresql-15.19-lib/lib',--enable-new-dtags  -lcurl 190pg_net-0.10.0> cp sql/pg_net.sql sql/pg_net--0.10.0.sql191pg_net-0.10.0> sed "s/@PG_NET_VERSION@/0.10.0/g" pg_net.control.in > pg_net.control192pg_net-0.10.0> Running phase: installPhase193pg_net-0.10.0> Running phase: fixupPhase194pg_net-0.10.0> shrinking RPATHs of ELF executables and libraries in /nix/store/rhid0raf79snsbmkk11zhb23fd0cskmf-pg_net-0.10.0195pg_net-0.10.0> shrinking /nix/store/rhid0raf79snsbmkk11zhb23fd0cskmf-pg_net-0.10.0/lib/pg_net-0.10.0.so196pg_net-0.10.0> checking for references to /build/ in /nix/store/rhid0raf79snsbmkk11zhb23fd0cskmf-pg_net-0.10.0...197pg_net-0.10.0> patching script interpreter paths in /nix/store/rhid0raf79snsbmkk11zhb23fd0cskmf-pg_net-0.10.0198pg_net-0.10.0> stripping (with command strip and flags -S -p) in  /nix/store/rhid0raf79snsbmkk11zhb23fd0cskmf-pg_net-0.10.0/lib199building '/nix/store/25f3j4f5ialq0qwpdpc7gya55q9i2mai-pg_net-0.11.0.drv' on 'ssh-ng://nixbot-remote-build@78.232.36.247'200building '/nix/store/25f3j4f5ialq0qwpdpc7gya55q9i2mai-pg_net-0.11.0.drv'201pg_net-0.11.0> Running phase: unpackPhase202pg_net-0.11.0> unpacking source archive /nix/store/11fc13s6n3jp1hv44a6akllgjwhd1ds3-source203pg_net-0.11.0> source root is source204pg_net-0.11.0> Running phase: patchPhase205pg_net-0.11.0> Running phase: updateAutotoolsGnuConfigScriptsPhase206pg_net-0.11.0> Running phase: configurePhase207pg_net-0.11.0> no configure script, doing nothing208pg_net-0.11.0> Running phase: buildPhase209pg_net-0.11.0> gcc -Wall -Wmissing-prototypes -Wpointer-arith -Wdeclaration-after-statement -Werror=vla -Wendif-labels -Wmissing-format-attribute -Wimplicit-fallthrough=3 -Wcast-function-type -Wformat-security -fno-strict-aliasing -fwrapv -fexcess-precision=standard -Wno-deprecated-non-prototype -Wno-format-truncation -Wno-stringop-truncation -g -O2 -std=gnu17 -std=c11 -Werror -Wno-declaration-after-statement -fPIC  -DEXTVERSION=\"0.11.0\" -I. -I./ -I/nix/store/48l45fvi99n90x6p9i4cs1lmzby6cb73-postgresql-15.19/include/server -I/nix/store/48l45fvi99n90x6p9i4cs1lmzby6cb73-postgresql-15.19/include/internal -D_GNU_SOURCE  -I/nix/store/p17klc3qq4nl9ihfwqfpi8cnqvcf92xz-libxml2-2.15.1-dev/include/libxml2 -I/nix/store/mglbi4dy4kpx7v1dcgf6iincp5x38hsc-lz4-1.10.0-dev/include -I/nix/store/g41q9md9rdcr3lkydi6f8zd6fza3h1q4-zstd-1.5.7-dev/include -I/nix/store/n2vnr7ycfk6midbzxcwd28qj3bgb50cz-icu4c-75.1-dev/include  -c -o src/worker.o src/worker.c210pg_net-0.11.0> gcc -Wall -Wmissing-prototypes -Wpointer-arith -Wdeclaration-after-statement -Werror=vla -Wendif-labels -Wmissing-format-attribute -Wimplicit-fallthrough=3 -Wcast-function-type -Wformat-security -fno-strict-aliasing -fwrapv -fexcess-precision=standard -Wno-deprecated-non-prototype -Wno-format-truncation -Wno-stringop-truncation -g -O2 -std=gnu17 -std=c11 -Werror -Wno-declaration-after-statement -fPIC  -DEXTVERSION=\"0.11.0\" -I. -I./ -I/nix/store/48l45fvi99n90x6p9i4cs1lmzby6cb73-postgresql-15.19/include/server -I/nix/store/48l45fvi99n90x6p9i4cs1lmzby6cb73-postgresql-15.19/include/internal -D_GNU_SOURCE  -I/nix/store/p17klc3qq4nl9ihfwqfpi8cnqvcf92xz-libxml2-2.15.1-dev/include/libxml2 -I/nix/store/mglbi4dy4kpx7v1dcgf6iincp5x38hsc-lz4-1.10.0-dev/include -I/nix/store/g41q9md9rdcr3lkydi6f8zd6fza3h1q4-zstd-1.5.7-dev/include -I/nix/store/n2vnr7ycfk6midbzxcwd28qj3bgb50cz-icu4c-75.1-dev/include  -c -o src/util.o src/util.c211pg_net-0.11.0> gcc -Wall -Wmissing-prototypes -Wpointer-arith -Wdeclaration-after-statement -Werror=vla -Wendif-labels -Wmissing-format-attribute -Wimplicit-fallthrough=3 -Wcast-function-type -Wformat-security -fno-strict-aliasing -fwrapv -fexcess-precision=standard -Wno-deprecated-non-prototype -Wno-format-truncation -Wno-stringop-truncation -g -O2 -std=gnu17 -std=c11 -Werror -Wno-declaration-after-statement -fPIC  -DEXTVERSION=\"0.11.0\" -I. -I./ -I/nix/store/48l45fvi99n90x6p9i4cs1lmzby6cb73-postgresql-15.19/include/server -I/nix/store/48l45fvi99n90x6p9i4cs1lmzby6cb73-postgresql-15.19/include/internal -D_GNU_SOURCE  -I/nix/store/p17klc3qq4nl9ihfwqfpi8cnqvcf92xz-libxml2-2.15.1-dev/include/libxml2 -I/nix/store/mglbi4dy4kpx7v1dcgf6iincp5x38hsc-lz4-1.10.0-dev/include -I/nix/store/g41q9md9rdcr3lkydi6f8zd6fza3h1q4-zstd-1.5.7-dev/include -I/nix/store/n2vnr7ycfk6midbzxcwd28qj3bgb50cz-icu4c-75.1-dev/include  -c -o src/core.o src/core.c212pg_net-0.11.0> In file included from src/core.c:23:213pg_net-0.11.0> In function 'init_curl_handle',214pg_net-0.11.0>     inlined from 'consume_request_queue' at src/core.c:341:5:215pg_net-0.11.0> src/util.h:6:11: warning: call to 'Wcurl_easy_setopt_err_long' declared with attribute warning: curl_easy_setopt expects a long argument [-Wattribute-warning]216pg_net-0.11.0>     6 |       if (curl_easy_setopt(hdl, opt, prm) != CURLE_OK) \217pg_net-0.11.0>       |           ^~~~~~~~~~~~~~~~218pg_net-0.11.0> src/core.c:162:7: note: in expansion of macro 'CURL_EZ_SETOPT'219pg_net-0.11.0>   162 |       CURL_EZ_SETOPT(curl_ez_handle, CURLOPT_POST, 1);220pg_net-0.11.0>       |       ^~~~~~~~~~~~~~221pg_net-0.11.0> src/util.h:6:11: warning: call to 'Wcurl_easy_setopt_err_long' declared with attribute warning: curl_easy_setopt expects a long argument [-Wattribute-warning]222pg_net-0.11.0>     6 |       if (curl_easy_setopt(hdl, opt, prm) != CURLE_OK) \223pg_net-0.11.0>       |           ^~~~~~~~~~~~~~~~224pg_net-0.11.0> src/core.c:163:7: note: in expansion of macro 'CURL_EZ_SETOPT'225pg_net-0.11.0>   163 |       CURL_EZ_SETOPT(curl_ez_handle, CURLOPT_POSTFIELDSIZE, 0);226pg_net-0.11.0>       |       ^~~~~~~~~~~~~~227pg_net-0.11.0> src/util.h:6:11: warning: call to 'Wcurl_easy_setopt_err_long' declared with attribute warning: curl_easy_setopt expects a long argument [-Wattribute-warning]228pg_net-0.11.0>     6 |       if (curl_easy_setopt(hdl, opt, prm) != CURLE_OK) \229pg_net-0.11.0>       |           ^~~~~~~~~~~~~~~~230pg_net-0.11.0> src/core.c:176:3: note: in expansion of macro 'CURL_EZ_SETOPT'231pg_net-0.11.0>   176 |   CURL_EZ_SETOPT(curl_ez_handle, CURLOPT_TIMEOUT_MS, timeout_milliseconds);232pg_net-0.11.0>       |   ^~~~~~~~~~~~~~233pg_net-0.11.0> src/util.h:6:11: warning: call to 'Wcurl_easy_setopt_err_long' declared with attribute warning: curl_easy_setopt expects a long argument [-Wattribute-warning]234pg_net-0.11.0>     6 |       if (curl_easy_setopt(hdl, opt, prm) != CURLE_OK) \235pg_net-0.11.0>       |           ^~~~~~~~~~~~~~~~236pg_net-0.11.0> src/core.c:178:3: note: in expansion of macro 'CURL_EZ_SETOPT'237pg_net-0.11.0>   178 |   CURL_EZ_SETOPT(curl_ez_handle, CURLOPT_FOLLOWLOCATION, true);238pg_net-0.11.0>       |   ^~~~~~~~~~~~~~239pg_net-0.11.0> gcc -Wall -Wmissing-prototypes -Wpointer-arith -Wdeclaration-after-statement -Werror=vla -Wendif-labels -Wmissing-format-attribute -Wimplicit-fallthrough=3 -Wcast-function-type -Wformat-security -fno-strict-aliasing -fwrapv -fexcess-precision=standard -Wno-deprecated-non-prototype -Wno-format-truncation -Wno-stringop-truncation -g -O2 -std=gnu17 -std=c11 -Werror -Wno-declaration-after-statement -fPIC -shared -o pg_net.so src/worker.o src/util.o src/core.o -L/nix/store/k4dpm55d68aq0df72hjk046xy1124lhn-postgresql-15.19-lib/lib    -L/nix/store/wfk1mrpj1r5f7iyihjnh0jjixr900z7y-libxml2-2.15.1/lib -L/nix/store/62b24z1igfh6ws654fhsgnm3fm7j1z3c-lz4-1.10.0-lib/lib -L/nix/store/fqy9nkaahib56gcy0r77qjk7n03cvnfs-zstd-1.5.7/lib -Wl,--as-needed -Wl,-rpath,'/nix/store/k4dpm55d68aq0df72hjk046xy1124lhn-postgresql-15.19-lib/lib',--enable-new-dtags  -lcurl 240pg_net-0.11.0> cp sql/pg_net.sql sql/pg_net--0.11.0.sql241pg_net-0.11.0> sed "s/@PG_NET_VERSION@/0.11.0/g" pg_net.control.in > pg_net.control242pg_net-0.11.0> Running phase: installPhase243pg_net-0.11.0> Running phase: fixupPhase244pg_net-0.11.0> shrinking RPATHs of ELF executables and libraries in /nix/store/0l5kkgznzldgq139wyb3jx0gxb06ydmm-pg_net-0.11.0245pg_net-0.11.0> shrinking /nix/store/0l5kkgznzldgq139wyb3jx0gxb06ydmm-pg_net-0.11.0/lib/pg_net-0.11.0.so246pg_net-0.11.0> checking for references to /build/ in /nix/store/0l5kkgznzldgq139wyb3jx0gxb06ydmm-pg_net-0.11.0...247pg_net-0.11.0> patching script interpreter paths in /nix/store/0l5kkgznzldgq139wyb3jx0gxb06ydmm-pg_net-0.11.0248pg_net-0.11.0> stripping (with command strip and flags -S -p) in  /nix/store/0l5kkgznzldgq139wyb3jx0gxb06ydmm-pg_net-0.11.0/lib249building '/nix/store/0n0iaya9csx9by2pimrx1yglzw8dp4zs-pg_net-0.13.0.drv' on 'ssh-ng://nixbot-remote-build@78.232.36.247'250building '/nix/store/0n0iaya9csx9by2pimrx1yglzw8dp4zs-pg_net-0.13.0.drv'251pg_net-0.13.0> Running phase: unpackPhase252pg_net-0.13.0> unpacking source archive /nix/store/bxdzbzjn4yi7ch55dlcgzk6npzx2p4jz-source253pg_net-0.13.0> source root is source254pg_net-0.13.0> Running phase: patchPhase255pg_net-0.13.0> Running phase: updateAutotoolsGnuConfigScriptsPhase256pg_net-0.13.0> Running phase: configurePhase257pg_net-0.13.0> no configure script, doing nothing258pg_net-0.13.0> Running phase: buildPhase259pg_net-0.13.0> gcc -Wall -Wmissing-prototypes -Wpointer-arith -Wdeclaration-after-statement -Werror=vla -Wendif-labels -Wmissing-format-attribute -Wimplicit-fallthrough=3 -Wcast-function-type -Wformat-security -fno-strict-aliasing -fwrapv -fexcess-precision=standard -Wno-deprecated-non-prototype -Wno-format-truncation -Wno-stringop-truncation -g -O2 -std=gnu17 -std=c11 -Werror -Wno-declaration-after-statement -fPIC  -DEXTVERSION=\"0.13.0\" -I. -I./ -I/nix/store/48l45fvi99n90x6p9i4cs1lmzby6cb73-postgresql-15.19/include/server -I/nix/store/48l45fvi99n90x6p9i4cs1lmzby6cb73-postgresql-15.19/include/internal -D_GNU_SOURCE  -I/nix/store/p17klc3qq4nl9ihfwqfpi8cnqvcf92xz-libxml2-2.15.1-dev/include/libxml2 -I/nix/store/mglbi4dy4kpx7v1dcgf6iincp5x38hsc-lz4-1.10.0-dev/include -I/nix/store/g41q9md9rdcr3lkydi6f8zd6fza3h1q4-zstd-1.5.7-dev/include -I/nix/store/n2vnr7ycfk6midbzxcwd28qj3bgb50cz-icu4c-75.1-dev/include  -c -o src/worker.o src/worker.c260pg_net-0.13.0> gcc -Wall -Wmissing-prototypes -Wpointer-arith -Wdeclaration-after-statement -Werror=vla -Wendif-labels -Wmissing-format-attribute -Wimplicit-fallthrough=3 -Wcast-function-type -Wformat-security -fno-strict-aliasing -fwrapv -fexcess-precision=standard -Wno-deprecated-non-prototype -Wno-format-truncation -Wno-stringop-truncation -g -O2 -std=gnu17 -std=c11 -Werror -Wno-declaration-after-statement -fPIC  -DEXTVERSION=\"0.13.0\" -I. -I./ -I/nix/store/48l45fvi99n90x6p9i4cs1lmzby6cb73-postgresql-15.19/include/server -I/nix/store/48l45fvi99n90x6p9i4cs1lmzby6cb73-postgresql-15.19/include/internal -D_GNU_SOURCE  -I/nix/store/p17klc3qq4nl9ihfwqfpi8cnqvcf92xz-libxml2-2.15.1-dev/include/libxml2 -I/nix/store/mglbi4dy4kpx7v1dcgf6iincp5x38hsc-lz4-1.10.0-dev/include -I/nix/store/g41q9md9rdcr3lkydi6f8zd6fza3h1q4-zstd-1.5.7-dev/include -I/nix/store/n2vnr7ycfk6midbzxcwd28qj3bgb50cz-icu4c-75.1-dev/include  -c -o src/util.o src/util.c261pg_net-0.13.0> gcc -Wall -Wmissing-prototypes -Wpointer-arith -Wdeclaration-after-statement -Werror=vla -Wendif-labels -Wmissing-format-attribute -Wimplicit-fallthrough=3 -Wcast-function-type -Wformat-security -fno-strict-aliasing -fwrapv -fexcess-precision=standard -Wno-deprecated-non-prototype -Wno-format-truncation -Wno-stringop-truncation -g -O2 -std=gnu17 -std=c11 -Werror -Wno-declaration-after-statement -fPIC  -DEXTVERSION=\"0.13.0\" -I. -I./ -I/nix/store/48l45fvi99n90x6p9i4cs1lmzby6cb73-postgresql-15.19/include/server -I/nix/store/48l45fvi99n90x6p9i4cs1lmzby6cb73-postgresql-15.19/include/internal -D_GNU_SOURCE  -I/nix/store/p17klc3qq4nl9ihfwqfpi8cnqvcf92xz-libxml2-2.15.1-dev/include/libxml2 -I/nix/store/mglbi4dy4kpx7v1dcgf6iincp5x38hsc-lz4-1.10.0-dev/include -I/nix/store/g41q9md9rdcr3lkydi6f8zd6fza3h1q4-zstd-1.5.7-dev/include -I/nix/store/n2vnr7ycfk6midbzxcwd28qj3bgb50cz-icu4c-75.1-dev/include  -c -o src/core.o src/core.c262pg_net-0.13.0> In file included from src/core.c:23:263pg_net-0.13.0> In function 'init_curl_handle',264pg_net-0.13.0>     inlined from 'consume_request_queue' at src/core.c:273:5:265pg_net-0.13.0> src/util.h:6:11: warning: call to 'Wcurl_easy_setopt_err_long' declared with attribute warning: curl_easy_setopt expects a long argument [-Wattribute-warning]266pg_net-0.13.0>     6 |       if (curl_easy_setopt(hdl, opt, prm) != CURLE_OK) \267pg_net-0.13.0>       |           ^~~~~~~~~~~~~~~~268pg_net-0.13.0> src/core.c:94:7: note: in expansion of macro 'CURL_EZ_SETOPT'269pg_net-0.13.0>    94 |       CURL_EZ_SETOPT(curl_ez_handle, CURLOPT_POST, 1);270pg_net-0.13.0>       |       ^~~~~~~~~~~~~~271pg_net-0.13.0> src/util.h:6:11: warning: call to 'Wcurl_easy_setopt_err_long' declared with attribute warning: curl_easy_setopt expects a long argument [-Wattribute-warning]272pg_net-0.13.0>     6 |       if (curl_easy_setopt(hdl, opt, prm) != CURLE_OK) \273pg_net-0.13.0>       |           ^~~~~~~~~~~~~~~~274pg_net-0.13.0> src/core.c:95:7: note: in expansion of macro 'CURL_EZ_SETOPT'275pg_net-0.13.0>    95 |       CURL_EZ_SETOPT(curl_ez_handle, CURLOPT_POSTFIELDSIZE, 0);276pg_net-0.13.0>       |       ^~~~~~~~~~~~~~277pg_net-0.13.0> src/util.h:6:11: warning: call to 'Wcurl_easy_setopt_err_long' declared with attribute warning: curl_easy_setopt expects a long argument [-Wattribute-warning]278pg_net-0.13.0>     6 |       if (curl_easy_setopt(hdl, opt, prm) != CURLE_OK) \279pg_net-0.13.0>       |           ^~~~~~~~~~~~~~~~280pg_net-0.13.0> src/core.c:108:3: note: in expansion of macro 'CURL_EZ_SETOPT'281pg_net-0.13.0>   108 |   CURL_EZ_SETOPT(curl_ez_handle, CURLOPT_TIMEOUT_MS, timeout_milliseconds);282pg_net-0.13.0>       |   ^~~~~~~~~~~~~~283pg_net-0.13.0> src/util.h:6:11: warning: call to 'Wcurl_easy_setopt_err_long' declared with attribute warning: curl_easy_setopt expects a long argument [-Wattribute-warning]284pg_net-0.13.0>     6 |       if (curl_easy_setopt(hdl, opt, prm) != CURLE_OK) \285pg_net-0.13.0>       |           ^~~~~~~~~~~~~~~~286pg_net-0.13.0> src/core.c:110:3: note: in expansion of macro 'CURL_EZ_SETOPT'287pg_net-0.13.0>   110 |   CURL_EZ_SETOPT(curl_ez_handle, CURLOPT_FOLLOWLOCATION, true);288pg_net-0.13.0>       |   ^~~~~~~~~~~~~~289pg_net-0.13.0> gcc -Wall -Wmissing-prototypes -Wpointer-arith -Wdeclaration-after-statement -Werror=vla -Wendif-labels -Wmissing-format-attribute -Wimplicit-fallthrough=3 -Wcast-function-type -Wformat-security -fno-strict-aliasing -fwrapv -fexcess-precision=standard -Wno-deprecated-non-prototype -Wno-format-truncation -Wno-stringop-truncation -g -O2 -std=gnu17 -std=c11 -Werror -Wno-declaration-after-statement -fPIC  -DEXTVERSION=\"0.13.0\" -I. -I./ -I/nix/store/48l45fvi99n90x6p9i4cs1lmzby6cb73-postgresql-15.19/include/server -I/nix/store/48l45fvi99n90x6p9i4cs1lmzby6cb73-postgresql-15.19/include/internal -D_GNU_SOURCE  -I/nix/store/p17klc3qq4nl9ihfwqfpi8cnqvcf92xz-libxml2-2.15.1-dev/include/libxml2 -I/nix/store/mglbi4dy4kpx7v1dcgf6iincp5x38hsc-lz4-1.10.0-dev/include -I/nix/store/g41q9md9rdcr3lkydi6f8zd6fza3h1q4-zstd-1.5.7-dev/include -I/nix/store/n2vnr7ycfk6midbzxcwd28qj3bgb50cz-icu4c-75.1-dev/include  -c -o src/event.o src/event.c290pg_net-0.13.0> In file included from /nix/store/jviasb44hibgh09829gbmbssbz2jjnhz-curl-8.17.0-dev/include/curl/curl.h:3333,291pg_net-0.13.0>                  from /nix/store/jviasb44hibgh09829gbmbssbz2jjnhz-curl-8.17.0-dev/include/curl/multi.h:51,292pg_net-0.13.0>                  from src/event.h:4,293pg_net-0.13.0>                  from src/event.c:6:294pg_net-0.13.0> /nix/store/jviasb44hibgh09829gbmbssbz2jjnhz-curl-8.17.0-dev/include/curl/multi.h:429:23: error: expected identifier or '(' before '__extension__'295pg_net-0.13.0>   429 | CURL_EXTERN CURLMcode curl_multi_setopt(CURLM *multi_handle,296pg_net-0.13.0>       |                       ^~~~~~~~~~~~~~~~~297pg_net-0.13.0> /nix/store/jviasb44hibgh09829gbmbssbz2jjnhz-curl-8.17.0-dev/include/curl/multi.h:429:23: error: expected identifier or '(' before ')' token298pg_net-0.13.0>   429 | CURL_EXTERN CURLMcode curl_multi_setopt(CURLM *multi_handle,299pg_net-0.13.0>       |                       ^~~~~~~~~~~~~~~~~300pg_net-0.13.0> make: *** [<builtin>: src/event.o] Error 1301error: build of '/nix/store/0n0iaya9csx9by2pimrx1yglzw8dp4zs-pg_net-0.13.0.drv' on 'ssh-ng://nixbot-remote-build@78.232.36.247' failed: Cannot build '/nix/store/0n0iaya9csx9by2pimrx1yglzw8dp4zs-pg_net-0.13.0.drv'.302       Reason: builder failed with exit code 2.303       Output paths:304         /nix/store/14dkr1mhbrh869r2k75r03ngw6q7c4ma-pg_net-0.13.0305       Last 25 log lines:306       >       |       ^~~~~~~~~~~~~~307       > src/util.h:6:11: warning: call to 'Wcurl_easy_setopt_err_long' declared with attribute warning: curl_easy_setopt expects a long argument [-Wattribute-warning]308       >     6 |       if (curl_easy_setopt(hdl, opt, prm) != CURLE_OK) \309       >       |           ^~~~~~~~~~~~~~~~310       > src/core.c:108:3: note: in expansion of macro 'CURL_EZ_SETOPT'311       >   108 |   CURL_EZ_SETOPT(curl_ez_handle, CURLOPT_TIMEOUT_MS, timeout_milliseconds);312       >       |   ^~~~~~~~~~~~~~313       > src/util.h:6:11: warning: call to 'Wcurl_easy_setopt_err_long' declared with attribute warning: curl_easy_setopt expects a long argument [-Wattribute-warning]314       >     6 |       if (curl_easy_setopt(hdl, opt, prm) != CURLE_OK) \315       >       |           ^~~~~~~~~~~~~~~~316       > src/core.c:110:3: note: in expansion of macro 'CURL_EZ_SETOPT'317       >   110 |   CURL_EZ_SETOPT(curl_ez_handle, CURLOPT_FOLLOWLOCATION, true);318       >       |   ^~~~~~~~~~~~~~319       > gcc -Wall -Wmissing-prototypes -Wpointer-arith -Wdeclaration-after-statement -Werror=vla -Wendif-labels -Wmissing-format-attribute -Wimplicit-fallthrough=3 -Wcast-function-type -Wformat-security -fno-strict-aliasing -fwrapv -fexcess-precision=standard -Wno-deprecated-non-prototype -Wno-format-truncation -Wno-stringop-truncation -g -O2 -std=gnu17 -std=c11 -Werror -Wno-declaration-after-statement -fPIC  -DEXTVERSION=\"0.13.0\" -I. -I./ -I/nix/store/48l45fvi99n90x6p9i4cs1lmzby6cb73-postgresql-15.19/include/server -I/nix/store/48l45fvi99n90x6p9i4cs1lmzby6cb73-postgresql-15.19/include/internal -D_GNU_SOURCE  -I/nix/store/p17klc3qq4nl9ihfwqfpi8cnqvcf92xz-libxml2-2.15.1-dev/include/libxml2 -I/nix/store/mglbi4dy4kpx7v1dcgf6iincp5x38hsc-lz4-1.10.0-dev/include -I/nix/store/g41q9md9rdcr3lkydi6f8zd6fza3h1q4-zstd-1.5.7-dev/include -I/nix/store/n2vnr7ycfk6midbzxcwd28qj3bgb50cz-icu4c-75.1-dev/include  -c -o src/event.o src/event.c320       > In file included from /nix/store/jviasb44hibgh09829gbmbssbz2jjnhz-curl-8.17.0-dev/include/curl/curl.h:3333,321       >                  from /nix/store/jviasb44hibgh09829gbmbssbz2jjnhz-curl-8.17.0-dev/include/curl/multi.h:51,322       >                  from src/event.h:4,323       >                  from src/event.c:6:324       > /nix/store/jviasb44hibgh09829gbmbssbz2jjnhz-curl-8.17.0-dev/include/curl/multi.h:429:23: error: expected identifier or '(' before '__extension__'325       >   429 | CURL_EXTERN CURLMcode curl_multi_setopt(CURLM *multi_handle,326       >       |                       ^~~~~~~~~~~~~~~~~327       > /nix/store/jviasb44hibgh09829gbmbssbz2jjnhz-curl-8.17.0-dev/include/curl/multi.h:429:23: error: expected identifier or '(' before ')' token328       >   429 | CURL_EXTERN CURLMcode curl_multi_setopt(CURLM *multi_handle,329       >       |                       ^~~~~~~~~~~~~~~~~330       > make: *** [<builtin>: src/event.o] Error 1331       For full logs, run:332         nix log /nix/store/0n0iaya9csx9by2pimrx1yglzw8dp4zs-pg_net-0.13.0.drv333error: Cannot build '/nix/store/0n0iaya9csx9by2pimrx1yglzw8dp4zs-pg_net-0.13.0.drv'.334       Reason: builder failed with exit code 1.335       Output paths:336         /nix/store/14dkr1mhbrh869r2k75r03ngw6q7c4ma-pg_net-0.13.0337building '/nix/store/g6nfp5n056kw2jvfzldzxrrrxfpfcka0-pg_net-0.13.0.drv' on 'ssh-ng://nixbot-remote-build@78.232.36.247'338building '/nix/store/g6nfp5n056kw2jvfzldzxrrrxfpfcka0-pg_net-0.13.0.drv'339pg_net-0.13.0> Running phase: unpackPhase340pg_net-0.13.0> unpacking source archive /nix/store/bxdzbzjn4yi7ch55dlcgzk6npzx2p4jz-source341pg_net-0.13.0> source root is source342pg_net-0.13.0> Running phase: patchPhase343pg_net-0.13.0> Running phase: updateAutotoolsGnuConfigScriptsPhase344pg_net-0.13.0> Running phase: configurePhase345pg_net-0.13.0> no configure script, doing nothing346pg_net-0.13.0> Running phase: buildPhase347pg_net-0.13.0> gcc -Wall -Wmissing-prototypes -Wpointer-arith -Wdeclaration-after-statement -Werror=vla -Wendif-labels -Wmissing-format-attribute -Wimplicit-fallthrough=3 -Wcast-function-type -Wshadow=compatible-local -Wformat-security -fno-strict-aliasing -fwrapv -fexcess-precision=standard -Wno-format-truncation -Wno-stringop-truncation -g -O2 -std=c11 -Werror -Wno-declaration-after-statement -fPIC -fvisibility=hidden  -DEXTVERSION=\"0.13.0\" -I. -I./ -I/nix/store/9q4p23a2y63xn8safzzn6lbn07bnkshs-postgresql-17.11/include/server -I/nix/store/9q4p23a2y63xn8safzzn6lbn07bnkshs-postgresql-17.11/include/internal -D_GNU_SOURCE  -I/nix/store/p17klc3qq4nl9ihfwqfpi8cnqvcf92xz-libxml2-2.15.1-dev/include/libxml2 -I/nix/store/mglbi4dy4kpx7v1dcgf6iincp5x38hsc-lz4-1.10.0-dev/include -I/nix/store/g41q9md9rdcr3lkydi6f8zd6fza3h1q4-zstd-1.5.7-dev/include -I/nix/store/n2vnr7ycfk6midbzxcwd28qj3bgb50cz-icu4c-75.1-dev/include  -c -o src/worker.o src/worker.c348pg_net-0.13.0> gcc -Wall -Wmissing-prototypes -Wpointer-arith -Wdeclaration-after-statement -Werror=vla -Wendif-labels -Wmissing-format-attribute -Wimplicit-fallthrough=3 -Wcast-function-type -Wshadow=compatible-local -Wformat-security -fno-strict-aliasing -fwrapv -fexcess-precision=standard -Wno-format-truncation -Wno-stringop-truncation -g -O2 -std=c11 -Werror -Wno-declaration-after-statement -fPIC -fvisibility=hidden  -DEXTVERSION=\"0.13.0\" -I. -I./ -I/nix/store/9q4p23a2y63xn8safzzn6lbn07bnkshs-postgresql-17.11/include/server -I/nix/store/9q4p23a2y63xn8safzzn6lbn07bnkshs-postgresql-17.11/include/internal -D_GNU_SOURCE  -I/nix/store/p17klc3qq4nl9ihfwqfpi8cnqvcf92xz-libxml2-2.15.1-dev/include/libxml2 -I/nix/store/mglbi4dy4kpx7v1dcgf6iincp5x38hsc-lz4-1.10.0-dev/include -I/nix/store/g41q9md9rdcr3lkydi6f8zd6fza3h1q4-zstd-1.5.7-dev/include -I/nix/store/n2vnr7ycfk6midbzxcwd28qj3bgb50cz-icu4c-75.1-dev/include  -c -o src/util.o src/util.c349pg_net-0.13.0> gcc -Wall -Wmissing-prototypes -Wpointer-arith -Wdeclaration-after-statement -Werror=vla -Wendif-labels -Wmissing-format-attribute -Wimplicit-fallthrough=3 -Wcast-function-type -Wshadow=compatible-local -Wformat-security -fno-strict-aliasing -fwrapv -fexcess-precision=standard -Wno-format-truncation -Wno-stringop-truncation -g -O2 -std=c11 -Werror -Wno-declaration-after-statement -fPIC -fvisibility=hidden  -DEXTVERSION=\"0.13.0\" -I. -I./ -I/nix/store/9q4p23a2y63xn8safzzn6lbn07bnkshs-postgresql-17.11/include/server -I/nix/store/9q4p23a2y63xn8safzzn6lbn07bnkshs-postgresql-17.11/include/internal -D_GNU_SOURCE  -I/nix/store/p17klc3qq4nl9ihfwqfpi8cnqvcf92xz-libxml2-2.15.1-dev/include/libxml2 -I/nix/store/mglbi4dy4kpx7v1dcgf6iincp5x38hsc-lz4-1.10.0-dev/include -I/nix/store/g41q9md9rdcr3lkydi6f8zd6fza3h1q4-zstd-1.5.7-dev/include -I/nix/store/n2vnr7ycfk6midbzxcwd28qj3bgb50cz-icu4c-75.1-dev/include  -c -o src/core.o src/core.c350pg_net-0.13.0> In file included from src/core.c:23:351pg_net-0.13.0> In function 'init_curl_handle',352pg_net-0.13.0>     inlined from 'consume_request_queue' at src/core.c:273:5:353pg_net-0.13.0> src/util.h:6:11: warning: call to 'Wcurl_easy_setopt_err_long' declared with attribute warning: curl_easy_setopt expects a long argument [-Wattribute-warning]354pg_net-0.13.0>     6 |       if (curl_easy_setopt(hdl, opt, prm) != CURLE_OK) \355pg_net-0.13.0>       |           ^~~~~~~~~~~~~~~~356pg_net-0.13.0> src/core.c:94:7: note: in expansion of macro 'CURL_EZ_SETOPT'357pg_net-0.13.0>    94 |       CURL_EZ_SETOPT(curl_ez_handle, CURLOPT_POST, 1);358pg_net-0.13.0>       |       ^~~~~~~~~~~~~~359pg_net-0.13.0> src/util.h:6:11: warning: call to 'Wcurl_easy_setopt_err_long' declared with attribute warning: curl_easy_setopt expects a long argument [-Wattribute-warning]360pg_net-0.13.0>     6 |       if (curl_easy_setopt(hdl, opt, prm) != CURLE_OK) \361pg_net-0.13.0>       |           ^~~~~~~~~~~~~~~~362pg_net-0.13.0> src/core.c:95:7: note: in expansion of macro 'CURL_EZ_SETOPT'363pg_net-0.13.0>    95 |       CURL_EZ_SETOPT(curl_ez_handle, CURLOPT_POSTFIELDSIZE, 0);364pg_net-0.13.0>       |       ^~~~~~~~~~~~~~365pg_net-0.13.0> src/util.h:6:11: warning: call to 'Wcurl_easy_setopt_err_long' declared with attribute warning: curl_easy_setopt expects a long argument [-Wattribute-warning]366pg_net-0.13.0>     6 |       if (curl_easy_setopt(hdl, opt, prm) != CURLE_OK) \367pg_net-0.13.0>       |           ^~~~~~~~~~~~~~~~368pg_net-0.13.0> src/core.c:108:3: note: in expansion of macro 'CURL_EZ_SETOPT'369pg_net-0.13.0>   108 |   CURL_EZ_SETOPT(curl_ez_handle, CURLOPT_TIMEOUT_MS, timeout_milliseconds);370pg_net-0.13.0>       |   ^~~~~~~~~~~~~~371pg_net-0.13.0> src/util.h:6:11: warning: call to 'Wcurl_easy_setopt_err_long' declared with attribute warning: curl_easy_setopt expects a long argument [-Wattribute-warning]372pg_net-0.13.0>     6 |       if (curl_easy_setopt(hdl, opt, prm) != CURLE_OK) \373pg_net-0.13.0>       |           ^~~~~~~~~~~~~~~~374pg_net-0.13.0> src/core.c:110:3: note: in expansion of macro 'CURL_EZ_SETOPT'375pg_net-0.13.0>   110 |   CURL_EZ_SETOPT(curl_ez_handle, CURLOPT_FOLLOWLOCATION, true);376pg_net-0.13.0>       |   ^~~~~~~~~~~~~~377pg_net-0.13.0> gcc -Wall -Wmissing-prototypes -Wpointer-arith -Wdeclaration-after-statement -Werror=vla -Wendif-labels -Wmissing-format-attribute -Wimplicit-fallthrough=3 -Wcast-function-type -Wshadow=compatible-local -Wformat-security -fno-strict-aliasing -fwrapv -fexcess-precision=standard -Wno-format-truncation -Wno-stringop-truncation -g -O2 -std=c11 -Werror -Wno-declaration-after-statement -fPIC -fvisibility=hidden  -DEXTVERSION=\"0.13.0\" -I. -I./ -I/nix/store/9q4p23a2y63xn8safzzn6lbn07bnkshs-postgresql-17.11/include/server -I/nix/store/9q4p23a2y63xn8safzzn6lbn07bnkshs-postgresql-17.11/include/internal -D_GNU_SOURCE  -I/nix/store/p17klc3qq4nl9ihfwqfpi8cnqvcf92xz-libxml2-2.15.1-dev/include/libxml2 -I/nix/store/mglbi4dy4kpx7v1dcgf6iincp5x38hsc-lz4-1.10.0-dev/include -I/nix/store/g41q9md9rdcr3lkydi6f8zd6fza3h1q4-zstd-1.5.7-dev/include -I/nix/store/n2vnr7ycfk6midbzxcwd28qj3bgb50cz-icu4c-75.1-dev/include  -c -o src/event.o src/event.c378pg_net-0.13.0> In file included from /nix/store/jviasb44hibgh09829gbmbssbz2jjnhz-curl-8.17.0-dev/include/curl/curl.h:3333,379pg_net-0.13.0>                  from /nix/store/jviasb44hibgh09829gbmbssbz2jjnhz-curl-8.17.0-dev/include/curl/multi.h:51,380pg_net-0.13.0>                  from src/event.h:4,381pg_net-0.13.0>                  from src/event.c:6:382pg_net-0.13.0> /nix/store/jviasb44hibgh09829gbmbssbz2jjnhz-curl-8.17.0-dev/include/curl/multi.h:429:23: error: expected identifier or '(' before '__extension__'383pg_net-0.13.0>   429 | CURL_EXTERN CURLMcode curl_multi_setopt(CURLM *multi_handle,384pg_net-0.13.0>       |                       ^~~~~~~~~~~~~~~~~385pg_net-0.13.0> /nix/store/jviasb44hibgh09829gbmbssbz2jjnhz-curl-8.17.0-dev/include/curl/multi.h:429:23: error: expected identifier or '(' before ')' token386pg_net-0.13.0>   429 | CURL_EXTERN CURLMcode curl_multi_setopt(CURLM *multi_handle,387pg_net-0.13.0>       |                       ^~~~~~~~~~~~~~~~~388pg_net-0.13.0> make: *** [<builtin>: src/event.o] Error 1389error: build of '/nix/store/g6nfp5n056kw2jvfzldzxrrrxfpfcka0-pg_net-0.13.0.drv' on 'ssh-ng://nixbot-remote-build@78.232.36.247' failed: Cannot build '/nix/store/g6nfp5n056kw2jvfzldzxrrrxfpfcka0-pg_net-0.13.0.drv'.390       Reason: builder failed with exit code 2.391       Output paths:392         /nix/store/0z6qc5i8vhckm5s9j7br24f5kfxsgds5-pg_net-0.13.0393       Last 25 log lines:394       >       |       ^~~~~~~~~~~~~~395       > src/util.h:6:11: warning: call to 'Wcurl_easy_setopt_err_long' declared with attribute warning: curl_easy_setopt expects a long argument [-Wattribute-warning]396       >     6 |       if (curl_easy_setopt(hdl, opt, prm) != CURLE_OK) \397       >       |           ^~~~~~~~~~~~~~~~398       > src/core.c:108:3: note: in expansion of macro 'CURL_EZ_SETOPT'399       >   108 |   CURL_EZ_SETOPT(curl_ez_handle, CURLOPT_TIMEOUT_MS, timeout_milliseconds);400       >       |   ^~~~~~~~~~~~~~401       > src/util.h:6:11: warning: call to 'Wcurl_easy_setopt_err_long' declared with attribute warning: curl_easy_setopt expects a long argument [-Wattribute-warning]402       >     6 |       if (curl_easy_setopt(hdl, opt, prm) != CURLE_OK) \403       >       |           ^~~~~~~~~~~~~~~~404       > src/core.c:110:3: note: in expansion of macro 'CURL_EZ_SETOPT'405       >   110 |   CURL_EZ_SETOPT(curl_ez_handle, CURLOPT_FOLLOWLOCATION, true);406       >       |   ^~~~~~~~~~~~~~407       > gcc -Wall -Wmissing-prototypes -Wpointer-arith -Wdeclaration-after-statement -Werror=vla -Wendif-labels -Wmissing-format-attribute -Wimplicit-fallthrough=3 -Wcast-function-type -Wshadow=compatible-local -Wformat-security -fno-strict-aliasing -fwrapv -fexcess-precision=standard -Wno-format-truncation -Wno-stringop-truncation -g -O2 -std=c11 -Werror -Wno-declaration-after-statement -fPIC -fvisibility=hidden  -DEXTVERSION=\"0.13.0\" -I. -I./ -I/nix/store/9q4p23a2y63xn8safzzn6lbn07bnkshs-postgresql-17.11/include/server -I/nix/store/9q4p23a2y63xn8safzzn6lbn07bnkshs-postgresql-17.11/include/internal -D_GNU_SOURCE  -I/nix/store/p17klc3qq4nl9ihfwqfpi8cnqvcf92xz-libxml2-2.15.1-dev/include/libxml2 -I/nix/store/mglbi4dy4kpx7v1dcgf6iincp5x38hsc-lz4-1.10.0-dev/include -I/nix/store/g41q9md9rdcr3lkydi6f8zd6fza3h1q4-zstd-1.5.7-dev/include -I/nix/store/n2vnr7ycfk6midbzxcwd28qj3bgb50cz-icu4c-75.1-dev/include  -c -o src/event.o src/event.c408       > In file included from /nix/store/jviasb44hibgh09829gbmbssbz2jjnhz-curl-8.17.0-dev/include/curl/curl.h:3333,409       >                  from /nix/store/jviasb44hibgh09829gbmbssbz2jjnhz-curl-8.17.0-dev/include/curl/multi.h:51,410       >                  from src/event.h:4,411       >                  from src/event.c:6:412       > /nix/store/jviasb44hibgh09829gbmbssbz2jjnhz-curl-8.17.0-dev/include/curl/multi.h:429:23: error: expected identifier or '(' before '__extension__'413       >   429 | CURL_EXTERN CURLMcode curl_multi_setopt(CURLM *multi_handle,414       >       |                       ^~~~~~~~~~~~~~~~~415       > /nix/store/jviasb44hibgh09829gbmbssbz2jjnhz-curl-8.17.0-dev/include/curl/multi.h:429:23: error: expected identifier or '(' before ')' token416       >   429 | CURL_EXTERN CURLMcode curl_multi_setopt(CURLM *multi_handle,417       >       |                       ^~~~~~~~~~~~~~~~~418       > make: *** [<builtin>: src/event.o] Error 1419       For full logs, run:420         nix log /nix/store/g6nfp5n056kw2jvfzldzxrrrxfpfcka0-pg_net-0.13.0.drv421error: Cannot build '/nix/store/g6nfp5n056kw2jvfzldzxrrrxfpfcka0-pg_net-0.13.0.drv'.422       Reason: builder failed with exit code 1.423       Output paths:424         /nix/store/0z6qc5i8vhckm5s9j7br24f5kfxsgds5-pg_net-0.13.0425building '/nix/store/lbqp8bfrqa2xm82ma6wyq1gijyajh6kh-pg_net-0.13.0.drv' on 'ssh-ng://nixbot-remote-build@78.232.36.247'426building '/nix/store/lbqp8bfrqa2xm82ma6wyq1gijyajh6kh-pg_net-0.13.0.drv'427pg_net-0.13.0> Running phase: unpackPhase428pg_net-0.13.0> unpacking source archive /nix/store/bxdzbzjn4yi7ch55dlcgzk6npzx2p4jz-source429pg_net-0.13.0> source root is source430pg_net-0.13.0> Running phase: patchPhase431pg_net-0.13.0> Running phase: updateAutotoolsGnuConfigScriptsPhase432pg_net-0.13.0> Running phase: configurePhase433pg_net-0.13.0> no configure script, doing nothing434pg_net-0.13.0> Running phase: buildPhase435pg_net-0.13.0> gcc -Wall -Wmissing-prototypes -Wpointer-arith -Wdeclaration-after-statement -Werror=vla -Wendif-labels -Wmissing-format-attribute -Wimplicit-fallthrough=3 -Wcast-function-type -Wshadow=compatible-local -Wformat-security -fno-strict-aliasing -fwrapv -fexcess-precision=standard -Wno-format-truncation -Wno-stringop-truncation -moutline-atomics -g -O2 -std=c11 -Werror -Wno-declaration-after-statement -fPIC -fvisibility=hidden  -DEXTVERSION=\"0.13.0\" -I. -I./ -I/nix/store/wq2kfr0rkb0hdmf1iwi3mi8pxycakzmq-postgresql-17_22/include/server -I/nix/store/wq2kfr0rkb0hdmf1iwi3mi8pxycakzmq-postgresql-17_22/include/internal -D_GNU_SOURCE  -I/nix/store/p17klc3qq4nl9ihfwqfpi8cnqvcf92xz-libxml2-2.15.1-dev/include/libxml2 -I/nix/store/mglbi4dy4kpx7v1dcgf6iincp5x38hsc-lz4-1.10.0-dev/include -I/nix/store/g41q9md9rdcr3lkydi6f8zd6fza3h1q4-zstd-1.5.7-dev/include -I/nix/store/n2vnr7ycfk6midbzxcwd28qj3bgb50cz-icu4c-75.1-dev/include  -c -o src/worker.o src/worker.c436pg_net-0.13.0> gcc -Wall -Wmissing-prototypes -Wpointer-arith -Wdeclaration-after-statement -Werror=vla -Wendif-labels -Wmissing-format-attribute -Wimplicit-fallthrough=3 -Wcast-function-type -Wshadow=compatible-local -Wformat-security -fno-strict-aliasing -fwrapv -fexcess-precision=standard -Wno-format-truncation -Wno-stringop-truncation -moutline-atomics -g -O2 -std=c11 -Werror -Wno-declaration-after-statement -fPIC -fvisibility=hidden  -DEXTVERSION=\"0.13.0\" -I. -I./ -I/nix/store/wq2kfr0rkb0hdmf1iwi3mi8pxycakzmq-postgresql-17_22/include/server -I/nix/store/wq2kfr0rkb0hdmf1iwi3mi8pxycakzmq-postgresql-17_22/include/internal -D_GNU_SOURCE  -I/nix/store/p17klc3qq4nl9ihfwqfpi8cnqvcf92xz-libxml2-2.15.1-dev/include/libxml2 -I/nix/store/mglbi4dy4kpx7v1dcgf6iincp5x38hsc-lz4-1.10.0-dev/include -I/nix/store/g41q9md9rdcr3lkydi6f8zd6fza3h1q4-zstd-1.5.7-dev/include -I/nix/store/n2vnr7ycfk6midbzxcwd28qj3bgb50cz-icu4c-75.1-dev/include  -c -o src/util.o src/util.c437pg_net-0.13.0> gcc -Wall -Wmissing-prototypes -Wpointer-arith -Wdeclaration-after-statement -Werror=vla -Wendif-labels -Wmissing-format-attribute -Wimplicit-fallthrough=3 -Wcast-function-type -Wshadow=compatible-local -Wformat-security -fno-strict-aliasing -fwrapv -fexcess-precision=standard -Wno-format-truncation -Wno-stringop-truncation -moutline-atomics -g -O2 -std=c11 -Werror -Wno-declaration-after-statement -fPIC -fvisibility=hidden  -DEXTVERSION=\"0.13.0\" -I. -I./ -I/nix/store/wq2kfr0rkb0hdmf1iwi3mi8pxycakzmq-postgresql-17_22/include/server -I/nix/store/wq2kfr0rkb0hdmf1iwi3mi8pxycakzmq-postgresql-17_22/include/internal -D_GNU_SOURCE  -I/nix/store/p17klc3qq4nl9ihfwqfpi8cnqvcf92xz-libxml2-2.15.1-dev/include/libxml2 -I/nix/store/mglbi4dy4kpx7v1dcgf6iincp5x38hsc-lz4-1.10.0-dev/include -I/nix/store/g41q9md9rdcr3lkydi6f8zd6fza3h1q4-zstd-1.5.7-dev/include -I/nix/store/n2vnr7ycfk6midbzxcwd28qj3bgb50cz-icu4c-75.1-dev/include  -c -o src/core.o src/core.c438pg_net-0.13.0> In file included from src/core.c:23:439pg_net-0.13.0> In function 'init_curl_handle',440pg_net-0.13.0>     inlined from 'consume_request_queue' at src/core.c:273:5:441pg_net-0.13.0> src/util.h:6:11: warning: call to 'Wcurl_easy_setopt_err_long' declared with attribute warning: curl_easy_setopt expects a long argument [-Wattribute-warning]442pg_net-0.13.0>     6 |       if (curl_easy_setopt(hdl, opt, prm) != CURLE_OK) \443pg_net-0.13.0>       |           ^~~~~~~~~~~~~~~~444pg_net-0.13.0> src/core.c:94:7: note: in expansion of macro 'CURL_EZ_SETOPT'445pg_net-0.13.0>    94 |       CURL_EZ_SETOPT(curl_ez_handle, CURLOPT_POST, 1);446pg_net-0.13.0>       |       ^~~~~~~~~~~~~~447pg_net-0.13.0> src/util.h:6:11: warning: call to 'Wcurl_easy_setopt_err_long' declared with attribute warning: curl_easy_setopt expects a long argument [-Wattribute-warning]448pg_net-0.13.0>     6 |       if (curl_easy_setopt(hdl, opt, prm) != CURLE_OK) \449pg_net-0.13.0>       |           ^~~~~~~~~~~~~~~~450pg_net-0.13.0> src/core.c:95:7: note: in expansion of macro 'CURL_EZ_SETOPT'451pg_net-0.13.0>    95 |       CURL_EZ_SETOPT(curl_ez_handle, CURLOPT_POSTFIELDSIZE, 0);452pg_net-0.13.0>       |       ^~~~~~~~~~~~~~453pg_net-0.13.0> src/util.h:6:11: warning: call to 'Wcurl_easy_setopt_err_long' declared with attribute warning: curl_easy_setopt expects a long argument [-Wattribute-warning]454pg_net-0.13.0>     6 |       if (curl_easy_setopt(hdl, opt, prm) != CURLE_OK) \455pg_net-0.13.0>       |           ^~~~~~~~~~~~~~~~456pg_net-0.13.0> src/core.c:108:3: note: in expansion of macro 'CURL_EZ_SETOPT'457pg_net-0.13.0>   108 |   CURL_EZ_SETOPT(curl_ez_handle, CURLOPT_TIMEOUT_MS, timeout_milliseconds);458pg_net-0.13.0>       |   ^~~~~~~~~~~~~~459pg_net-0.13.0> src/util.h:6:11: warning: call to 'Wcurl_easy_setopt_err_long' declared with attribute warning: curl_easy_setopt expects a long argument [-Wattribute-warning]460pg_net-0.13.0>     6 |       if (curl_easy_setopt(hdl, opt, prm) != CURLE_OK) \461pg_net-0.13.0>       |           ^~~~~~~~~~~~~~~~462pg_net-0.13.0> src/core.c:110:3: note: in expansion of macro 'CURL_EZ_SETOPT'463pg_net-0.13.0>   110 |   CURL_EZ_SETOPT(curl_ez_handle, CURLOPT_FOLLOWLOCATION, true);464pg_net-0.13.0>       |   ^~~~~~~~~~~~~~465pg_net-0.13.0> gcc -Wall -Wmissing-prototypes -Wpointer-arith -Wdeclaration-after-statement -Werror=vla -Wendif-labels -Wmissing-format-attribute -Wimplicit-fallthrough=3 -Wcast-function-type -Wshadow=compatible-local -Wformat-security -fno-strict-aliasing -fwrapv -fexcess-precision=standard -Wno-format-truncation -Wno-stringop-truncation -moutline-atomics -g -O2 -std=c11 -Werror -Wno-declaration-after-statement -fPIC -fvisibility=hidden  -DEXTVERSION=\"0.13.0\" -I. -I./ -I/nix/store/wq2kfr0rkb0hdmf1iwi3mi8pxycakzmq-postgresql-17_22/include/server -I/nix/store/wq2kfr0rkb0hdmf1iwi3mi8pxycakzmq-postgresql-17_22/include/internal -D_GNU_SOURCE  -I/nix/store/p17klc3qq4nl9ihfwqfpi8cnqvcf92xz-libxml2-2.15.1-dev/include/libxml2 -I/nix/store/mglbi4dy4kpx7v1dcgf6iincp5x38hsc-lz4-1.10.0-dev/include -I/nix/store/g41q9md9rdcr3lkydi6f8zd6fza3h1q4-zstd-1.5.7-dev/include -I/nix/store/n2vnr7ycfk6midbzxcwd28qj3bgb50cz-icu4c-75.1-dev/include  -c -o src/event.o src/event.c466pg_net-0.13.0> In file included from /nix/store/jviasb44hibgh09829gbmbssbz2jjnhz-curl-8.17.0-dev/include/curl/curl.h:3333,467pg_net-0.13.0>                  from /nix/store/jviasb44hibgh09829gbmbssbz2jjnhz-curl-8.17.0-dev/include/curl/multi.h:51,468pg_net-0.13.0>                  from src/event.h:4,469pg_net-0.13.0>                  from src/event.c:6:470pg_net-0.13.0> /nix/store/jviasb44hibgh09829gbmbssbz2jjnhz-curl-8.17.0-dev/include/curl/multi.h:429:23: error: expected identifier or '(' before '__extension__'471pg_net-0.13.0>   429 | CURL_EXTERN CURLMcode curl_multi_setopt(CURLM *multi_handle,472pg_net-0.13.0>       |                       ^~~~~~~~~~~~~~~~~473pg_net-0.13.0> /nix/store/jviasb44hibgh09829gbmbssbz2jjnhz-curl-8.17.0-dev/include/curl/multi.h:429:23: error: expected identifier or '(' before ')' token474pg_net-0.13.0>   429 | CURL_EXTERN CURLMcode curl_multi_setopt(CURLM *multi_handle,475pg_net-0.13.0>       |                       ^~~~~~~~~~~~~~~~~476pg_net-0.13.0> make: *** [<builtin>: src/event.o] Error 1477error: build of '/nix/store/lbqp8bfrqa2xm82ma6wyq1gijyajh6kh-pg_net-0.13.0.drv' on 'ssh-ng://nixbot-remote-build@78.232.36.247' failed: Cannot build '/nix/store/lbqp8bfrqa2xm82ma6wyq1gijyajh6kh-pg_net-0.13.0.drv'.478       Reason: builder failed with exit code 2.479       Output paths:480         /nix/store/517wbr5c7xb4fvch9kn0zim5j3hnjzpa-pg_net-0.13.0481       Last 25 log lines:482       >       |       ^~~~~~~~~~~~~~483       > src/util.h:6:11: warning: call to 'Wcurl_easy_setopt_err_long' declared with attribute warning: curl_easy_setopt expects a long argument [-Wattribute-warning]484       >     6 |       if (curl_easy_setopt(hdl, opt, prm) != CURLE_OK) \485       >       |           ^~~~~~~~~~~~~~~~486       > src/core.c:108:3: note: in expansion of macro 'CURL_EZ_SETOPT'487       >   108 |   CURL_EZ_SETOPT(curl_ez_handle, CURLOPT_TIMEOUT_MS, timeout_milliseconds);488       >       |   ^~~~~~~~~~~~~~489       > src/util.h:6:11: warning: call to 'Wcurl_easy_setopt_err_long' declared with attribute warning: curl_easy_setopt expects a long argument [-Wattribute-warning]490       >     6 |       if (curl_easy_setopt(hdl, opt, prm) != CURLE_OK) \491       >       |           ^~~~~~~~~~~~~~~~492       > src/core.c:110:3: note: in expansion of macro 'CURL_EZ_SETOPT'493       >   110 |   CURL_EZ_SETOPT(curl_ez_handle, CURLOPT_FOLLOWLOCATION, true);494       >       |   ^~~~~~~~~~~~~~495       > gcc -Wall -Wmissing-prototypes -Wpointer-arith -Wdeclaration-after-statement -Werror=vla -Wendif-labels -Wmissing-format-attribute -Wimplicit-fallthrough=3 -Wcast-function-type -Wshadow=compatible-local -Wformat-security -fno-strict-aliasing -fwrapv -fexcess-precision=standard -Wno-format-truncation -Wno-stringop-truncation -moutline-atomics -g -O2 -std=c11 -Werror -Wno-declaration-after-statement -fPIC -fvisibility=hidden  -DEXTVERSION=\"0.13.0\" -I. -I./ -I/nix/store/wq2kfr0rkb0hdmf1iwi3mi8pxycakzmq-postgresql-17_22/include/server -I/nix/store/wq2kfr0rkb0hdmf1iwi3mi8pxycakzmq-postgresql-17_22/include/internal -D_GNU_SOURCE  -I/nix/store/p17klc3qq4nl9ihfwqfpi8cnqvcf92xz-libxml2-2.15.1-dev/include/libxml2 -I/nix/store/mglbi4dy4kpx7v1dcgf6iincp5x38hsc-lz4-1.10.0-dev/include -I/nix/store/g41q9md9rdcr3lkydi6f8zd6fza3h1q4-zstd-1.5.7-dev/include -I/nix/store/n2vnr7ycfk6midbzxcwd28qj3bgb50cz-icu4c-75.1-dev/include  -c -o src/event.o src/event.c496       > In file included from /nix/store/jviasb44hibgh09829gbmbssbz2jjnhz-curl-8.17.0-dev/include/curl/curl.h:3333,497       >                  from /nix/store/jviasb44hibgh09829gbmbssbz2jjnhz-curl-8.17.0-dev/include/curl/multi.h:51,498       >                  from src/event.h:4,499       >                  from src/event.c:6:500       > /nix/store/jviasb44hibgh09829gbmbssbz2jjnhz-curl-8.17.0-dev/include/curl/multi.h:429:23: error: expected identifier or '(' before '__extension__'501       >   429 | CURL_EXTERN CURLMcode curl_multi_setopt(CURLM *multi_handle,502       >       |                       ^~~~~~~~~~~~~~~~~503       > /nix/store/jviasb44hibgh09829gbmbssbz2jjnhz-curl-8.17.0-dev/include/curl/multi.h:429:23: error: expected identifier or '(' before ')' token504       >   429 | CURL_EXTERN CURLMcode curl_multi_setopt(CURLM *multi_handle,505       >       |                       ^~~~~~~~~~~~~~~~~506       > make: *** [<builtin>: src/event.o] Error 1507       For full logs, run:508         nix log /nix/store/lbqp8bfrqa2xm82ma6wyq1gijyajh6kh-pg_net-0.13.0.drv509error: Cannot build '/nix/store/lbqp8bfrqa2xm82ma6wyq1gijyajh6kh-pg_net-0.13.0.drv'.510       Reason: builder failed with exit code 1.511       Output paths:512         /nix/store/517wbr5c7xb4fvch9kn0zim5j3hnjzpa-pg_net-0.13.0513building '/nix/store/cfrc2vk3cgabx1447j2n7s3zxraq6395-pg_net-0.14.0.drv' on 'ssh-ng://nixbot-remote-build@78.232.36.247'514building '/nix/store/cfrc2vk3cgabx1447j2n7s3zxraq6395-pg_net-0.14.0.drv'515pg_net-0.14.0> Running phase: unpackPhase516pg_net-0.14.0> unpacking source archive /nix/store/cijlkfxy6vfh6pbq2nd4v8pc51nxn75y-source517pg_net-0.14.0> source root is source518pg_net-0.14.0> Running phase: patchPhase519pg_net-0.14.0> Running phase: updateAutotoolsGnuConfigScriptsPhase520pg_net-0.14.0> Running phase: configurePhase521pg_net-0.14.0> no configure script, doing nothing522pg_net-0.14.0> Running phase: buildPhase523pg_net-0.14.0> gcc -Wall -Wmissing-prototypes -Wpointer-arith -Wdeclaration-after-statement -Werror=vla -Wendif-labels -Wmissing-format-attribute -Wimplicit-fallthrough=3 -Wcast-function-type -Wformat-security -fno-strict-aliasing -fwrapv -fexcess-precision=standard -Wno-deprecated-non-prototype -Wno-format-truncation -Wno-stringop-truncation -g -O2 -std=gnu17 -std=c11 -Werror -Wno-declaration-after-statement -fPIC  -DEXTVERSION=\"0.14.0\" -I. -I./ -I/nix/store/48l45fvi99n90x6p9i4cs1lmzby6cb73-postgresql-15.19/include/server -I/nix/store/48l45fvi99n90x6p9i4cs1lmzby6cb73-postgresql-15.19/include/internal -D_GNU_SOURCE  -I/nix/store/p17klc3qq4nl9ihfwqfpi8cnqvcf92xz-libxml2-2.15.1-dev/include/libxml2 -I/nix/store/mglbi4dy4kpx7v1dcgf6iincp5x38hsc-lz4-1.10.0-dev/include -I/nix/store/g41q9md9rdcr3lkydi6f8zd6fza3h1q4-zstd-1.5.7-dev/include -I/nix/store/n2vnr7ycfk6midbzxcwd28qj3bgb50cz-icu4c-75.1-dev/include  -c -o src/core.o src/core.c524pg_net-0.14.0> In file included from src/core.c:23:525pg_net-0.14.0> In function 'init_curl_handle',526pg_net-0.14.0>     inlined from 'consume_request_queue' at src/core.c:306:5:527pg_net-0.14.0> src/errors.h:6:11: warning: call to 'Wcurl_easy_setopt_err_long' declared with attribute warning: curl_easy_setopt expects a long argument [-Wattribute-warning]528pg_net-0.14.0>     6 |       if (curl_easy_setopt(hdl, opt, prm) != CURLE_OK) \529pg_net-0.14.0>       |           ^~~~~~~~~~~~~~~~530pg_net-0.14.0> src/core.c:120:7: note: in expansion of macro 'EREPORT_CURL_SETOPT'531pg_net-0.14.0>   120 |       EREPORT_CURL_SETOPT(curl_ez_handle, CURLOPT_POST, 1);532pg_net-0.14.0>       |       ^~~~~~~~~~~~~~~~~~~533pg_net-0.14.0> src/errors.h:6:11: warning: call to 'Wcurl_easy_setopt_err_long' declared with attribute warning: curl_easy_setopt expects a long argument [-Wattribute-warning]534pg_net-0.14.0>     6 |       if (curl_easy_setopt(hdl, opt, prm) != CURLE_OK) \535pg_net-0.14.0>       |           ^~~~~~~~~~~~~~~~536pg_net-0.14.0> src/core.c:121:7: note: in expansion of macro 'EREPORT_CURL_SETOPT'537pg_net-0.14.0>   121 |       EREPORT_CURL_SETOPT(curl_ez_handle, CURLOPT_POSTFIELDSIZE, 0);538pg_net-0.14.0>       |       ^~~~~~~~~~~~~~~~~~~539pg_net-0.14.0> src/errors.h:6:11: warning: call to 'Wcurl_easy_setopt_err_long' declared with attribute warning: curl_easy_setopt expects a long argument [-Wattribute-warning]540pg_net-0.14.0>     6 |       if (curl_easy_setopt(hdl, opt, prm) != CURLE_OK) \541pg_net-0.14.0>       |           ^~~~~~~~~~~~~~~~542pg_net-0.14.0> src/core.c:134:3: note: in expansion of macro 'EREPORT_CURL_SETOPT'543pg_net-0.14.0>   134 |   EREPORT_CURL_SETOPT(curl_ez_handle, CURLOPT_TIMEOUT_MS, cdata->timeout_milliseconds);544pg_net-0.14.0>       |   ^~~~~~~~~~~~~~~~~~~545pg_net-0.14.0> src/errors.h:6:11: warning: call to 'Wcurl_easy_setopt_err_long' declared with attribute warning: curl_easy_setopt expects a long argument [-Wattribute-warning]546pg_net-0.14.0>     6 |       if (curl_easy_setopt(hdl, opt, prm) != CURLE_OK) \547pg_net-0.14.0>       |           ^~~~~~~~~~~~~~~~548pg_net-0.14.0> src/core.c:136:3: note: in expansion of macro 'EREPORT_CURL_SETOPT'549pg_net-0.14.0>   136 |   EREPORT_CURL_SETOPT(curl_ez_handle, CURLOPT_FOLLOWLOCATION, true);550pg_net-0.14.0>       |   ^~~~~~~~~~~~~~~~~~~551pg_net-0.14.0> gcc -Wall -Wmissing-prototypes -Wpointer-arith -Wdeclaration-after-statement -Werror=vla -Wendif-labels -Wmissing-format-attribute -Wimplicit-fallthrough=3 -Wcast-function-type -Wformat-security -fno-strict-aliasing -fwrapv -fexcess-precision=standard -Wno-deprecated-non-prototype -Wno-format-truncation -Wno-stringop-truncation -g -O2 -std=gnu17 -std=c11 -Werror -Wno-declaration-after-statement -fPIC  -DEXTVERSION=\"0.14.0\" -I. -I./ -I/nix/store/48l45fvi99n90x6p9i4cs1lmzby6cb73-postgresql-15.19/include/server -I/nix/store/48l45fvi99n90x6p9i4cs1lmzby6cb73-postgresql-15.19/include/internal -D_GNU_SOURCE  -I/nix/store/p17klc3qq4nl9ihfwqfpi8cnqvcf92xz-libxml2-2.15.1-dev/include/libxml2 -I/nix/store/mglbi4dy4kpx7v1dcgf6iincp5x38hsc-lz4-1.10.0-dev/include -I/nix/store/g41q9md9rdcr3lkydi6f8zd6fza3h1q4-zstd-1.5.7-dev/include -I/nix/store/n2vnr7ycfk6midbzxcwd28qj3bgb50cz-icu4c-75.1-dev/include  -c -o src/errors.o src/errors.c552pg_net-0.14.0> gcc -Wall -Wmissing-prototypes -Wpointer-arith -Wdeclaration-after-statement -Werror=vla -Wendif-labels -Wmissing-format-attribute -Wimplicit-fallthrough=3 -Wcast-function-type -Wformat-security -fno-strict-aliasing -fwrapv -fexcess-precision=standard -Wno-deprecated-non-prototype -Wno-format-truncation -Wno-stringop-truncation -g -O2 -std=gnu17 -std=c11 -Werror -Wno-declaration-after-statement -fPIC  -DEXTVERSION=\"0.14.0\" -I. -I./ -I/nix/store/48l45fvi99n90x6p9i4cs1lmzby6cb73-postgresql-15.19/include/server -I/nix/store/48l45fvi99n90x6p9i4cs1lmzby6cb73-postgresql-15.19/include/internal -D_GNU_SOURCE  -I/nix/store/p17klc3qq4nl9ihfwqfpi8cnqvcf92xz-libxml2-2.15.1-dev/include/libxml2 -I/nix/store/mglbi4dy4kpx7v1dcgf6iincp5x38hsc-lz4-1.10.0-dev/include -I/nix/store/g41q9md9rdcr3lkydi6f8zd6fza3h1q4-zstd-1.5.7-dev/include -I/nix/store/n2vnr7ycfk6midbzxcwd28qj3bgb50cz-icu4c-75.1-dev/include  -c -o src/event.o src/event.c553pg_net-0.14.0> In file included from /nix/store/jviasb44hibgh09829gbmbssbz2jjnhz-curl-8.17.0-dev/include/curl/curl.h:3333,554pg_net-0.14.0>                  from /nix/store/jviasb44hibgh09829gbmbssbz2jjnhz-curl-8.17.0-dev/include/curl/multi.h:51,555pg_net-0.14.0>                  from src/event.h:4,556pg_net-0.14.0>                  from src/event.c:6:557pg_net-0.14.0> /nix/store/jviasb44hibgh09829gbmbssbz2jjnhz-curl-8.17.0-dev/include/curl/multi.h:429:23: error: expected identifier or '(' before '__extension__'558pg_net-0.14.0>   429 | CURL_EXTERN CURLMcode curl_multi_setopt(CURLM *multi_handle,559pg_net-0.14.0>       |                       ^~~~~~~~~~~~~~~~~560pg_net-0.14.0> /nix/store/jviasb44hibgh09829gbmbssbz2jjnhz-curl-8.17.0-dev/include/curl/multi.h:429:23: error: expected identifier or '(' before ')' token561pg_net-0.14.0>   429 | CURL_EXTERN CURLMcode curl_multi_setopt(CURLM *multi_handle,562pg_net-0.14.0>       |                       ^~~~~~~~~~~~~~~~~563pg_net-0.14.0> make: *** [<builtin>: src/event.o] Error 1564error: build of '/nix/store/cfrc2vk3cgabx1447j2n7s3zxraq6395-pg_net-0.14.0.drv' on 'ssh-ng://nixbot-remote-build@78.232.36.247' failed: Cannot build '/nix/store/cfrc2vk3cgabx1447j2n7s3zxraq6395-pg_net-0.14.0.drv'.565       Reason: builder failed with exit code 2.566       Output paths:567         /nix/store/m4c4b79prkz8x60agzy6dy9bn0cdcy0d-pg_net-0.14.0568       Last 25 log lines:569       > src/errors.h:6:11: warning: call to 'Wcurl_easy_setopt_err_long' declared with attribute warning: curl_easy_setopt expects a long argument [-Wattribute-warning]570       >     6 |       if (curl_easy_setopt(hdl, opt, prm) != CURLE_OK) \571       >       |           ^~~~~~~~~~~~~~~~572       > src/core.c:134:3: note: in expansion of macro 'EREPORT_CURL_SETOPT'573       >   134 |   EREPORT_CURL_SETOPT(curl_ez_handle, CURLOPT_TIMEOUT_MS, cdata->timeout_milliseconds);574       >       |   ^~~~~~~~~~~~~~~~~~~575       > src/errors.h:6:11: warning: call to 'Wcurl_easy_setopt_err_long' declared with attribute warning: curl_easy_setopt expects a long argument [-Wattribute-warning]576       >     6 |       if (curl_easy_setopt(hdl, opt, prm) != CURLE_OK) \577       >       |           ^~~~~~~~~~~~~~~~578       > src/core.c:136:3: note: in expansion of macro 'EREPORT_CURL_SETOPT'579       >   136 |   EREPORT_CURL_SETOPT(curl_ez_handle, CURLOPT_FOLLOWLOCATION, true);580       >       |   ^~~~~~~~~~~~~~~~~~~581       > gcc -Wall -Wmissing-prototypes -Wpointer-arith -Wdeclaration-after-statement -Werror=vla -Wendif-labels -Wmissing-format-attribute -Wimplicit-fallthrough=3 -Wcast-function-type -Wformat-security -fno-strict-aliasing -fwrapv -fexcess-precision=standard -Wno-deprecated-non-prototype -Wno-format-truncation -Wno-stringop-truncation -g -O2 -std=gnu17 -std=c11 -Werror -Wno-declaration-after-statement -fPIC  -DEXTVERSION=\"0.14.0\" -I. -I./ -I/nix/store/48l45fvi99n90x6p9i4cs1lmzby6cb73-postgresql-15.19/include/server -I/nix/store/48l45fvi99n90x6p9i4cs1lmzby6cb73-postgresql-15.19/include/internal -D_GNU_SOURCE  -I/nix/store/p17klc3qq4nl9ihfwqfpi8cnqvcf92xz-libxml2-2.15.1-dev/include/libxml2 -I/nix/store/mglbi4dy4kpx7v1dcgf6iincp5x38hsc-lz4-1.10.0-dev/include -I/nix/store/g41q9md9rdcr3lkydi6f8zd6fza3h1q4-zstd-1.5.7-dev/include -I/nix/store/n2vnr7ycfk6midbzxcwd28qj3bgb50cz-icu4c-75.1-dev/include  -c -o src/errors.o src/errors.c582       > gcc -Wall -Wmissing-prototypes -Wpointer-arith -Wdeclaration-after-statement -Werror=vla -Wendif-labels -Wmissing-format-attribute -Wimplicit-fallthrough=3 -Wcast-function-type -Wformat-security -fno-strict-aliasing -fwrapv -fexcess-precision=standard -Wno-deprecated-non-prototype -Wno-format-truncation -Wno-stringop-truncation -g -O2 -std=gnu17 -std=c11 -Werror -Wno-declaration-after-statement -fPIC  -DEXTVERSION=\"0.14.0\" -I. -I./ -I/nix/store/48l45fvi99n90x6p9i4cs1lmzby6cb73-postgresql-15.19/include/server -I/nix/store/48l45fvi99n90x6p9i4cs1lmzby6cb73-postgresql-15.19/include/internal -D_GNU_SOURCE  -I/nix/store/p17klc3qq4nl9ihfwqfpi8cnqvcf92xz-libxml2-2.15.1-dev/include/libxml2 -I/nix/store/mglbi4dy4kpx7v1dcgf6iincp5x38hsc-lz4-1.10.0-dev/include -I/nix/store/g41q9md9rdcr3lkydi6f8zd6fza3h1q4-zstd-1.5.7-dev/include -I/nix/store/n2vnr7ycfk6midbzxcwd28qj3bgb50cz-icu4c-75.1-dev/include  -c -o src/event.o src/event.c583       > In file included from /nix/store/jviasb44hibgh09829gbmbssbz2jjnhz-curl-8.17.0-dev/include/curl/curl.h:3333,584       >                  from /nix/store/jviasb44hibgh09829gbmbssbz2jjnhz-curl-8.17.0-dev/include/curl/multi.h:51,585       >                  from src/event.h:4,586       >                  from src/event.c:6:587       > /nix/store/jviasb44hibgh09829gbmbssbz2jjnhz-curl-8.17.0-dev/include/curl/multi.h:429:23: error: expected identifier or '(' before '__extension__'588       >   429 | CURL_EXTERN CURLMcode curl_multi_setopt(CURLM *multi_handle,589       >       |                       ^~~~~~~~~~~~~~~~~590       > /nix/store/jviasb44hibgh09829gbmbssbz2jjnhz-curl-8.17.0-dev/include/curl/multi.h:429:23: error: expected identifier or '(' before ')' token591       >   429 | CURL_EXTERN CURLMcode curl_multi_setopt(CURLM *multi_handle,592       >       |                       ^~~~~~~~~~~~~~~~~593       > make: *** [<builtin>: src/event.o] Error 1594       For full logs, run:595         nix log /nix/store/cfrc2vk3cgabx1447j2n7s3zxraq6395-pg_net-0.14.0.drv596error: Cannot build '/nix/store/cfrc2vk3cgabx1447j2n7s3zxraq6395-pg_net-0.14.0.drv'.597       Reason: builder failed with exit code 1.598       Output paths:599         /nix/store/m4c4b79prkz8x60agzy6dy9bn0cdcy0d-pg_net-0.14.0600building '/nix/store/rdglczxf0sk4hhwsppqw13zl43vf5wr0-pg_net-0.14.0.drv' on 'ssh-ng://nixbot-remote-build@78.232.36.247'601building '/nix/store/rdglczxf0sk4hhwsppqw13zl43vf5wr0-pg_net-0.14.0.drv'602pg_net-0.14.0> Running phase: unpackPhase603pg_net-0.14.0> unpacking source archive /nix/store/cijlkfxy6vfh6pbq2nd4v8pc51nxn75y-source604pg_net-0.14.0> source root is source605pg_net-0.14.0> Running phase: patchPhase606pg_net-0.14.0> Running phase: updateAutotoolsGnuConfigScriptsPhase607pg_net-0.14.0> Running phase: configurePhase608pg_net-0.14.0> no configure script, doing nothing609pg_net-0.14.0> Running phase: buildPhase610pg_net-0.14.0> gcc -Wall -Wmissing-prototypes -Wpointer-arith -Wdeclaration-after-statement -Werror=vla -Wendif-labels -Wmissing-format-attribute -Wimplicit-fallthrough=3 -Wcast-function-type -Wshadow=compatible-local -Wformat-security -fno-strict-aliasing -fwrapv -fexcess-precision=standard -Wno-format-truncation -Wno-stringop-truncation -moutline-atomics -g -O2 -std=c11 -Werror -Wno-declaration-after-statement -fPIC -fvisibility=hidden  -DEXTVERSION=\"0.14.0\" -I. -I./ -I/nix/store/wq2kfr0rkb0hdmf1iwi3mi8pxycakzmq-postgresql-17_22/include/server -I/nix/store/wq2kfr0rkb0hdmf1iwi3mi8pxycakzmq-postgresql-17_22/include/internal -D_GNU_SOURCE  -I/nix/store/p17klc3qq4nl9ihfwqfpi8cnqvcf92xz-libxml2-2.15.1-dev/include/libxml2 -I/nix/store/mglbi4dy4kpx7v1dcgf6iincp5x38hsc-lz4-1.10.0-dev/include -I/nix/store/g41q9md9rdcr3lkydi6f8zd6fza3h1q4-zstd-1.5.7-dev/include -I/nix/store/n2vnr7ycfk6midbzxcwd28qj3bgb50cz-icu4c-75.1-dev/include  -c -o src/core.o src/core.c611pg_net-0.14.0> In file included from src/core.c:23:612pg_net-0.14.0> In function 'init_curl_handle',613pg_net-0.14.0>     inlined from 'consume_request_queue' at src/core.c:306:5:614pg_net-0.14.0> src/errors.h:6:11: warning: call to 'Wcurl_easy_setopt_err_long' declared with attribute warning: curl_easy_setopt expects a long argument [-Wattribute-warning]615pg_net-0.14.0>     6 |       if (curl_easy_setopt(hdl, opt, prm) != CURLE_OK) \616pg_net-0.14.0>       |           ^~~~~~~~~~~~~~~~617pg_net-0.14.0> src/core.c:120:7: note: in expansion of macro 'EREPORT_CURL_SETOPT'618pg_net-0.14.0>   120 |       EREPORT_CURL_SETOPT(curl_ez_handle, CURLOPT_POST, 1);619pg_net-0.14.0>       |       ^~~~~~~~~~~~~~~~~~~620pg_net-0.14.0> src/errors.h:6:11: warning: call to 'Wcurl_easy_setopt_err_long' declared with attribute warning: curl_easy_setopt expects a long argument [-Wattribute-warning]621pg_net-0.14.0>     6 |       if (curl_easy_setopt(hdl, opt, prm) != CURLE_OK) \622pg_net-0.14.0>       |           ^~~~~~~~~~~~~~~~623pg_net-0.14.0> src/core.c:121:7: note: in expansion of macro 'EREPORT_CURL_SETOPT'624pg_net-0.14.0>   121 |       EREPORT_CURL_SETOPT(curl_ez_handle, CURLOPT_POSTFIELDSIZE, 0);625pg_net-0.14.0>       |       ^~~~~~~~~~~~~~~~~~~626pg_net-0.14.0> src/errors.h:6:11: warning: call to 'Wcurl_easy_setopt_err_long' declared with attribute warning: curl_easy_setopt expects a long argument [-Wattribute-warning]627pg_net-0.14.0>     6 |       if (curl_easy_setopt(hdl, opt, prm) != CURLE_OK) \628pg_net-0.14.0>       |           ^~~~~~~~~~~~~~~~629pg_net-0.14.0> src/core.c:134:3: note: in expansion of macro 'EREPORT_CURL_SETOPT'630pg_net-0.14.0>   134 |   EREPORT_CURL_SETOPT(curl_ez_handle, CURLOPT_TIMEOUT_MS, cdata->timeout_milliseconds);631pg_net-0.14.0>       |   ^~~~~~~~~~~~~~~~~~~632pg_net-0.14.0> src/errors.h:6:11: warning: call to 'Wcurl_easy_setopt_err_long' declared with attribute warning: curl_easy_setopt expects a long argument [-Wattribute-warning]633pg_net-0.14.0>     6 |       if (curl_easy_setopt(hdl, opt, prm) != CURLE_OK) \634pg_net-0.14.0>       |           ^~~~~~~~~~~~~~~~635pg_net-0.14.0> src/core.c:136:3: note: in expansion of macro 'EREPORT_CURL_SETOPT'636pg_net-0.14.0>   136 |   EREPORT_CURL_SETOPT(curl_ez_handle, CURLOPT_FOLLOWLOCATION, true);637pg_net-0.14.0>       |   ^~~~~~~~~~~~~~~~~~~638pg_net-0.14.0> gcc -Wall -Wmissing-prototypes -Wpointer-arith -Wdeclaration-after-statement -Werror=vla -Wendif-labels -Wmissing-format-attribute -Wimplicit-fallthrough=3 -Wcast-function-type -Wshadow=compatible-local -Wformat-security -fno-strict-aliasing -fwrapv -fexcess-precision=standard -Wno-format-truncation -Wno-stringop-truncation -moutline-atomics -g -O2 -std=c11 -Werror -Wno-declaration-after-statement -fPIC -fvisibility=hidden  -DEXTVERSION=\"0.14.0\" -I. -I./ -I/nix/store/wq2kfr0rkb0hdmf1iwi3mi8pxycakzmq-postgresql-17_22/include/server -I/nix/store/wq2kfr0rkb0hdmf1iwi3mi8pxycakzmq-postgresql-17_22/include/internal -D_GNU_SOURCE  -I/nix/store/p17klc3qq4nl9ihfwqfpi8cnqvcf92xz-libxml2-2.15.1-dev/include/libxml2 -I/nix/store/mglbi4dy4kpx7v1dcgf6iincp5x38hsc-lz4-1.10.0-dev/include -I/nix/store/g41q9md9rdcr3lkydi6f8zd6fza3h1q4-zstd-1.5.7-dev/include -I/nix/store/n2vnr7ycfk6midbzxcwd28qj3bgb50cz-icu4c-75.1-dev/include  -c -o src/errors.o src/errors.c639pg_net-0.14.0> gcc -Wall -Wmissing-prototypes -Wpointer-arith -Wdeclaration-after-statement -Werror=vla -Wendif-labels -Wmissing-format-attribute -Wimplicit-fallthrough=3 -Wcast-function-type -Wshadow=compatible-local -Wformat-security -fno-strict-aliasing -fwrapv -fexcess-precision=standard -Wno-format-truncation -Wno-stringop-truncation -moutline-atomics -g -O2 -std=c11 -Werror -Wno-declaration-after-statement -fPIC -fvisibility=hidden  -DEXTVERSION=\"0.14.0\" -I. -I./ -I/nix/store/wq2kfr0rkb0hdmf1iwi3mi8pxycakzmq-postgresql-17_22/include/server -I/nix/store/wq2kfr0rkb0hdmf1iwi3mi8pxycakzmq-postgresql-17_22/include/internal -D_GNU_SOURCE  -I/nix/store/p17klc3qq4nl9ihfwqfpi8cnqvcf92xz-libxml2-2.15.1-dev/include/libxml2 -I/nix/store/mglbi4dy4kpx7v1dcgf6iincp5x38hsc-lz4-1.10.0-dev/include -I/nix/store/g41q9md9rdcr3lkydi6f8zd6fza3h1q4-zstd-1.5.7-dev/include -I/nix/store/n2vnr7ycfk6midbzxcwd28qj3bgb50cz-icu4c-75.1-dev/include  -c -o src/event.o src/event.c640pg_net-0.14.0> In file included from /nix/store/jviasb44hibgh09829gbmbssbz2jjnhz-curl-8.17.0-dev/include/curl/curl.h:3333,641pg_net-0.14.0>                  from /nix/store/jviasb44hibgh09829gbmbssbz2jjnhz-curl-8.17.0-dev/include/curl/multi.h:51,642pg_net-0.14.0>                  from src/event.h:4,643pg_net-0.14.0>                  from src/event.c:6:644pg_net-0.14.0> /nix/store/jviasb44hibgh09829gbmbssbz2jjnhz-curl-8.17.0-dev/include/curl/multi.h:429:23: error: expected identifier or '(' before '__extension__'645pg_net-0.14.0>   429 | CURL_EXTERN CURLMcode curl_multi_setopt(CURLM *multi_handle,646pg_net-0.14.0>       |                       ^~~~~~~~~~~~~~~~~647pg_net-0.14.0> /nix/store/jviasb44hibgh09829gbmbssbz2jjnhz-curl-8.17.0-dev/include/curl/multi.h:429:23: error: expected identifier or '(' before ')' token648pg_net-0.14.0>   429 | CURL_EXTERN CURLMcode curl_multi_setopt(CURLM *multi_handle,649pg_net-0.14.0>       |                       ^~~~~~~~~~~~~~~~~650pg_net-0.14.0> make: *** [<builtin>: src/event.o] Error 1651error: build of '/nix/store/rdglczxf0sk4hhwsppqw13zl43vf5wr0-pg_net-0.14.0.drv' on 'ssh-ng://nixbot-remote-build@78.232.36.247' failed: Cannot build '/nix/store/rdglczxf0sk4hhwsppqw13zl43vf5wr0-pg_net-0.14.0.drv'.652       Reason: builder failed with exit code 2.653       Output paths:654         /nix/store/dljg9dqcggn0gx9wwgbw43zdg392qhq2-pg_net-0.14.0655       Last 25 log lines:656       > src/errors.h:6:11: warning: call to 'Wcurl_easy_setopt_err_long' declared with attribute warning: curl_easy_setopt expects a long argument [-Wattribute-warning]657       >     6 |       if (curl_easy_setopt(hdl, opt, prm) != CURLE_OK) \658       >       |           ^~~~~~~~~~~~~~~~659       > src/core.c:134:3: note: in expansion of macro 'EREPORT_CURL_SETOPT'660       >   134 |   EREPORT_CURL_SETOPT(curl_ez_handle, CURLOPT_TIMEOUT_MS, cdata->timeout_milliseconds);661       >       |   ^~~~~~~~~~~~~~~~~~~662       > src/errors.h:6:11: warning: call to 'Wcurl_easy_setopt_err_long' declared with attribute warning: curl_easy_setopt expects a long argument [-Wattribute-warning]663       >     6 |       if (curl_easy_setopt(hdl, opt, prm) != CURLE_OK) \664       >       |           ^~~~~~~~~~~~~~~~665       > src/core.c:136:3: note: in expansion of macro 'EREPORT_CURL_SETOPT'666       >   136 |   EREPORT_CURL_SETOPT(curl_ez_handle, CURLOPT_FOLLOWLOCATION, true);667       >       |   ^~~~~~~~~~~~~~~~~~~668       > gcc -Wall -Wmissing-prototypes -Wpointer-arith -Wdeclaration-after-statement -Werror=vla -Wendif-labels -Wmissing-format-attribute -Wimplicit-fallthrough=3 -Wcast-function-type -Wshadow=compatible-local -Wformat-security -fno-strict-aliasing -fwrapv -fexcess-precision=standard -Wno-format-truncation -Wno-stringop-truncation -moutline-atomics -g -O2 -std=c11 -Werror -Wno-declaration-after-statement -fPIC -fvisibility=hidden  -DEXTVERSION=\"0.14.0\" -I. -I./ -I/nix/store/wq2kfr0rkb0hdmf1iwi3mi8pxycakzmq-postgresql-17_22/include/server -I/nix/store/wq2kfr0rkb0hdmf1iwi3mi8pxycakzmq-postgresql-17_22/include/internal -D_GNU_SOURCE  -I/nix/store/p17klc3qq4nl9ihfwqfpi8cnqvcf92xz-libxml2-2.15.1-dev/include/libxml2 -I/nix/store/mglbi4dy4kpx7v1dcgf6iincp5x38hsc-lz4-1.10.0-dev/include -I/nix/store/g41q9md9rdcr3lkydi6f8zd6fza3h1q4-zstd-1.5.7-dev/include -I/nix/store/n2vnr7ycfk6midbzxcwd28qj3bgb50cz-icu4c-75.1-dev/include  -c -o src/errors.o src/errors.c669       > gcc -Wall -Wmissing-prototypes -Wpointer-arith -Wdeclaration-after-statement -Werror=vla -Wendif-labels -Wmissing-format-attribute -Wimplicit-fallthrough=3 -Wcast-function-type -Wshadow=compatible-local -Wformat-security -fno-strict-aliasing -fwrapv -fexcess-precision=standard -Wno-format-truncation -Wno-stringop-truncation -moutline-atomics -g -O2 -std=c11 -Werror -Wno-declaration-after-statement -fPIC -fvisibility=hidden  -DEXTVERSION=\"0.14.0\" -I. -I./ -I/nix/store/wq2kfr0rkb0hdmf1iwi3mi8pxycakzmq-postgresql-17_22/include/server -I/nix/store/wq2kfr0rkb0hdmf1iwi3mi8pxycakzmq-postgresql-17_22/include/internal -D_GNU_SOURCE  -I/nix/store/p17klc3qq4nl9ihfwqfpi8cnqvcf92xz-libxml2-2.15.1-dev/include/libxml2 -I/nix/store/mglbi4dy4kpx7v1dcgf6iincp5x38hsc-lz4-1.10.0-dev/include -I/nix/store/g41q9md9rdcr3lkydi6f8zd6fza3h1q4-zstd-1.5.7-dev/include -I/nix/store/n2vnr7ycfk6midbzxcwd28qj3bgb50cz-icu4c-75.1-dev/include  -c -o src/event.o src/event.c670       > In file included from /nix/store/jviasb44hibgh09829gbmbssbz2jjnhz-curl-8.17.0-dev/include/curl/curl.h:3333,671       >                  from /nix/store/jviasb44hibgh09829gbmbssbz2jjnhz-curl-8.17.0-dev/include/curl/multi.h:51,672       >                  from src/event.h:4,673       >                  from src/event.c:6:674       > /nix/store/jviasb44hibgh09829gbmbssbz2jjnhz-curl-8.17.0-dev/include/curl/multi.h:429:23: error: expected identifier or '(' before '__extension__'675       >   429 | CURL_EXTERN CURLMcode curl_multi_setopt(CURLM *multi_handle,676       >       |                       ^~~~~~~~~~~~~~~~~677       > /nix/store/jviasb44hibgh09829gbmbssbz2jjnhz-curl-8.17.0-dev/include/curl/multi.h:429:23: error: expected identifier or '(' before ')' token678       >   429 | CURL_EXTERN CURLMcode curl_multi_setopt(CURLM *multi_handle,679       >       |                       ^~~~~~~~~~~~~~~~~680       > make: *** [<builtin>: src/event.o] Error 1681       For full logs, run:682         nix log /nix/store/rdglczxf0sk4hhwsppqw13zl43vf5wr0-pg_net-0.14.0.drv683error: Cannot build '/nix/store/rdglczxf0sk4hhwsppqw13zl43vf5wr0-pg_net-0.14.0.drv'.684       Reason: builder failed with exit code 1.685       Output paths:686         /nix/store/dljg9dqcggn0gx9wwgbw43zdg392qhq2-pg_net-0.14.0