nixbot

builds

cancelled checks.aarch64-linux.ext-orioledb build #132 · raw · eval 32.2 s · 1.9 GiB allocated · ·

1these 243 derivations will be built:2  /nix/store/0cmixqwsz3vb82j49j1mhvyk8crg4dcw-wrappers-0.6.0.drv3  /nix/store/0i6b8yy32fc4mgfm75w94gw9ja033kw5-wrappers-0.5.5.drv4  /nix/store/qbrypyj5k7h0pffxxshbyym24h89f2y1-gdal-3.8.5.drv5  /nix/store/l9h30apsjb4s39av0lwsad1vv59rdkv6-cgal-6.0.2.drv6  /nix/store/s3myd88a11h86h3h8cvhgd1im0zk6i65-sfcgal-2.2.0.drv7  /nix/store/h1vl8vpk154yppn5lcqms2680igi0mmj-postgis-3.3.2.drv8  /nix/store/2ylkw9crapb58vd5g0vj602jfyb1p3r6-postgis.drv9  /nix/store/58cinn47vbvwr1wxdkspmvi9cj27b07h-safeupdate-1.4.drv10  /nix/store/6c0mnd757hvxppfyrsf4cb1wgnbd4111-safeupdate.drv11  /nix/store/ciwky5vscrx4c52kr30fm8j4idj8qgsn-pg_stat_monitor-2.1.drv12  /nix/store/7a02zvvkkkriis78wgz6n8nnkwm2gh22-pg_stat_monitor.drv13  /nix/store/9gh7fip2wf0wip8wnv1axd8ghar0x5fb-pgmq-1.5.1.drv14  /nix/store/k4swwy7459wf558rbrraclsr4sjccz0h-pgmq-1.4.4.drv15  /nix/store/8zsadvm8mv18kpy4qy724ps2jlbsik0w-pgmq.drv16  /nix/store/4wk9vb1q3kdnhj8hsq8pwgbp82glwg9w-timescaledb-2.9.1.drv17  /nix/store/9wzj3wh6sczzk849dmjwvmnkshggakxp-timescaledb.drv18  /nix/store/2nmg9sxx50xmndps3714hbvwjyd5rqv0-vector-0.8.2.drv19  /nix/store/94d6rmv5v8zdjsgzl3yrhpg7zq6zdjpx-vector-0.5.1.drv20  /nix/store/alajylsl9b90m65n0ps0mkbkw679x4sn-vector-0.6.2.drv21  /nix/store/jmilv9h5p0v4grgqnhfn22i7zl352ybh-vector-0.7.4.drv22  /nix/store/q3mdjvqpw4xbwcjy5y1ps1igxsjvx133-vector-0.7.0.drv23  /nix/store/v5dnr617av2jgk6kpddxbxxqjqgl5kzg-vector-0.8.0.drv24  /nix/store/z40s48rz55qgpw6g6wiqi68hkfas4h1l-vector-0.6.0.drv25  /nix/store/zygvf0wgqsyi96fangshfkwjiyylhvkz-vector-0.4.0.drv26  /nix/store/9zndhfzc45vrfn297g1hav7m6ba3rlzk-vector.drv27  /nix/store/0nln7k62ggiw9s5y0icr3hyribl5iazb-pg_graphql-1.2.3.drv28  /nix/store/63ifr5p2wzl7vygaj7pq847nwnrnxm3p-pg_graphql-1.5.0.drv29  /nix/store/6hfik9nnrihzb6dj53in06v6a4qmgsj3-pg_graphql-1.5.7.drv30  /nix/store/7pqhalqwaggagybgy24lm93c5b8d4isk-pg_graphql-1.4.2.drv31  /nix/store/ag5rlkqwfkwlgvxg1yhivjqfcaq2w14v-pg_graphql-1.5.1-mergeless.drv32  /nix/store/cgazfazb4ak4csd48khgjsa4vxmmddfb-pg_graphql-1.5.11.drv33  /nix/store/d78fjdz9zrccq7f563jz9fj1a45yrq5x-pg_graphql-1.1.0.drv34  /nix/store/dk0a0irlxsl04249qy2dnc6bm4wkk1lc-pg_graphql-1.6.1.drv35  /nix/store/dnwfmlfwyqnkzy2jyzf6h3q044wk6hbg-pg_graphql-1.5.9.drv36  /nix/store/f694g0m8chfk6z6yh787135bzcqwnli4-pg_graphql-1.5.4.drv37  /nix/store/fsgiwnrg38ssgf05vkmzc21v93a36qmd-pg_graphql-1.2.2.drv38  /nix/store/h9damb814a5fmzyc5wgcildkm32vy1bv-pg_graphql-1.6.2.drv39  /nix/store/iq0gzwfxzxkns0gpdkhjx1cc6s4q1i2q-pg_graphql-1.5.6.drv40  /nix/store/q66z8j5qs96rgahzmlrq4n41d2avywar-pg_graphql-1.0.2.drv41  /nix/store/v0mqjlj6j73wpc66h34djrv08j7q3l8w-pg_graphql-1.4.4.drv42  /nix/store/wnn3f47lz59i84mdzvmc1a7man89cmic-pg_graphql-1.2.0.drv43  /nix/store/yds474rgqgxjdw6zm0ylvpvvd4l0xmkl-pg_graphql-1.4.1.drv44  /nix/store/yhfqz2chz94q9k3rv8hgwcsyri02wlm8-pg_graphql-1.5.1.drv45  /nix/store/a4icbsgspmpi3nfs8vffp42sg9v7a25f-pg_graphql.drv46  /nix/store/a7qnf8v2hw96v6kdba9j02fljccy432g-pg_tle.drv47  /nix/store/c08rdgxba5n6zhyp78l8sd6fhnbc4a4c-pgsodium-3.1.7.drv48  /nix/store/hh2jpg5qdwgdwzi96qcay1a5ffhi0f4i-pgsodium-3.1.6.drv49  /nix/store/jwrjvb9m50v44sla4jpig83jab7zn17x-pgsodium-3.1.8.drv50  /nix/store/m1xdmpffkflwgdin5ljvfh72wxq5lxpx-pgsodium-3.1.5.drv51  /nix/store/wjhhlaiwzvm5m08my4d983icdmcpllzd-pgsodium-3.0.4.drv52  /nix/store/a9laaq557mna86dm87lq3211xy5h2zyl-pgsodium.drv53  /nix/store/ag6xlrckwkx594nhf6j3sq2ngwbryyz8-http.drv54  /nix/store/i0gq8yqxp5h7l782n2ki94b1d62m6zsg-plpgsql_check-2.2.drv55  /nix/store/q117a7mx5d5bzln8xg24fh1vfzq7bsz4-plpgsql_check-2.7.drv56  /nix/store/rj6qw8pwvr91cy6qyp8xibrw4arrpj9j-plpgsql_check-2.8.drv57  /nix/store/c782i897gj20c0r8bmphf8p6r5s5wdli-plpgsql_check.drv58  /nix/store/b139hl0gpc9icb6j6q28gl1chw7i9260-rum-1.3.drv59  /nix/store/csvzp35khfq15v5g275y14094s58v10k-rum.drv60  /nix/store/c2pcswnd4yfp02pas6a7grpm0fmk70wx-supabase_vault-0.3.1.drv61  /nix/store/jb3j93i6ljmvqkv5cnv3lh3d9zn4zcjz-supabase_vault-0.2.8.drv62  /nix/store/gc3nb7r1a8rbf6f8yf4zs2nnb65awkxq-supabase_vault.drv63  /nix/store/7inhp3jz4x6l1m2i6aa1w6bbb91r1hay-pgroonga-3.2.5.drv64  /nix/store/xim497rkcncpxb5vvyli3j4jnziyybgy-pgroonga-3.0.7.drv65  /nix/store/gdd3j67qcdibplv1d440a6gsix87s5xs-pgroonga.drv66  /nix/store/ihx5q75k74a4cqq4k9bwnl5yin262kq2-pgrouting-3.4.1.drv67  /nix/store/hf9dly2ryx969lw950ld454fqfa6c41r-pgrouting.drv68  /nix/store/8kjmsmcqakfh251gpi83kpszgvy3zgj2-pg_jsonschema-0.3.1.drv69  /nix/store/dllk76mn670xnq6146jk4lmj5hpxmp4c-pg_jsonschema-0.3.3.drv70  /nix/store/pqncxlsh0gj7xk3n4mwxqiyyzim9c7g7-pg_jsonschema-0.2.0.drv71  /nix/store/iljk5j7rhldnws1iwi3j8qjxnaalxqjv-pg_jsonschema.drv72  /nix/store/82vdx9lfkbv67j79qzi9yzvqrj043w52-wal2json-2.6.drv73  /nix/store/iz713zhjyn0lym6ls12i9vxca9cxf4hi-wal2json.drv74  /nix/store/zfhvj40marmxclav9a5ppx3dmq3xd3hh-pg_partman-5.3.1.drv75  /nix/store/jcxqgl4g37gj09v4km7dl525ym1kxla2-pg_partman.drv76  /nix/store/mc1n2fml7avin2lrpgrd5cx7wjdb4gcg-pg_hashids-1.3.0-cd0e1b31d52b394a0df64079406a14a4f7387cd6.drv77  /nix/store/jsqjxdn4qp571nvc40r8xx103s9qb7c9-pg_hashids.drv78  /nix/store/7lzcc5d36122752hpjb6lij6sc2ai2a0-plv8-3.1.5.drv79  /nix/store/87brzrl1nsm8z4my02aldnxd8fb0i69x-plv8-3.1.4.drv80  /nix/store/k6nh1vivj2dgh0jk2mpsiy4p5v6sjyzk-plv8.drv81  /nix/store/xjfjfch45p5g0snar9qpm4amblh2jya8-plan_filter-0.1.drv82  /nix/store/lhdnha0m1rqpv0cmivzv3s7znjmgxc14-plan_filter.drv83  /nix/store/0n0iaya9csx9by2pimrx1yglzw8dp4zs-pg_net-0.13.0.drv84  /nix/store/25f3j4f5ialq0qwpdpc7gya55q9i2mai-pg_net-0.11.0.drv85  /nix/store/5xdj291zxpgm4qhx0749x7j0wwlfilf4-pg_net-0.1.drv86  /nix/store/6nzc8mspw5i4qqlvgriv2l1439xlh68v-pg_net-0.10.0.drv87  /nix/store/7iq4z475k625nsn9wc9nf4vxa7x1f1qd-pg_net-0.19.5.drv88  /nix/store/cfrc2vk3cgabx1447j2n7s3zxraq6395-pg_net-0.14.0.drv89  /nix/store/iwq28h7yniccm9ra8q6dc0wma0l6hnqn-pg_net-0.6.drv90  /nix/store/nw3d144zhshkgx1z66g9g2wg5829w36n-pg_net-0.7.1.drv91  /nix/store/nwcnf7x9i2zdx48936w9ixsnxzhbab16-pg_net-0.20.0.drv92  /nix/store/rfdqkjkjdwz7ydrwlfn9cdy68zz9z6rf-pg_net-0.7.drv93  /nix/store/whvqb38akl195470ks3jads9kmq2i9gj-pg_net-0.8.0.drv94  /nix/store/zy29jzcj1bsz7760wbmlg78czaddsrni-pg_net-0.20.3.drv95  /nix/store/q7ak647qv213m4vc4fnr43i09azs1b0p-pg_net.drv96  /nix/store/s7vxni6a17dm43jdicq8ksfjsk2d7c0n-pgaudit.drv97  /nix/store/nwi7hxl3j1cxn7ylrkx8sbbg3sqld8ag-pgtap-1.3.3.drv98  /nix/store/sxzi0qg4ingw35zkbi2pk2vfgxbq5k2a-pgtap.drv99  /nix/store/wza7bzcbymwld5yd1bh5p859l0fgd9af-pg_cron-1.4.2.drv100  /nix/store/xcji3ff216yxrc2yf2yss6mza01w0ccm-pg_cron.drv101  /nix/store/21s45rg3i2jfhdarxmqf3dr79allgdgh-wrappers-0.4.5.drv102  /nix/store/56j6z0f3g50m72cj7ynr22p9fdml79q9-wrappers-0.5.3.drv103  /nix/store/9m4hgq2s9z1cy1508wymdcl2n1w3ky5h-wrappers-0.6.2.drv104  /nix/store/f3b53aqd65czxnbbash43yraza54ds7k-wrappers-0.4.3.drv105  /nix/store/fpcwzjw9wdhbljjpcjlbz4w6236qzl70-wrappers-0.3.0.drv106  /nix/store/hygnfcb7az5nw4c4aranasi27gnhzgan-wrappers-0.6.3.drv107  /nix/store/iimlppn24xgvgjvnm4xp8z9bxl4p4p1d-wrappers-0.4.1.drv108  /nix/store/l3ww3jfvj5l8bp25p66wrjziy8m0vi23-wrappers-0.5.0.drv109  /nix/store/ns9rs9anq0rsl3sh1rhxmqcsll7lkjd0-wrappers-0.5.6.drv110  /nix/store/nvjw377g2m07i1z93mngr72qhpjmafvy-wrappers-0.4.6.drv111  /nix/store/qzn17ml7z84zcmcw96j0z0f6m9j6y7qm-wrappers-0.5.4.drv112  /nix/store/xbhixx8nl4iifcfi17lpavbs9cxcg5ka-wrappers-0.6.1.drv113  /nix/store/y06jjr5k7hk7zs8gzilg4g50b184va6a-wrappers-0.4.2.drv114  /nix/store/y1qh08g7i9w1x2s10rq7ammigljy82kw-wrappers-0.4.4.drv115  /nix/store/z1yzqa9qzq4ri1f58lngsljs0abhgjz5-wrappers-0.5.7.drv116  /nix/store/xcq8s20l2ynk52356w6nqkdw7379h4g4-wrappers.drv117  /nix/store/3m1k34jx4kw90mcghzrp83c2dfhrwab8-pg_repack-1.5.1.drv118  /nix/store/c7dnz58z4jqy26qinfmray2nlvxx3442-pg_repack-1.4.8.drv119  /nix/store/iwgg2la44vzaaa2ja2xyaydck2jab651-pg_repack-1.5.2.drv120  /nix/store/xd0qgx5kfkw00jgxs1v9rm4ksfdjky95-pg_repack.drv121  /nix/store/fakh4z5ssr1vhknp3xv3ch232i3ph2ax-postgresql-and-plugins-15.19.drv122  /nix/store/4z7sbcap8vdzfs1smz81k2crr4sgm640-postgresql-and-plugins-15.19.drv123  /nix/store/q4qvxkwv7rl1jac9sf5aap56gjx0n5mb-system-path.drv124  /nix/store/9in45xg9fcahx70h7alf6jg08sin568q-dbus-1.drv125  /nix/store/jffmpfrihfl3k6lfgdc4ii4a62343h7x-X-Restart-Triggers-dbus.drv126  /nix/store/0jyfsa7sd5nhfiwbk0i0i0k7bbgigy6z-unit-dbus.service.drv127  /nix/store/0nn0jglvy3w5hd868rilks6acxx242hj-pg_net-0.19.5.drv128  /nix/store/0q3jswlrym436vq3yzd7nmxpfpc7zbw7-wrappers-0.5.6.drv129  /nix/store/0wbkhlgz00c1nhm74adar4kk6dbid1dq-pg_graphql-1.5.11.drv130  /nix/store/1k3nzf8206jy6jjwdb50jn8rij79dvvj-plan_filter-0.1.drv131  /nix/store/17zhj6r14i4xx0fmzclykpcnyicwhbga-plan_filter.drv132  /nix/store/1hza0wxglhyl1641a3yki78kp045s8x2-wrappers-0.5.7.drv133  /nix/store/1mkhz1wanb7sx61imr6wqda0cqnvnj8q-wal2json-2.6.drv134  /nix/store/m94894cysabrjwxvvsg00i2c4vxrwj44-pg_graphql-1.6.1.drv135  /nix/store/nsc639d0i1mzcdskxc5v8874w8f4zf8x-pg_graphql-1.6.2.drv136  /nix/store/w47195gn53xxlfnja6kkgpgj0pbxj66m-pg_graphql-1.5.9.drv137  /nix/store/2j0amjv943p6zmhzl3mx9z6jr1qcpn3i-pg_graphql.drv138  /nix/store/2wp2aqp71l4218m1z0aas6789yx18sv3-pgrouting-3.4.1.drv139  /nix/store/564f4p7z536irjy1x7a6i39nk3n3g2r2-pgrouting.drv140  /nix/store/7m924d2lj1z3y952h3rhjixfq3sygp4r-pg_tle.drv141  /nix/store/z008z9r9dipnvldyfh7pklhxwdav0faw-http-1.6.1.drv142  /nix/store/82hvrn43v2lmbsbj2cnaaps4iy6q9dqn-http.drv143  /nix/store/k4qjk97aggz30jlgv2hdqka8fy8z07pg-supabase_vault-0.3.1.drv144  /nix/store/z8jynkjsnrfphim33c02aci4n6i2s9la-supabase_vault-0.2.8.drv145  /nix/store/8ir53vjiqz9rhip8arbxd2b58d0j67w0-supabase_vault.drv146  /nix/store/vrks8v32hwif7cfllbj4kb4i2v9b48y8-hypopg.drv147  /nix/store/yxyw8y9hskg7m2sajbfkix9g2pibkl2w-index_advisor-0.2.0.drv148  /nix/store/9c27ix09f1z8w6a63dkm9idp2vsrixh1-index_advisor.drv149  /nix/store/9sv9z7i53r40xnrigr8aywi98izk30rb-wal2json.drv150  /nix/store/g3yy08xhp6kakigznjmymrvasv6xhzz4-rum-1.3.drv151  /nix/store/apcx516gwjdivwb00nzvgwwq26mp6kbp-rum.drv152  /nix/store/m5i71pkvgfbs9l7iwwnbj4hyz9dvj13m-pg_jsonschema-0.3.3.drv153  /nix/store/az9kzhbrx32y837x7nl7dfajllv3l3xn-pg_jsonschema.drv154  /nix/store/ynjdlqr0w8h7ici1xdnsr79mwnzmyyri-pgroonga-3.2.5.drv155  /nix/store/c7b5vgzvlwgra3bhwq5fjzl0cg8lxq53-pgroonga.drv156  /nix/store/axpz1dvivwnmwkkcs392nj9cp1zs4x4h-pg_repack-1.4.8.drv157  /nix/store/gpxphj5cc5qbfjvp1kckicqwibgb6870-pg_repack-1.5.0.drv158  /nix/store/nynlpdydjmjk2fk2fsjz9bws5n6pjjyv-pg_repack-1.5.1.drv159  /nix/store/sa036niivyjgc2rqi9xh890msxh349l9-pg_repack-1.5.2.drv160  /nix/store/f4jr9drjzv7wfj2rxqg6fxg4ki5xv8aq-pg_repack.drv161  /nix/store/3cgs2dl0nwcsnwa5j7vkkp9vnqrax686-wrappers-0.6.0.drv162  /nix/store/74dcpcc376carhrdcf8ka4zmkawz1yv6-wrappers-0.5.4.drv163  /nix/store/92vrj7bj8hswwppxa34pv4a5mcishcns-wrappers-0.4.4.drv164  /nix/store/96l1zwmvz2ffcdfraaalfc6lvhah4kbz-wrappers-0.5.5.drv165  /nix/store/adcv6z66z4kpsasjjh1mcxa915lbdppl-wrappers-0.4.5.drv166  /nix/store/b4n3d1kid5pcaqfl3fjnjmc425dgg1p1-wrappers-0.5.0.drv167  /nix/store/jcd2gw4vawwnh0pmxhl4pl3ll6adggx5-wrappers-0.6.2.drv168  /nix/store/vxwdlzq8s4jj92x0jpc4sl9drjywlalq-wrappers-0.6.3.drv169  /nix/store/xwhq66cqc0ms922bxlcgc1jwff6kqv8g-wrappers-0.5.3.drv170  /nix/store/y6kq63cxxc5v5jh87mv9wpbvk0p4ayfg-wrappers-0.6.1.drv171  /nix/store/zdyyj4cgmfdl46zb5ycwmwr6d30w6mbx-wrappers-0.4.6.drv172  /nix/store/fn58ja37h9fw7mszrd75faxdb0999f0i-wrappers.drv173  /nix/store/8yjdx0pjzbx41fx807nrw1js3y16kbz5-vector-0.5.1.drv174  /nix/store/9yiwshvqw6zii2gdbjn3whic00kdi2kk-vector-0.7.4.drv175  /nix/store/gd4y86918lqw8gzxg8nqrz8sy2dqq9fb-vector-0.7.0.drv176  /nix/store/gdgmh15k0z47wvlyk7n79hg9mm7jzisl-vector-0.6.2.drv177  /nix/store/hs3bxh6aa4yj96k9qp50af7qy1jchwk3-vector-0.6.0.drv178  /nix/store/j5mchw8xwd04x2c28fmf7pccna5x7y95-vector-0.8.2.drv179  /nix/store/qa8qkhza8bf74v69dzxgqvy2mjf799yl-vector-0.8.0.drv180  /nix/store/g5mv4minlqr25pj8gqhzcns6w7bwzaph-vector.drv181  /nix/store/lkbp0bzzg49y6z9h7ms156q0jsiq6qh4-safeupdate-1.4.drv182  /nix/store/icwncd52zxyvvybn79pvj2s9day934p8-safeupdate.drv183  /nix/store/j99v4y7ck8sk68hj9m9aw1avc2dkn4nh-pg_stat_monitor.drv184  /nix/store/9kmiqqmclsl8d77yd54al2d2wlwc6dp1-pgsodium-3.0.4.drv185  /nix/store/ckl9zg69wqkncwizrd6lln7h5492wwn6-pgsodium-3.1.6.drv186  /nix/store/lhi0y1xi9i9i1c8kg95nfhdw95j3dz3r-pgsodium-3.1.5.drv187  /nix/store/msmzmvngp6cx4yl0dwgzp3iv7bv796wg-pgsodium-3.1.8.drv188  /nix/store/zwypkv0vf8m8ybs536jq5wglvhfwdx8y-pgsodium-3.1.7.drv189  /nix/store/l68xzbdq736nzdnwvr9q3x29wcngcsj1-pgsodium.drv190  /nix/store/qk4j715gipc827yxrcwv0g9pviaqxkyy-pg_partman.drv191  /nix/store/46l7zbh5kkmyi58x419ar4kly30qvnhi-gdal-3.8.5.drv192  /nix/store/apd0c6nk3x333r1xj0sl2m3cr96pbizv-postgis-3.3.7.drv193  /nix/store/r12320b80inhy5aq434asc4sa8w6bn0g-postgis.drv194  /nix/store/36hfvpcvdxj64718i9mhil3db8835a6q-plpgsql_check-2.7.drv195  /nix/store/9lpr8r6zwzid07ihmr89rnxqcwv0yfja-plpgsql_check-2.8.drv196  /nix/store/rly88629k74w1nj10q0l6mg2jvd3nr1g-plpgsql_check.drv197  /nix/store/83ycsfk9ivb7sah3lq89d8hy5rxj5vpp-pg_net-0.20.3.drv198  /nix/store/a0ldx82cv1chkbdks86c8mjp8ps4lfgn-pg_net-0.20.0.drv199  /nix/store/b0270km6h57kbdxfkhagcpsilp239adm-pg_net-0.11.0.drv200  /nix/store/lbqp8bfrqa2xm82ma6wyq1gijyajh6kh-pg_net-0.13.0.drv201  /nix/store/rdglczxf0sk4hhwsppqw13zl43vf5wr0-pg_net-0.14.0.drv202  /nix/store/w7547z9slhcibw4s6cwkag6w1f49317s-pg_net-0.20.4.drv203  /nix/store/vvs47f973jig6lflvm7cidm6m20glpy5-pg_net.drv204  /nix/store/92dxzgq4qn1jl389a931z1n5n1a8s5ns-pg_hashids-1.3.0-cd0e1b31d52b394a0df64079406a14a4f7387cd6.drv205  /nix/store/x1kpz6n29pqn2xm06lprn5kwpr0pjhhx-pg_hashids.drv206  /nix/store/y1p5dlzmilwxqbf3a4c7hl6gp9p84wsl-pgmq-1.5.1.drv207  /nix/store/y5rgrfmhzrjr0j6zil7ksqdbcglh0s8i-pgmq.drv208  /nix/store/jk18akz00pd0nr1pixnq9550lnvycgar-pg_cron-1.6.4.drv209  /nix/store/ybhpqdys29q375m5pxxn2w3cbzgf3mxg-pg_cron.drv210  /nix/store/mpyn776iqdn7h94vlp5yxn83a0y4lchc-pgtap-1.3.3.drv211  /nix/store/psjbrnijdnpqyc9s718av7nwmyk0fays-pgtap-1.3.1.drv212  /nix/store/zf19xpsa8jj4bmx09awww0z16cm79z4g-pgtap.drv213  /nix/store/2fndab8axk4hz4s30ijaxnpa1bc9z1dc-postgresql-and-plugins-17_22.drv214  /nix/store/70bg25srcrfnwivfph4bhslzhigdgpxw-unit-dbus.service.drv215  /nix/store/i3fy4azgna3zl2za0k3pwx70f2sk6hk8-receipt.drv216  /nix/store/w85w5162f9zdpi7g98sjlk186hrrm57p-postgresql-and-plugins-17_22.drv217  /nix/store/amy1ji0k53n9qihnqys9hvlc60bncr1y-system-path.drv218  /nix/store/7ynly7nv4iq2wvhmmg6p100h3wr2dpxd-dbus-1.drv219  /nix/store/v749g53p5djbqg3y7kfvdsw5g535j0js-X-Restart-Triggers-dbus.drv220  /nix/store/n7wg70ga6zm8b0prwd4np0azpi732zji-unit-dbus.service.drv221  /nix/store/bmn9rg4vrb07wyj1ls41afzdzcmhdqcm-user-units.drv222  /nix/store/jika4rfg3aj00vq2nfqx2i6nild4nvd5-unit-dbus.service.drv223  /nix/store/8r4vw45si1w8qby225b0amhay9ybj6c5-postgresql-orioledb-init.drv224  /nix/store/pgysndf7sfj9ifxk4sy1w8qfx2ln1ws6-unit-postgresql.service.drv225  /nix/store/9i9flpkzn6d3cvhin3s644150jhvcazf-supabase-orioledb-db-init.drv226  /nix/store/s4qicdb2kbzvf3lf6m8xidm4lndgs2yl-unit-supabase-db-init.service.drv227  /nix/store/dgm1f7y3gvjqjfv7r4gfa7pjffgzr4nj-system-units.drv228  /nix/store/sc9b344gbckg6fqywin6bhhs882d6mxa-etc.drv229  /nix/store/k4pazrfsvz1hsx7l4d0jsxvan5b3dq49-activate.drv230  /nix/store/m7z7bg6jaainvrfsikwclppim5yf6kn3-nixos-system-server-test.drv231  /nix/store/cpy2j0c5ribiykpjaig0axzryxzh1g69-user-units.drv232  /nix/store/qbfmigmm8fk4v5nhvb8h71hmhmdaky0g-supabase-db-init.drv233  /nix/store/ggfylf6a7iwk3pn3r08m30684z8rrq5l-unit-supabase-db-init.service.drv234  /nix/store/rjsqz027b1xj9q5dymzvs3wbqn2dv53m-postgresql-init.drv235  /nix/store/qsr1582sizlpmavcla4x0gbp3q52g4pd-unit-postgresql.service.drv236  /nix/store/ydkqsx664pp5ndcfl70c84mvxgixix01-system-units.drv237  /nix/store/y3dck3diii9z9x0w771pz541gjd0zwh3-etc.drv238  /nix/store/srl146pjpar66ijj6l2zw99pmy6wpkl9-activate.drv239  /nix/store/9g1i5nj6ki5iylj9b1pa0va72jlmn1wv-nixos-system-server-test.drv240  /nix/store/9ycfv0ahkkahnmw940x08dad2zr7sjgj-closure-info.drv241  /nix/store/jdnzjqsb96phjza6plwl0lk5bm803l44-run-nixos-vm.drv242  /nix/store/7krir41flncm1mmnhx0r153vwam5gr2r-nixos-vm.drv243  /nix/store/yngk2c0qc51lqsp65kmrwf9fwx1v4n7d-nixos-test-driver-orioledb.drv244  /nix/store/l8123sbvlv02rwm614affqrci9pdigmr-vm-test-run-orioledb.drv245building '/nix/store/z008z9r9dipnvldyfh7pklhxwdav0faw-http-1.6.1.drv' on 'ssh-ng://nixbot-remote-build@78.232.36.247'246building '/nix/store/ybhpqdys29q375m5pxxn2w3cbzgf3mxg-pg_cron.drv' on 'ssh-ng://nixbot-remote-build@78.232.36.247'247building '/nix/store/ag5rlkqwfkwlgvxg1yhivjqfcaq2w14v-pg_graphql-1.5.1-mergeless.drv' on 'ssh-ng://nixbot-remote-build@78.232.36.247'248building '/nix/store/ag5rlkqwfkwlgvxg1yhivjqfcaq2w14v-pg_graphql-1.5.1-mergeless.drv'249pg_graphql-1.5.1-mergeless> Running phase: unpackPhase250pg_graphql-1.5.1-mergeless> unpacking source archive /nix/store/dl19m09sy7550fm1aw5x6nr8i8d5clmf-source251pg_graphql-1.5.1-mergeless> source root is source252pg_graphql-1.5.1-mergeless> Executing cargoSetupPostUnpackHook253pg_graphql-1.5.1-mergeless> Finished cargoSetupPostUnpackHook254pg_graphql-1.5.1-mergeless> Running phase: patchPhase255pg_graphql-1.5.1-mergeless> Executing cargoSetupPostPatchHook256pg_graphql-1.5.1-mergeless> Validating consistency between /build/source/Cargo.lock and /build/cargo-vendor-dir/Cargo.lock257pg_graphql-1.5.1-mergeless> Finished cargoSetupPostPatchHook258pg_graphql-1.5.1-mergeless> Running phase: updateAutotoolsGnuConfigScriptsPhase259pg_graphql-1.5.1-mergeless> Running phase: configurePhase260pg_graphql-1.5.1-mergeless> Running phase: buildPhase261pg_graphql-1.5.1-mergeless> Executing cargo-pgrx buildPhase262pg_graphql-1.5.1-mergeless>    Validating /nix/store/48l45fvi99n90x6p9i4cs1lmzby6cb73-postgresql-15.19/bin/pg_config263pg_graphql-1.5.1-mergeless>  Initializing data directory at /build/tmp.JMgQe618mx/data-15264pg_graphql-1.5.1-mergeless> waiting for server to start....2026-10-06 14:01:25.525 GMT [87] LOG:  starting PostgreSQL 15.19 on aarch64-unknown-linux-gnu, compiled by gcc (GCC) 15.2.0, 64-bit265pg_graphql-1.5.1-mergeless> 2026-10-06 14:01:25.529 GMT [87] LOG:  listening on Unix socket "/build/tmp.6Vx13sYyAK/.s.PGSQL.5432"266pg_graphql-1.5.1-mergeless> 2026-10-06 14:01:25.548 GMT [90] LOG:  database system was shut down at 2026-10-06 14:01:24 GMT267pg_graphql-1.5.1-mergeless> 2026-10-06 14:01:25.554 GMT [87] LOG:  database system is ready to accept connections268pg_graphql-1.5.1-mergeless>  done269pg_graphql-1.5.1-mergeless> server started270pg_graphql-1.5.1-mergeless> createuser: error: connection to server at "localhost" (127.0.0.1), port 5432 failed: Connection refused271pg_graphql-1.5.1-mergeless> 	Is the server running on that host and accepting TCP/IP connections?272pg_graphql-1.5.1-mergeless> waiting for server to shut down....2026-10-06 14:01:25.608 GMT [87] LOG:  received fast shutdown request273pg_graphql-1.5.1-mergeless> 2026-10-06 14:01:25.611 GMT [87] LOG:  aborting any active transactions274pg_graphql-1.5.1-mergeless> 2026-10-06 14:01:25.613 GMT [87] LOG:  background worker "logical replication launcher" (PID 93) exited with exit code 1275pg_graphql-1.5.1-mergeless> 2026-10-06 14:01:25.613 GMT [88] LOG:  shutting down276pg_graphql-1.5.1-mergeless> 2026-10-06 14:01:25.616 GMT [88] LOG:  checkpoint starting: shutdown immediate277pg_graphql-1.5.1-mergeless> 2026-10-06 14:01:25.646 GMT [88] LOG:  checkpoint complete: wrote 3 buffers (0.0%); 0 WAL file(s) added, 0 removed, 0 recycled; write=0.010 s, sync=0.005 s, total=0.034 s; sync files=2, longest=0.004 s, average=0.003 s; distance=0 kB, estimate=0 kB278pg_graphql-1.5.1-mergeless> 2026-10-06 14:01:25.651 GMT [87] LOG:  database system is shut down279pg_graphql-1.5.1-mergeless>  done280pg_graphql-1.5.1-mergeless> server stopped281pg_graphql-1.5.1-mergeless> warning: `/build/source/.cargo/config` is deprecated in favor of `config.toml`282pg_graphql-1.5.1-mergeless> note: if you need to support cargo 1.38 or earlier, you can symlink `config` to `config.toml`283pg_graphql-1.5.1-mergeless>        Using PgConfig("pg15") and `pg_config` from /nix/store/48l45fvi99n90x6p9i4cs1lmzby6cb73-postgresql-15.19/bin/pg_config284pg_graphql-1.5.1-mergeless>     Building extension with features  pg15285pg_graphql-1.5.1-mergeless>      Running command "/nix/store/kpxwf6dpminza6mhj8xddnaxx6fgnfy6-rust-default-1.85.1/bin/cargo" "build" "--release" "--features" " pg15" "--no-default-features" "--message-format=json-render-diagnostics" "--frozen" "-j" "2"286pg_graphql-1.5.1-mergeless> warning: `/build/source/.cargo/config` is deprecated in favor of `config.toml`287pg_graphql-1.5.1-mergeless> note: if you need to support cargo 1.38 or earlier, you can symlink `config` to `config.toml`288pg_graphql-1.5.1-mergeless>    Compiling proc-macro2 v1.0.75289pg_graphql-1.5.1-mergeless>    Compiling unicode-ident v1.0.12290pg_graphql-1.5.1-mergeless>    Compiling libc v0.2.151291pg_graphql-1.5.1-mergeless>    Compiling syn v1.0.109292pg_graphql-1.5.1-mergeless>    Compiling thiserror v1.0.56293pg_graphql-1.5.1-mergeless>    Compiling quote v1.0.35294pg_graphql-1.5.1-mergeless>    Compiling syn v2.0.48295pg_graphql-1.5.1-mergeless>    Compiling memchr v2.7.1296pg_graphql-1.5.1-mergeless>    Compiling serde v1.0.194297pg_graphql-1.5.1-mergeless>    Compiling eyre v0.6.11298pg_graphql-1.5.1-mergeless>    Compiling equivalent v1.0.1299pg_graphql-1.5.1-mergeless>    Compiling hashbrown v0.14.3300pg_graphql-1.5.1-mergeless>    Compiling indexmap v2.1.0301pg_graphql-1.5.1-mergeless>    Compiling serde_derive v1.0.194302pg_graphql-1.5.1-mergeless>    Compiling thiserror-impl v1.0.56303pg_graphql-1.5.1-mergeless>    Compiling tinyvec_macros v0.1.1304pg_graphql-1.5.1-mergeless>    Compiling glob v0.3.1305pg_graphql-1.5.1-mergeless>    Compiling serde_json v1.0.111306pg_graphql-1.5.1-mergeless>    Compiling cfg-if v1.0.0307pg_graphql-1.5.1-mergeless>    Compiling clang-sys v1.7.0308pg_graphql-1.5.1-mergeless>    Compiling tinyvec v1.6.0309pg_graphql-1.5.1-mergeless>    Compiling serde_spanned v0.6.5310pg_graphql-1.5.1-mergeless>    Compiling toml_datetime v0.6.5311pg_graphql-1.5.1-mergeless>    Compiling anyhow v1.0.79312pg_graphql-1.5.1-mergeless>    Compiling ucd-trie v0.1.6313pg_graphql-1.5.1-mergeless>    Compiling winnow v0.5.32314pg_graphql-1.5.1-mergeless>    Compiling once_cell v1.19.0315pg_graphql-1.5.1-mergeless>    Compiling indenter v0.3.3316pg_graphql-1.5.1-mergeless>    Compiling pest v2.7.6317pg_graphql-1.5.1-mergeless>    Compiling toml_edit v0.21.0318pg_graphql-1.5.1-mergeless>    Compiling unicode-normalization v0.1.22319pg_graphql-1.5.1-mergeless>    Compiling percent-encoding v2.3.1320pg_graphql-1.5.1-mergeless>    Compiling option-ext v0.2.0321pg_graphql-1.5.1-mergeless>    Compiling minimal-lexical v0.2.1322pg_graphql-1.5.1-mergeless>    Compiling unicode-bidi v0.3.14323pg_graphql-1.5.1-mergeless>    Compiling regex-syntax v0.8.2324pg_graphql-1.5.1-mergeless>    Compiling semver v1.0.21325pg_graphql-1.5.1-mergeless>    Compiling libloading v0.8.1326pg_graphql-1.5.1-mergeless>    Compiling idna v0.5.0327pg_graphql-1.5.1-mergeless>    Compiling regex-automata v0.4.3328pg_graphql-1.5.1-mergeless>    Compiling toml v0.8.8329pg_graphql-1.5.1-mergeless>    Compiling nom v7.1.3330pg_graphql-1.5.1-mergeless>    Compiling dirs-sys v0.4.1331pg_graphql-1.5.1-mergeless>    Compiling form_urlencoded v1.2.1332pg_graphql-1.5.1-mergeless>    Compiling semver-parser v0.10.2333pg_graphql-1.5.1-mergeless>    Compiling itoa v1.0.10334pg_graphql-1.5.1-mergeless>    Compiling ryu v1.0.16335pg_graphql-1.5.1-mergeless>    Compiling bindgen v0.68.1336pg_graphql-1.5.1-mergeless>    Compiling semver v0.11.0337pg_graphql-1.5.1-mergeless>    Compiling pathsearch v0.2.0338pg_graphql-1.5.1-mergeless>    Compiling url v2.5.0339pg_graphql-1.5.1-mergeless>    Compiling cexpr v0.6.0340pg_graphql-1.5.1-mergeless>    Compiling dirs v5.0.1341pg_graphql-1.5.1-mergeless>    Compiling regex v1.10.2342pg_graphql-1.5.1-mergeless>    Compiling cargo_toml v0.16.3343pg_graphql-1.5.1-mergeless>    Compiling getrandom v0.2.11344pg_graphql-1.5.1-mergeless>    Compiling peeking_take_while v0.1.2345pg_graphql-1.5.1-mergeless>    Compiling ident_case v1.0.1346pg_graphql-1.5.1-mergeless>    Compiling same-file v1.0.6347pg_graphql-1.5.1-mergeless>    Compiling unicode-segmentation v1.10.1348pg_graphql-1.5.1-mergeless>    Compiling shlex v1.3.0349pg_graphql-1.5.1-mergeless>    Compiling strsim v0.10.0350pg_graphql-1.5.1-mergeless>    Compiling fnv v1.0.7351pg_graphql-1.5.1-mergeless>    Compiling autocfg v1.1.0352pg_graphql-1.5.1-mergeless>    Compiling bitflags v2.4.1353pg_graphql-1.5.1-mergeless>    Compiling lazy_static v1.4.0354pg_graphql-1.5.1-mergeless>    Compiling owo-colors v3.5.0355pg_graphql-1.5.1-mergeless>    Compiling rustc-hash v1.1.0356pg_graphql-1.5.1-mergeless>    Compiling lazycell v1.3.0357pg_graphql-1.5.1-mergeless>    Compiling fixedbitset v0.4.2358pg_graphql-1.5.1-mergeless>    Compiling byteorder v1.5.0359pg_graphql-1.5.1-mergeless>    Compiling petgraph v0.6.4360pg_graphql-1.5.1-mergeless>    Compiling pgrx-pg-config v0.11.2361pg_graphql-1.5.1-mergeless>    Compiling memoffset v0.9.0362pg_graphql-1.5.1-mergeless>    Compiling darling_core v0.14.4363pg_graphql-1.5.1-mergeless>    Compiling convert_case v0.6.0364pg_graphql-1.5.1-mergeless>    Compiling walkdir v2.4.0365pg_graphql-1.5.1-mergeless>    Compiling rustc_version v0.4.0366pg_graphql-1.5.1-mergeless>    Compiling rustc_version v0.3.3367pg_graphql-1.5.1-mergeless>    Compiling radium v0.7.0368pg_graphql-1.5.1-mergeless>    Compiling unescape v0.1.0369pg_graphql-1.5.1-mergeless>    Compiling pgrx-sql-entity-graph v0.11.2370pg_graphql-1.5.1-mergeless>    Compiling pgrx-pg-sys v0.11.2371pg_graphql-1.5.1-mergeless>    Compiling atomic-traits v0.3.0372pg_graphql-1.5.1-mergeless>    Compiling heapless v0.7.17373pg_graphql-1.5.1-mergeless>    Compiling darling_macro v0.14.4374pg_graphql-1.5.1-mergeless>    Compiling either v1.9.0375pg_graphql-1.5.1-mergeless>    Compiling tap v1.0.1376pg_graphql-1.5.1-mergeless>    Compiling void v1.0.2377pg_graphql-1.5.1-mergeless>    Compiling unreachable v1.0.0378pg_graphql-1.5.1-mergeless>    Compiling wyz v0.5.1379pg_graphql-1.5.1-mergeless>    Compiling darling v0.14.4380pg_graphql-1.5.1-mergeless>    Compiling pgrx-macros v0.11.2381pg_graphql-1.5.1-mergeless>    Compiling hash32 v0.2.1382pg_graphql-1.5.1-mergeless>    Compiling rand_core v0.6.4383pg_graphql-1.5.1-mergeless>    Compiling enum-map-derive v0.17.0384pg_graphql-1.5.1-mergeless>    Compiling funty v2.0.0385pg_graphql-1.5.1-mergeless>    Compiling half v1.8.2386pg_graphql-1.5.1-mergeless>    Compiling stable_deref_trait v1.2.0387pg_graphql-1.5.1-mergeless>    Compiling ascii v0.9.3388pg_graphql-1.5.1-mergeless>    Compiling sptr v0.3.2389pg_graphql-1.5.1-mergeless>    Compiling ppv-lite86 v0.2.17390pg_graphql-1.5.1-mergeless>    Compiling rand_chacha v0.3.1391pg_graphql-1.5.1-mergeless>    Compiling combine v3.8.1392pg_graphql-1.5.1-mergeless>    Compiling serde_cbor v0.11.2393pg_graphql-1.5.1-mergeless>    Compiling bitvec v1.0.1394pg_graphql-1.5.1-mergeless>    Compiling enum-map v2.7.3395pg_graphql-1.5.1-mergeless>    Compiling cached_proc_macro v0.18.1396pg_graphql-1.5.1-mergeless>    Compiling uuid v1.6.1397pg_graphql-1.5.1-mergeless>    Compiling instant v0.1.12398pg_graphql-1.5.1-mergeless>    Compiling cached_proc_macro_types v0.1.0399pg_graphql-1.5.1-mergeless>    Compiling seahash v4.1.0400pg_graphql-1.5.1-mergeless>    Compiling seq-macro v0.3.5401pg_graphql-1.5.1-mergeless>    Compiling cached v0.46.1402pg_graphql-1.5.1-mergeless>    Compiling pgrx v0.11.2403pg_graphql-1.5.1-mergeless>    Compiling graphql-parser v0.4.0404pg_graphql-1.5.1-mergeless>    Compiling rand v0.8.5405pg_graphql-1.5.1-mergeless>    Compiling itertools v0.10.5406pg_graphql-1.5.1-mergeless>    Compiling bimap v0.6.3407pg_graphql-1.5.1-mergeless>    Compiling base64 v0.13.1408pg_graphql-1.5.1-mergeless>    Compiling pg_graphql v1.5.1-mergeless (/build/source)409pg_graphql-1.5.1-mergeless> warning: unexpected `cfg` condition value: `pg11`410pg_graphql-1.5.1-mergeless>   --> src/lib.rs:17:1411pg_graphql-1.5.1-mergeless>    |412pg_graphql-1.5.1-mergeless> 17 | pg_module_magic!();413pg_graphql-1.5.1-mergeless>    | ^^^^^^^^^^^^^^^^^^414pg_graphql-1.5.1-mergeless>    |415pg_graphql-1.5.1-mergeless>    = note: expected values for `feature` are: `default`, `pg14`, `pg15`, `pg16`, and `pg_test`416pg_graphql-1.5.1-mergeless>    = note: using a cfg inside a macro will use the cfgs from the destination crate and not the ones from the defining crate417pg_graphql-1.5.1-mergeless>    = help: try referring to `$crate::pg_magic_func` crate for guidance on how handle this unexpected cfg418pg_graphql-1.5.1-mergeless>    = help: the macro `$crate::pg_magic_func` may come from an old version of the `pgrx` crate, try updating your dependency with `cargo update -p pgrx`419pg_graphql-1.5.1-mergeless>    = note: see <https://doc.rust-lang.org/nightly/rustc/check-cfg/cargo-specifics.html> for more information about checking conditional configuration420pg_graphql-1.5.1-mergeless>    = note: `#[warn(unexpected_cfgs)]` on by default421pg_graphql-1.5.1-mergeless>    = note: this warning originates in the macro `$crate::pg_magic_func` which comes from the expansion of the macro `pg_module_magic` (in Nightly builds, run with -Z macro-backtrace for more info)422pg_graphql-1.5.1-mergeless> 423pg_graphql-1.5.1-mergeless> warning: unexpected `cfg` condition value: `pg12`424pg_graphql-1.5.1-mergeless>   --> src/lib.rs:17:1425pg_graphql-1.5.1-mergeless>    |426pg_graphql-1.5.1-mergeless> 17 | pg_module_magic!();427pg_graphql-1.5.1-mergeless>    | ^^^^^^^^^^^^^^^^^^428pg_graphql-1.5.1-mergeless>    |429pg_graphql-1.5.1-mergeless>    = note: expected values for `feature` are: `default`, `pg14`, `pg15`, `pg16`, and `pg_test`430pg_graphql-1.5.1-mergeless>    = note: using a cfg inside a macro will use the cfgs from the destination crate and not the ones from the defining crate431pg_graphql-1.5.1-mergeless>    = help: try referring to `$crate::pg_magic_func` crate for guidance on how handle this unexpected cfg432pg_graphql-1.5.1-mergeless>    = help: the macro `$crate::pg_magic_func` may come from an old version of the `pgrx` crate, try updating your dependency with `cargo update -p pgrx`433pg_graphql-1.5.1-mergeless>    = note: see <https://doc.rust-lang.org/nightly/rustc/check-cfg/cargo-specifics.html> for more information about checking conditional configuration434pg_graphql-1.5.1-mergeless>    = note: this warning originates in the macro `$crate::pg_magic_func` which comes from the expansion of the macro `pg_module_magic` (in Nightly builds, run with -Z macro-backtrace for more info)435pg_graphql-1.5.1-mergeless> 436pg_graphql-1.5.1-mergeless> warning: unexpected `cfg` condition value: `pg13`437pg_graphql-1.5.1-mergeless>   --> src/lib.rs:17:1438pg_graphql-1.5.1-mergeless>    |439pg_graphql-1.5.1-mergeless> 17 | pg_module_magic!();440pg_graphql-1.5.1-mergeless>    | ^^^^^^^^^^^^^^^^^^441pg_graphql-1.5.1-mergeless>    |442pg_graphql-1.5.1-mergeless>    = note: expected values for `feature` are: `default`, `pg14`, `pg15`, `pg16`, and `pg_test`443pg_graphql-1.5.1-mergeless>    = note: using a cfg inside a macro will use the cfgs from the destination crate and not the ones from the defining crate444pg_graphql-1.5.1-mergeless>    = help: try referring to `$crate::pg_magic_func` crate for guidance on how handle this unexpected cfg445pg_graphql-1.5.1-mergeless>    = help: the macro `$crate::pg_magic_func` may come from an old version of the `pgrx` crate, try updating your dependency with `cargo update -p pgrx`446pg_graphql-1.5.1-mergeless>    = note: see <https://doc.rust-lang.org/nightly/rustc/check-cfg/cargo-specifics.html> for more information about checking conditional configuration447pg_graphql-1.5.1-mergeless>    = note: this warning originates in the macro `$crate::pg_magic_func` which comes from the expansion of the macro `pg_module_magic` (in Nightly builds, run with -Z macro-backtrace for more info)448pg_graphql-1.5.1-mergeless> 449pg_graphql-1.5.1-mergeless> warning: field `alias` is never read450pg_graphql-1.5.1-mergeless>   --> src/builder.rs:14:9451pg_graphql-1.5.1-mergeless>    |452pg_graphql-1.5.1-mergeless> 13 | pub struct InsertBuilder {453pg_graphql-1.5.1-mergeless>    |            ------------- field in this struct454pg_graphql-1.5.1-mergeless> 14 |     pub alias: String,455pg_graphql-1.5.1-mergeless>    |         ^^^^^456pg_graphql-1.5.1-mergeless>    |457pg_graphql-1.5.1-mergeless>    = note: `InsertBuilder` has derived impls for the traits `Debug` and `Clone`, but these are intentionally ignored during dead code analysis458pg_graphql-1.5.1-mergeless>    = note: `#[warn(dead_code)]` on by default459pg_graphql-1.5.1-mergeless> 460pg_graphql-1.5.1-mergeless> warning: field `alias` is never read461pg_graphql-1.5.1-mergeless>    --> src/builder.rs:336:9462pg_graphql-1.5.1-mergeless>     |463pg_graphql-1.5.1-mergeless> 335 | pub struct UpdateBuilder {464pg_graphql-1.5.1-mergeless>     |            ------------- field in this struct465pg_graphql-1.5.1-mergeless> 336 |     pub alias: String,466pg_graphql-1.5.1-mergeless>     |         ^^^^^467pg_graphql-1.5.1-mergeless>     |468pg_graphql-1.5.1-mergeless>     = note: `UpdateBuilder` has derived impls for the traits `Debug` and `Clone`, but these are intentionally ignored during dead code analysis469pg_graphql-1.5.1-mergeless> 470pg_graphql-1.5.1-mergeless> warning: field `alias` is never read471pg_graphql-1.5.1-mergeless>    --> src/builder.rs:507:9472pg_graphql-1.5.1-mergeless>     |473pg_graphql-1.5.1-mergeless> 506 | pub struct DeleteBuilder {474pg_graphql-1.5.1-mergeless>     |            ------------- field in this struct475pg_graphql-1.5.1-mergeless> 507 |     pub alias: String,476pg_graphql-1.5.1-mergeless>     |         ^^^^^477pg_graphql-1.5.1-mergeless>     |478pg_graphql-1.5.1-mergeless>     = note: `DeleteBuilder` has derived impls for the traits `Debug` and `Clone`, but these are intentionally ignored during dead code analysis479pg_graphql-1.5.1-mergeless> 480pg_graphql-1.5.1-mergeless> warning: field `alias` is never read481pg_graphql-1.5.1-mergeless>    --> src/builder.rs:608:9482pg_graphql-1.5.1-mergeless>     |483pg_graphql-1.5.1-mergeless> 607 | pub struct FunctionCallBuilder {484pg_graphql-1.5.1-mergeless>     |            ------------------- field in this struct485pg_graphql-1.5.1-mergeless> 608 |     pub alias: String,486pg_graphql-1.5.1-mergeless>     |         ^^^^^487pg_graphql-1.5.1-mergeless> 488pg_graphql-1.5.1-mergeless> warning: field `schema` is never read489pg_graphql-1.5.1-mergeless>     --> src/builder.rs:1971:9490pg_graphql-1.5.1-mergeless>      |491pg_graphql-1.5.1-mergeless> 1970 | pub struct __SchemaBuilder {492pg_graphql-1.5.1-mergeless>      |            --------------- field in this struct493pg_graphql-1.5.1-mergeless> 1971 |     pub schema: __Schema,494pg_graphql-1.5.1-mergeless>      |         ^^^^^^495pg_graphql-1.5.1-mergeless>      |496pg_graphql-1.5.1-mergeless>      = note: `__SchemaBuilder` has a derived impl for the trait `Clone`, but this is intentionally ignored during dead code analysis497pg_graphql-1.5.1-mergeless> 498pg_graphql-1.5.1-mergeless> warning: method `arg_map` is never used499pg_graphql-1.5.1-mergeless>    --> src/graphql.rs:349:8500pg_graphql-1.5.1-mergeless>     |501pg_graphql-1.5.1-mergeless> 325 | pub trait ___Field {502pg_graphql-1.5.1-mergeless>     |           -------- method in this trait503pg_graphql-1.5.1-mergeless> ...504pg_graphql-1.5.1-mergeless> 349 |     fn arg_map(&self) -> HashMap<String, __InputValue> {505pg_graphql-1.5.1-mergeless>     |        ^^^^^^^506pg_graphql-1.5.1-mergeless> 507pg_graphql-1.5.1-mergeless> warning: `pg_graphql` (lib) generated 9 warnings508pg_graphql-1.5.1-mergeless>     Finished `release` profile [optimized] target(s) in 6m 39s509pg_graphql-1.5.1-mergeless>   Installing extension510pg_graphql-1.5.1-mergeless>      Copying control file to /nix/store/8nmsf42hcxrmwxq35zawn8j2jxk73c55-pg_graphql-1.5.1-mergeless/nix/store/48l45fvi99n90x6p9i4cs1lmzby6cb73-postgresql-15.19/share/postgresql/extension/pg_graphql.control511pg_graphql-1.5.1-mergeless>      Copying shared library to /nix/store/8nmsf42hcxrmwxq35zawn8j2jxk73c55-pg_graphql-1.5.1-mergeless/nix/store/k4dpm55d68aq0df72hjk046xy1124lhn-postgresql-15.19-lib/lib/pg_graphql.so512pg_graphql-1.5.1-mergeless>  Discovering SQL entities513pg_graphql-1.5.1-mergeless>   Discovered 5 SQL entities: 0 schemas (0 unique), 1 functions, 0 types, 0 enums, 4 sqls, 0 ords, 0 hashes, 0 aggregates, 0 triggers514pg_graphql-1.5.1-mergeless>      Writing SQL entities to /nix/store/8nmsf42hcxrmwxq35zawn8j2jxk73c55-pg_graphql-1.5.1-mergeless/nix/store/48l45fvi99n90x6p9i4cs1lmzby6cb73-postgresql-15.19/share/postgresql/extension/pg_graphql--1.5.1-mergeless.sql515pg_graphql-1.5.1-mergeless>     Finished installing pg_graphql516pg_graphql-1.5.1-mergeless> buildPhase completed in 6 minutes 55 seconds517pg_graphql-1.5.1-mergeless> Running phase: checkPhase518pg_graphql-1.5.1-mergeless>    Validating /nix/store/48l45fvi99n90x6p9i4cs1lmzby6cb73-postgresql-15.19/bin/pg_config519pg_graphql-1.5.1-mergeless>  Initializing data directory at /build/tmp.M1rYYmSQ4O/data-15520pg_graphql-1.5.1-mergeless> waiting for server to start....2026-10-06 14:08:18.970 GMT [2079] LOG:  starting PostgreSQL 15.19 on aarch64-unknown-linux-gnu, compiled by gcc (GCC) 15.2.0, 64-bit521pg_graphql-1.5.1-mergeless> 2026-10-06 14:08:18.976 GMT [2079] LOG:  listening on Unix socket "/build/tmp.XFWo16Q9OJ/.s.PGSQL.5432"522pg_graphql-1.5.1-mergeless> 2026-10-06 14:08:18.983 GMT [2082] LOG:  database system was shut down at 2026-10-06 14:08:18 GMT523pg_graphql-1.5.1-mergeless> 2026-10-06 14:08:18.990 GMT [2079] LOG:  database system is ready to accept connections524pg_graphql-1.5.1-mergeless>  done525pg_graphql-1.5.1-mergeless> server started526pg_graphql-1.5.1-mergeless> createuser: error: connection to server at "localhost" (127.0.0.1), port 5432 failed: Connection refused527pg_graphql-1.5.1-mergeless> 	Is the server running on that host and accepting TCP/IP connections?528pg_graphql-1.5.1-mergeless> waiting for server to shut down....2026-10-06 14:08:19.055 GMT [2079] LOG:  received fast shutdown request529pg_graphql-1.5.1-mergeless> 2026-10-06 14:08:19.057 GMT [2079] LOG:  aborting any active transactions530pg_graphql-1.5.1-mergeless> 2026-10-06 14:08:19.059 GMT [2079] LOG:  background worker "logical replication launcher" (PID 2085) exited with exit code 1531pg_graphql-1.5.1-mergeless> 2026-10-06 14:08:19.060 GMT [2080] LOG:  shutting down532pg_graphql-1.5.1-mergeless> 2026-10-06 14:08:19.063 GMT [2080] LOG:  checkpoint starting: shutdown immediate533pg_graphql-1.5.1-mergeless> 2026-10-06 14:08:19.084 GMT [2080] LOG:  checkpoint complete: wrote 3 buffers (0.0%); 0 WAL file(s) added, 0 removed, 0 recycled; write=0.012 s, sync=0.002 s, total=0.025 s; sync files=2, longest=0.001 s, average=0.001 s; distance=0 kB, estimate=0 kB534pg_graphql-1.5.1-mergeless> 2026-10-06 14:08:19.089 GMT [2079] LOG:  database system is shut down535pg_graphql-1.5.1-mergeless>  done536pg_graphql-1.5.1-mergeless> server stopped537pg_graphql-1.5.1-mergeless> warning: `/build/source/.cargo/config` is deprecated in favor of `config.toml`538pg_graphql-1.5.1-mergeless> note: if you need to support cargo 1.38 or earlier, you can symlink `config` to `config.toml`539pg_graphql-1.5.1-mergeless>    Validating /build/tmp.2OH3uQe7mr/15/bin/pg_config540pg_graphql-1.5.1-mergeless>  Initializing data directory at /build/tmp.2OH3uQe7mr/data-15541pg_graphql-1.5.1-mergeless> warning: `/build/source/.cargo/config` is deprecated in favor of `config.toml`542pg_graphql-1.5.1-mergeless> note: if you need to support cargo 1.38 or earlier, you can symlink `config` to `config.toml`543pg_graphql-1.5.1-mergeless>        Using PgConfig("pg15") and `pg_config` from /build/tmp.2OH3uQe7mr/15/bin/pg_config544pg_graphql-1.5.1-mergeless>     Building extension with features pg15545pg_graphql-1.5.1-mergeless>      Running command "/nix/store/kpxwf6dpminza6mhj8xddnaxx6fgnfy6-rust-default-1.85.1/bin/cargo" "build" "--release" "--features" "pg15" "--no-default-features" "--message-format=json-render-diagnostics" "--frozen" "-j" "2"546pg_graphql-1.5.1-mergeless> warning: `/build/source/.cargo/config` is deprecated in favor of `config.toml`547pg_graphql-1.5.1-mergeless> note: if you need to support cargo 1.38 or earlier, you can symlink `config` to `config.toml`548pg_graphql-1.5.1-mergeless> warning: unexpected `cfg` condition value: `pg11`549pg_graphql-1.5.1-mergeless>   --> src/lib.rs:17:1550pg_graphql-1.5.1-mergeless>    |551pg_graphql-1.5.1-mergeless> 17 | pg_module_magic!();552pg_graphql-1.5.1-mergeless>    | ^^^^^^^^^^^^^^^^^^553pg_graphql-1.5.1-mergeless>    |554pg_graphql-1.5.1-mergeless>    = note: expected values for `feature` are: `default`, `pg14`, `pg15`, `pg16`, and `pg_test`555pg_graphql-1.5.1-mergeless>    = note: using a cfg inside a macro will use the cfgs from the destination crate and not the ones from the defining crate556pg_graphql-1.5.1-mergeless>    = help: try referring to `$crate::pg_magic_func` crate for guidance on how handle this unexpected cfg557pg_graphql-1.5.1-mergeless>    = help: the macro `$crate::pg_magic_func` may come from an old version of the `pgrx` crate, try updating your dependency with `cargo update -p pgrx`558pg_graphql-1.5.1-mergeless>    = note: see <https://doc.rust-lang.org/nightly/rustc/check-cfg/cargo-specifics.html> for more information about checking conditional configuration559pg_graphql-1.5.1-mergeless>    = note: `#[warn(unexpected_cfgs)]` on by default560pg_graphql-1.5.1-mergeless>    = note: this warning originates in the macro `$crate::pg_magic_func` which comes from the expansion of the macro `pg_module_magic` (in Nightly builds, run with -Z macro-backtrace for more info)561pg_graphql-1.5.1-mergeless> 562pg_graphql-1.5.1-mergeless> warning: unexpected `cfg` condition value: `pg12`563pg_graphql-1.5.1-mergeless>   --> src/lib.rs:17:1564pg_graphql-1.5.1-mergeless>    |565pg_graphql-1.5.1-mergeless> 17 | pg_module_magic!();566pg_graphql-1.5.1-mergeless>    | ^^^^^^^^^^^^^^^^^^567pg_graphql-1.5.1-mergeless>    |568pg_graphql-1.5.1-mergeless>    = note: expected values for `feature` are: `default`, `pg14`, `pg15`, `pg16`, and `pg_test`569pg_graphql-1.5.1-mergeless>    = note: using a cfg inside a macro will use the cfgs from the destination crate and not the ones from the defining crate570pg_graphql-1.5.1-mergeless>    = help: try referring to `$crate::pg_magic_func` crate for guidance on how handle this unexpected cfg571pg_graphql-1.5.1-mergeless>    = help: the macro `$crate::pg_magic_func` may come from an old version of the `pgrx` crate, try updating your dependency with `cargo update -p pgrx`572pg_graphql-1.5.1-mergeless>    = note: see <https://doc.rust-lang.org/nightly/rustc/check-cfg/cargo-specifics.html> for more information about checking conditional configuration573pg_graphql-1.5.1-mergeless>    = note: this warning originates in the macro `$crate::pg_magic_func` which comes from the expansion of the macro `pg_module_magic` (in Nightly builds, run with -Z macro-backtrace for more info)574pg_graphql-1.5.1-mergeless> 575pg_graphql-1.5.1-mergeless> warning: unexpected `cfg` condition value: `pg13`576pg_graphql-1.5.1-mergeless>   --> src/lib.rs:17:1577pg_graphql-1.5.1-mergeless>    |578pg_graphql-1.5.1-mergeless> 17 | pg_module_magic!();579pg_graphql-1.5.1-mergeless>    | ^^^^^^^^^^^^^^^^^^580pg_graphql-1.5.1-mergeless>    |581pg_graphql-1.5.1-mergeless>    = note: expected values for `feature` are: `default`, `pg14`, `pg15`, `pg16`, and `pg_test`582pg_graphql-1.5.1-mergeless>    = note: using a cfg inside a macro will use the cfgs from the destination crate and not the ones from the defining crate583pg_graphql-1.5.1-mergeless>    = help: try referring to `$crate::pg_magic_func` crate for guidance on how handle this unexpected cfg584pg_graphql-1.5.1-mergeless>    = help: the macro `$crate::pg_magic_func` may come from an old version of the `pgrx` crate, try updating your dependency with `cargo update -p pgrx`585pg_graphql-1.5.1-mergeless>    = note: see <https://doc.rust-lang.org/nightly/rustc/check-cfg/cargo-specifics.html> for more information about checking conditional configuration586pg_graphql-1.5.1-mergeless>    = note: this warning originates in the macro `$crate::pg_magic_func` which comes from the expansion of the macro `pg_module_magic` (in Nightly builds, run with -Z macro-backtrace for more info)587pg_graphql-1.5.1-mergeless> 588pg_graphql-1.5.1-mergeless> warning: field `alias` is never read589pg_graphql-1.5.1-mergeless>   --> src/builder.rs:14:9590pg_graphql-1.5.1-mergeless>    |591pg_graphql-1.5.1-mergeless> 13 | pub struct InsertBuilder {592pg_graphql-1.5.1-mergeless>    |            ------------- field in this struct593pg_graphql-1.5.1-mergeless> 14 |     pub alias: String,594pg_graphql-1.5.1-mergeless>    |         ^^^^^595pg_graphql-1.5.1-mergeless>    |596pg_graphql-1.5.1-mergeless>    = note: `InsertBuilder` has derived impls for the traits `Debug` and `Clone`, but these are intentionally ignored during dead code analysis597pg_graphql-1.5.1-mergeless>    = note: `#[warn(dead_code)]` on by default598pg_graphql-1.5.1-mergeless> 599pg_graphql-1.5.1-mergeless> warning: field `alias` is never read600pg_graphql-1.5.1-mergeless>    --> src/builder.rs:336:9601pg_graphql-1.5.1-mergeless>     |602pg_graphql-1.5.1-mergeless> 335 | pub struct UpdateBuilder {603pg_graphql-1.5.1-mergeless>     |            ------------- field in this struct604pg_graphql-1.5.1-mergeless> 336 |     pub alias: String,605pg_graphql-1.5.1-mergeless>     |         ^^^^^606pg_graphql-1.5.1-mergeless>     |607pg_graphql-1.5.1-mergeless>     = note: `UpdateBuilder` has derived impls for the traits `Debug` and `Clone`, but these are intentionally ignored during dead code analysis608pg_graphql-1.5.1-mergeless> 609pg_graphql-1.5.1-mergeless> warning: field `alias` is never read610pg_graphql-1.5.1-mergeless>    --> src/builder.rs:507:9611pg_graphql-1.5.1-mergeless>     |612pg_graphql-1.5.1-mergeless> 506 | pub struct DeleteBuilder {613pg_graphql-1.5.1-mergeless>     |            ------------- field in this struct614pg_graphql-1.5.1-mergeless> 507 |     pub alias: String,615pg_graphql-1.5.1-mergeless>     |         ^^^^^616pg_graphql-1.5.1-mergeless>     |617pg_graphql-1.5.1-mergeless>     = note: `DeleteBuilder` has derived impls for the traits `Debug` and `Clone`, but these are intentionally ignored during dead code analysis618pg_graphql-1.5.1-mergeless> 619pg_graphql-1.5.1-mergeless> warning: field `alias` is never read620pg_graphql-1.5.1-mergeless>    --> src/builder.rs:608:9621pg_graphql-1.5.1-mergeless>     |622pg_graphql-1.5.1-mergeless> 607 | pub struct FunctionCallBuilder {623pg_graphql-1.5.1-mergeless>     |            ------------------- field in this struct624pg_graphql-1.5.1-mergeless> 608 |     pub alias: String,625pg_graphql-1.5.1-mergeless>     |         ^^^^^626pg_graphql-1.5.1-mergeless> 627pg_graphql-1.5.1-mergeless> warning: field `schema` is never read628pg_graphql-1.5.1-mergeless>     --> src/builder.rs:1971:9629pg_graphql-1.5.1-mergeless>      |630pg_graphql-1.5.1-mergeless> 1970 | pub struct __SchemaBuilder {631pg_graphql-1.5.1-mergeless>      |            --------------- field in this struct632pg_graphql-1.5.1-mergeless> 1971 |     pub schema: __Schema,633pg_graphql-1.5.1-mergeless>      |         ^^^^^^634pg_graphql-1.5.1-mergeless>      |635pg_graphql-1.5.1-mergeless>      = note: `__SchemaBuilder` has a derived impl for the trait `Clone`, but this is intentionally ignored during dead code analysis636pg_graphql-1.5.1-mergeless> 637pg_graphql-1.5.1-mergeless> warning: method `arg_map` is never used638pg_graphql-1.5.1-mergeless>    --> src/graphql.rs:349:8639pg_graphql-1.5.1-mergeless>     |640pg_graphql-1.5.1-mergeless> 325 | pub trait ___Field {641pg_graphql-1.5.1-mergeless>     |           -------- method in this trait642pg_graphql-1.5.1-mergeless> ...643pg_graphql-1.5.1-mergeless> 349 |     fn arg_map(&self) -> HashMap<String, __InputValue> {644pg_graphql-1.5.1-mergeless>     |        ^^^^^^^645pg_graphql-1.5.1-mergeless> 646pg_graphql-1.5.1-mergeless> warning: `pg_graphql` (lib) generated 9 warnings647pg_graphql-1.5.1-mergeless>     Finished `release` profile [optimized] target(s) in 0.12s648pg_graphql-1.5.1-mergeless>   Installing extension649pg_graphql-1.5.1-mergeless>      Copying control file to /build/tmp.2OH3uQe7mr/15/share/postgresql/extension/pg_graphql.control650pg_graphql-1.5.1-mergeless>      Copying shared library to /build/tmp.2OH3uQe7mr/15/lib/pg_graphql.so651pg_graphql-1.5.1-mergeless>  Discovering SQL entities652pg_graphql-1.5.1-mergeless>   Discovered 5 SQL entities: 0 schemas (0 unique), 1 functions, 0 types, 0 enums, 4 sqls, 0 ords, 0 hashes, 0 aggregates, 0 triggers653pg_graphql-1.5.1-mergeless>      Writing SQL entities to /build/tmp.2OH3uQe7mr/15/share/postgresql/extension/pg_graphql--1.5.1-mergeless.sql654pg_graphql-1.5.1-mergeless>     Finished installing pg_graphql655pg_graphql-1.5.1-mergeless> ++ mktemp -d656pg_graphql-1.5.1-mergeless> + TMPDIR=/build/tmp.8GOtftRc0C657pg_graphql-1.5.1-mergeless> + export PGDATA=/build/tmp.8GOtftRc0C658pg_graphql-1.5.1-mergeless> + PGDATA=/build/tmp.8GOtftRc0C659pg_graphql-1.5.1-mergeless> + export PGHOST=/build/tmp.8GOtftRc0C660pg_graphql-1.5.1-mergeless> + PGHOST=/build/tmp.8GOtftRc0C661pg_graphql-1.5.1-mergeless> + export PGUSER=postgres662pg_graphql-1.5.1-mergeless> + PGUSER=postgres663pg_graphql-1.5.1-mergeless> + export PGDATABASE=postgres664pg_graphql-1.5.1-mergeless> + PGDATABASE=postgres665pg_graphql-1.5.1-mergeless> + export PGTZ=UTC666pg_graphql-1.5.1-mergeless> + PGTZ=UTC667pg_graphql-1.5.1-mergeless> + export PG_COLOR=auto668pg_graphql-1.5.1-mergeless> + PG_COLOR=auto669pg_graphql-1.5.1-mergeless> + trap 'pg_ctl stop -m i' sigint sigterm exit670pg_graphql-1.5.1-mergeless> + rm -rf /build/tmp.8GOtftRc0C671pg_graphql-1.5.1-mergeless> + initdb --no-locale --encoding=UTF8 --nosync -U postgres672pg_graphql-1.5.1-mergeless> The files belonging to this database system will be owned by user "nixbld".673pg_graphql-1.5.1-mergeless> This user must also own the server process.674pg_graphql-1.5.1-mergeless> 675pg_graphql-1.5.1-mergeless> The database cluster will be initialized with locale "C".676pg_graphql-1.5.1-mergeless> The default text search configuration will be set to "english".677pg_graphql-1.5.1-mergeless> 678pg_graphql-1.5.1-mergeless> Data page checksums are disabled.679pg_graphql-1.5.1-mergeless> 680pg_graphql-1.5.1-mergeless> creating directory /build/tmp.8GOtftRc0C ... ok681pg_graphql-1.5.1-mergeless> creating subdirectories ... ok682pg_graphql-1.5.1-mergeless> selecting dynamic shared memory implementation ... posix683pg_graphql-1.5.1-mergeless> selecting default max_connections ... 100684pg_graphql-1.5.1-mergeless> selecting default shared_buffers ... 128MB685pg_graphql-1.5.1-mergeless> selecting default time zone ... UTC686pg_graphql-1.5.1-mergeless> creating configuration files ... ok687pg_graphql-1.5.1-mergeless> running bootstrap script ... ok688pg_graphql-1.5.1-mergeless> performing post-bootstrap initialization ... ok689pg_graphql-1.5.1-mergeless> 690pg_graphql-1.5.1-mergeless> Sync to disk skipped.691pg_graphql-1.5.1-mergeless> The data directory might become corrupt if the operating system crashes.692pg_graphql-1.5.1-mergeless> 693pg_graphql-1.5.1-mergeless> initdb: warning: enabling "trust" authentication for local connections694pg_graphql-1.5.1-mergeless> initdb: hint: You can change this by editing pg_hba.conf or using the option -A, or --auth-local and --auth-host, the next time you run initdb.695pg_graphql-1.5.1-mergeless> 696pg_graphql-1.5.1-mergeless> Success. You can now start the database server using:697pg_graphql-1.5.1-mergeless> 698pg_graphql-1.5.1-mergeless>     /build/tmp.2OH3uQe7mr/15/bin/pg_ctl -D /build/tmp.8GOtftRc0C -l logfile start699pg_graphql-1.5.1-mergeless> 700pg_graphql-1.5.1-mergeless> + pg_ctl start -o '-F -c listen_addresses="" -c log_min_messages=WARNING -k /build/tmp.8GOtftRc0C'701pg_graphql-1.5.1-mergeless> waiting for server to start....2026-10-06 14:08:34.098 UTC [2170] LOG:  starting PostgreSQL 15.19 on aarch64-unknown-linux-gnu, compiled by gcc (GCC) 15.2.0, 64-bit702pg_graphql-1.5.1-mergeless> 2026-10-06 14:08:34.098 UTC [2170] LOG:  listening on Unix socket "/build/tmp.8GOtftRc0C/.s.PGSQL.5432"703pg_graphql-1.5.1-mergeless> 2026-10-06 14:08:34.100 UTC [2173] LOG:  database system was shut down at 2026-10-06 14:08:34 UTC704pg_graphql-1.5.1-mergeless> 2026-10-06 14:08:34.104 UTC [2170] LOG:  database system is ready to accept connections705pg_graphql-1.5.1-mergeless>  done706pg_graphql-1.5.1-mergeless> server started707pg_graphql-1.5.1-mergeless> + createdb contrib_regression708pg_graphql-1.5.1-mergeless> + TESTDIR=test709pg_graphql-1.5.1-mergeless> +++ pg_config --pgxs710pg_graphql-1.5.1-mergeless> ++ dirname /nix/store/48l45fvi99n90x6p9i4cs1lmzby6cb73-postgresql-15.19/lib/pgxs/src/makefiles/pgxs.mk711pg_graphql-1.5.1-mergeless> + PGXS=/nix/store/48l45fvi99n90x6p9i4cs1lmzby6cb73-postgresql-15.19/lib/pgxs/src/makefiles712pg_graphql-1.5.1-mergeless> + REGRESS=/nix/store/48l45fvi99n90x6p9i4cs1lmzby6cb73-postgresql-15.19/lib/pgxs/src/makefiles/../test/regress/pg_regress713pg_graphql-1.5.1-mergeless> + '[' 0 -ne 0 ']'714pg_graphql-1.5.1-mergeless> ++ ls test/sql715pg_graphql-1.5.1-mergeless> ++ sed -e 's/\..*$//'716pg_graphql-1.5.1-mergeless> ++ sort717pg_graphql-1.5.1-mergeless> + TESTS=$'aliases\nallow_camel_names\narray_args_and_return_types\nbigint_is_string\nbuiltin_directives\ncomment_directive\ncomment_directive_description\ncompound_filters\nempty_mutations\nenum_mappings\nextend_type_with_function\nextend_type_with_function_relation\nextend_type_with_generated_column\nfilter_by_node_id\nfragment_on_mutation\nfragment_on_query\nfunction_calls\nfunction_calls_unsupported\nfunction_return_row_is_selectable\nfunction_return_view_has_pkey\ninflection_fields\ninflection_function\ninflection_relationships\ninflection_types\nissue_163\nissue_170\nissue_225\nissue_300\nissue_306\nissue_312\nissue_334_ambiguous_function\nissue_337\nissue_339_function_return_json\nissue_339_function_return_table\nissue_353_too_many_fields\nissue_370_citext_as_string\nissue_373\nissue_377_enum_search_path\nissue_444\nissue_463\nissue_fragment_spread_cycles\njson_is_stringified\nmax_page_size\nmax_rows_directive\nmulti_column_primary_key\nmultiple_mutations\nmultiple_queries\nmutation_delete\nmutation_delete_variable\nmutation_insert\nmutation_update\nnull_argument\nomit_exotic_types\nomit_weird_names\noperation_name\noverride_enum_name\noverride_field_name\noverride_func_field_name\noverride_relationship_field_name\noverride_type_name\npage_info\npermissions_connection_column\npermissions_functions\npermissions_node_column\npermissions_table_level\npermissions_types\nprimary_key_is_required\nrelationship_one_to_one\nresolve___schema\nresolve___type\nresolve___typename\nresolve_array_type\nresolve_connection_filter\nresolve_connection_named\nresolve_connection_order_by\nresolve_connection_pagination_args\nresolve_connection_to_conn\nresolve_connection_to_node\nresolve_error_connection_edge_no_field\nresolve_error_connection_edge_node_no_field\nresolve_error_connection_no_field\nresolve_error_from_parser\nresolve_error_mutation_no_field\nresolve_error_node_no_field\nresolve_error_query_no_field\nresolve_fragment\nresolve_graphiql_schema\nresolve_one\nroundtrip_types\nrow_level_security\nsqli_connection\nstring_filters\ntest_error_anon_and_named_operations\ntest_error_invalid_offset\ntest_error_multiple_anon_operations\ntest_error_mutation_transpilation\ntest_error_operation_name_not_found\ntest_error_operation_names_not_unique\ntest_error_parsing\ntest_error_query_transpilation\ntest_error_subscription\ntest_query__type\ntotal_count\ntype_bigfloat\ntype_modifier_max_length\ntype_opaque\nvariable_default\nviews_integration'718pg_graphql-1.5.1-mergeless> + psql -v ON_ERROR_STOP=1 -f test/fixtures.sql -d contrib_regression719pg_graphql-1.5.1-mergeless> psql:test/fixtures.sql:1: NOTICE:  extension "pg_graphql" does not exist, skipping720pg_graphql-1.5.1-mergeless> DROP EXTENSION721pg_graphql-1.5.1-mergeless> CREATE EXTENSION722pg_graphql-1.5.1-mergeless> COMMENT723pg_graphql-1.5.1-mergeless> CREATE FUNCTION724pg_graphql-1.5.1-mergeless> + /nix/store/48l45fvi99n90x6p9i4cs1lmzby6cb73-postgresql-15.19/lib/pgxs/src/makefiles/../test/regress/pg_regress --use-existing --dbname=contrib_regression --inputdir=test aliases allow_camel_names array_args_and_return_types bigint_is_string builtin_directives comment_directive comment_directive_description compound_filters empty_mutations enum_mappings extend_type_with_function extend_type_with_function_relation extend_type_with_generated_column filter_by_node_id fragment_on_mutation fragment_on_query function_calls function_calls_unsupported function_return_row_is_selectable function_return_view_has_pkey inflection_fields inflection_function inflection_relationships inflection_types issue_163 issue_170 issue_225 issue_300 issue_306 issue_312 issue_334_ambiguous_function issue_337 issue_339_function_return_json issue_339_function_return_table issue_353_too_many_fields issue_370_citext_as_string issue_373 issue_377_enum_search_path issue_444 issue_463 issue_fragment_spread_cycles json_is_stringified max_page_size max_rows_directive multi_column_primary_key multiple_mutations multiple_queries mutation_delete mutation_delete_variable mutation_insert mutation_update null_argument omit_exotic_types omit_weird_names operation_name override_enum_name override_field_name override_func_field_name override_relationship_field_name override_type_name page_info permissions_connection_column permissions_functions permissions_node_column permissions_table_level permissions_types primary_key_is_required relationship_one_to_one resolve___schema resolve___type resolve___typename resolve_array_type resolve_connection_filter resolve_connection_named resolve_connection_order_by resolve_connection_pagination_args resolve_connection_to_conn resolve_connection_to_node resolve_error_connection_edge_no_field resolve_error_connection_edge_node_no_field resolve_error_connection_no_field resolve_error_from_parser resolve_error_mutation_no_field resolve_error_node_no_field resolve_error_query_no_field resolve_fragment resolve_graphiql_schema resolve_one roundtrip_types row_level_security sqli_connection string_filters test_error_anon_and_named_operations test_error_invalid_offset test_error_multiple_anon_operations test_error_mutation_transpilation test_error_operation_name_not_found test_error_operation_names_not_unique test_error_parsing test_error_query_transpilation test_error_subscription test_query__type total_count type_bigfloat type_modifier_max_length type_opaque variable_default views_integration725pg_graphql-1.5.1-mergeless> (using postmaster on /build/tmp.8GOtftRc0C, default port)726pg_graphql-1.5.1-mergeless> ============== running regression test queries        ==============727pg_graphql-1.5.1-mergeless> test aliases                      ... ok           56 ms728pg_graphql-1.5.1-mergeless> test allow_camel_names            ... ok           56 ms729pg_graphql-1.5.1-mergeless> test array_args_and_return_types  ... ok         1536 ms730pg_graphql-1.5.1-mergeless> test bigint_is_string             ... ok           53 ms731pg_graphql-1.5.1-mergeless> test builtin_directives           ... ok           60 ms732pg_graphql-1.5.1-mergeless> test comment_directive            ... ok            9 ms733pg_graphql-1.5.1-mergeless> test comment_directive_description ... ok           48 ms734pg_graphql-1.5.1-mergeless> test compound_filters             ... ok          248 ms735pg_graphql-1.5.1-mergeless> test empty_mutations              ... ok           49 ms736pg_graphql-1.5.1-mergeless> test enum_mappings                ... ok           56 ms737pg_graphql-1.5.1-mergeless> test extend_type_with_function    ... ok           51 ms738pg_graphql-1.5.1-mergeless> test extend_type_with_function_relation ... ok          138 ms739pg_graphql-1.5.1-mergeless> test extend_type_with_generated_column ... ok           49 ms740pg_graphql-1.5.1-mergeless> test filter_by_node_id            ... ok           54 ms741pg_graphql-1.5.1-mergeless> test fragment_on_mutation         ... ok           47 ms742pg_graphql-1.5.1-mergeless> test fragment_on_query            ... ok           47 ms743pg_graphql-1.5.1-mergeless> test function_calls               ... ok         1294 ms744pg_graphql-1.5.1-mergeless> test function_calls_unsupported   ... ok          289 ms745pg_graphql-1.5.1-mergeless> test function_return_row_is_selectable ... ok           79 ms746pg_graphql-1.5.1-mergeless> test function_return_view_has_pkey ... ok           74 ms747pg_graphql-1.5.1-mergeless> test inflection_fields            ... ok          125 ms748pg_graphql-1.5.1-mergeless> test inflection_function          ... ok          123 ms749pg_graphql-1.5.1-mergeless> test inflection_relationships     ... ok          182 ms750pg_graphql-1.5.1-mergeless> test inflection_types             ... ok          123 ms751pg_graphql-1.5.1-mergeless> test issue_163                    ... ok           47 ms752pg_graphql-1.5.1-mergeless> test issue_170                    ... ok           47 ms753pg_graphql-1.5.1-mergeless> test issue_225                    ... ok           51 ms754pg_graphql-1.5.1-mergeless> test issue_300                    ... ok           50 ms755pg_graphql-1.5.1-mergeless> test issue_306                    ... ok           55 ms756pg_graphql-1.5.1-mergeless> test issue_312                    ... ok           49 ms757pg_graphql-1.5.1-mergeless> test issue_334_ambiguous_function ... ok           51 ms758pg_graphql-1.5.1-mergeless> test issue_337                    ... ok           83 ms759pg_graphql-1.5.1-mergeless> test issue_339_function_return_json ... ok           49 ms760pg_graphql-1.5.1-mergeless> test issue_339_function_return_table ... ok           47 ms761pg_graphql-1.5.1-mergeless> test issue_353_too_many_fields    ... ok           58 ms762pg_graphql-1.5.1-mergeless> test issue_370_citext_as_string   ... ok           65 ms763pg_graphql-1.5.1-mergeless> test issue_373                    ... ok           52 ms764pg_graphql-1.5.1-mergeless> test issue_377_enum_search_path   ... ok           76 ms765pg_graphql-1.5.1-mergeless> test issue_444                    ... ok           44 ms766pg_graphql-1.5.1-mergeless> test issue_463                    ... ok           49 ms767pg_graphql-1.5.1-mergeless> test issue_fragment_spread_cycles ... ok          202 ms768pg_graphql-1.5.1-mergeless> test json_is_stringified          ... ok           53 ms769pg_graphql-1.5.1-mergeless> test max_page_size                ... ok           49 ms770pg_graphql-1.5.1-mergeless> test max_rows_directive           ... ok          100 ms771pg_graphql-1.5.1-mergeless> test multi_column_primary_key     ... ok           60 ms772pg_graphql-1.5.1-mergeless> test multiple_mutations           ... ok           50 ms773pg_graphql-1.5.1-mergeless> test multiple_queries             ... ok           51 ms774pg_graphql-1.5.1-mergeless> test mutation_delete              ... ok           59 ms775pg_graphql-1.5.1-mergeless> test mutation_delete_variable     ... ok           49 ms776pg_graphql-1.5.1-mergeless> test mutation_insert              ... ok           60 ms777pg_graphql-1.5.1-mergeless> test mutation_update              ... ok           65 ms778pg_graphql-1.5.1-mergeless> test null_argument                ... ok           48 ms779pg_graphql-1.5.1-mergeless> test omit_exotic_types            ... ok           49 ms780pg_graphql-1.5.1-mergeless> test omit_weird_names             ... ok           72 ms781pg_graphql-1.5.1-mergeless> test operation_name               ... ok           49 ms782pg_graphql-1.5.1-mergeless> test override_enum_name           ... ok           44 ms783pg_graphql-1.5.1-mergeless> test override_field_name          ... ok           46 ms784pg_graphql-1.5.1-mergeless> test override_func_field_name     ... ok           48 ms785pg_graphql-1.5.1-mergeless> test override_relationship_field_name ... ok           51 ms786pg_graphql-1.5.1-mergeless> test override_type_name           ... ok           47 ms787pg_graphql-1.5.1-mergeless> test page_info                    ... ok           65 ms788pg_graphql-1.5.1-mergeless> test permissions_connection_column ... ok           79 ms789pg_graphql-1.5.1-mergeless> test permissions_functions        ... ok           73 ms790pg_graphql-1.5.1-mergeless> test permissions_node_column      ... ok           81 ms791pg_graphql-1.5.1-mergeless> test permissions_table_level      ... ok          158 ms792pg_graphql-1.5.1-mergeless> test permissions_types            ... ok           96 ms793pg_graphql-1.5.1-mergeless> test primary_key_is_required      ... ok           75 ms794pg_graphql-1.5.1-mergeless> test relationship_one_to_one      ... ok           54 ms795pg_graphql-1.5.1-mergeless> test resolve___schema             ... ok           59 ms796pg_graphql-1.5.1-mergeless> test resolve___type               ... ok           58 ms797pg_graphql-1.5.1-mergeless> test resolve___typename           ... ok           70 ms798pg_graphql-1.5.1-mergeless> test resolve_array_type           ... ok           52 ms799pg_graphql-1.5.1-mergeless> test resolve_connection_filter    ... ok           98 ms800pg_graphql-1.5.1-mergeless> test resolve_connection_named     ... ok           47 ms801pg_graphql-1.5.1-mergeless> test resolve_connection_order_by  ... ok           77 ms802pg_graphql-1.5.1-mergeless> test resolve_connection_pagination_args ... ok           95 ms803pg_graphql-1.5.1-mergeless> test resolve_connection_to_conn   ... ok           54 ms804pg_graphql-1.5.1-mergeless> test resolve_connection_to_node   ... ok           53 ms805pg_graphql-1.5.1-mergeless> test resolve_error_connection_edge_no_field ... ok           45 ms806pg_graphql-1.5.1-mergeless> test resolve_error_connection_edge_node_no_field ... ok           46 ms807pg_graphql-1.5.1-mergeless> test resolve_error_connection_no_field ... ok           46 ms808pg_graphql-1.5.1-mergeless> test resolve_error_from_parser    ... ok           11 ms809pg_graphql-1.5.1-mergeless> test resolve_error_mutation_no_field ... ok           42 ms810pg_graphql-1.5.1-mergeless> test resolve_error_node_no_field  ... ok           48 ms811pg_graphql-1.5.1-mergeless> test resolve_error_query_no_field ... ok           42 ms812pg_graphql-1.5.1-mergeless> test resolve_fragment             ... ok           49 ms813pg_graphql-1.5.1-mergeless> test resolve_graphiql_schema      ... ok          102 ms814pg_graphql-1.5.1-mergeless> test resolve_one                  ... ok           87 ms815pg_graphql-1.5.1-mergeless> test roundtrip_types              ... ok           61 ms816pg_graphql-1.5.1-mergeless> test row_level_security           ... ok           49 ms817pg_graphql-1.5.1-mergeless> test sqli_connection              ... ok           57 ms818pg_graphql-1.5.1-mergeless> test string_filters               ... ok           57 ms819pg_graphql-1.5.1-mergeless> test test_error_anon_and_named_operations ... ok           41 ms820pg_graphql-1.5.1-mergeless> test test_error_invalid_offset    ... ok           73 ms821pg_graphql-1.5.1-mergeless> test test_error_multiple_anon_operations ... ok           42 ms822pg_graphql-1.5.1-mergeless> test test_error_mutation_transpilation ... ok           47 ms823pg_graphql-1.5.1-mergeless> test test_error_operation_name_not_found ... ok           41 ms824pg_graphql-1.5.1-mergeless> test test_error_operation_names_not_unique ... ok           41 ms825pg_graphql-1.5.1-mergeless> test test_error_parsing           ... ok           10 ms826pg_graphql-1.5.1-mergeless> test test_error_query_transpilation ... ok           51 ms827pg_graphql-1.5.1-mergeless> test test_error_subscription      ... ok           41 ms828pg_graphql-1.5.1-mergeless> test test_query__type             ... ok           42 ms829pg_graphql-1.5.1-mergeless> test total_count                  ... ok           74 ms830pg_graphql-1.5.1-mergeless> test type_bigfloat                ... ok           52 ms831pg_graphql-1.5.1-mergeless> test type_modifier_max_length     ... ok           51 ms832pg_graphql-1.5.1-mergeless> test type_opaque                  ... ok           51 ms833pg_graphql-1.5.1-mergeless> test variable_default             ... ok           49 ms834pg_graphql-1.5.1-mergeless> test views_integration            ... ok          165 ms835pg_graphql-1.5.1-mergeless> 836pg_graphql-1.5.1-mergeless> =======================837pg_graphql-1.5.1-mergeless>  All 108 tests passed. 838pg_graphql-1.5.1-mergeless> =======================839pg_graphql-1.5.1-mergeless> 840pg_graphql-1.5.1-mergeless> + pg_ctl stop -m i841pg_graphql-1.5.1-mergeless> waiting for server to shut down...2026-10-06 14:08:44.366 UTC [2170] LOG:  received immediate shutdown request842pg_graphql-1.5.1-mergeless> .2026-10-06 14:08:44.381 UTC [2170] LOG:  database system is shut down843pg_graphql-1.5.1-mergeless>  done844pg_graphql-1.5.1-mergeless> server stopped845pg_graphql-1.5.1-mergeless> Running phase: installPhase846pg_graphql-1.5.1-mergeless> Executing buildPgrxExtension install847pg_graphql-1.5.1-mergeless> Running phase: fixupPhase848pg_graphql-1.5.1-mergeless> shrinking RPATHs of ELF executables and libraries in /nix/store/8nmsf42hcxrmwxq35zawn8j2jxk73c55-pg_graphql-1.5.1-mergeless849pg_graphql-1.5.1-mergeless> shrinking /nix/store/8nmsf42hcxrmwxq35zawn8j2jxk73c55-pg_graphql-1.5.1-mergeless/lib/pg_graphql-1.5.1-mergeless.so850pg_graphql-1.5.1-mergeless> checking for references to /build/ in /nix/store/8nmsf42hcxrmwxq35zawn8j2jxk73c55-pg_graphql-1.5.1-mergeless...851pg_graphql-1.5.1-mergeless> patching script interpreter paths in /nix/store/8nmsf42hcxrmwxq35zawn8j2jxk73c55-pg_graphql-1.5.1-mergeless852pg_graphql-1.5.1-mergeless> stripping (with command strip and flags -S -p) in  /nix/store/8nmsf42hcxrmwxq35zawn8j2jxk73c55-pg_graphql-1.5.1-mergeless/lib853pg_graphql-1.5.1-mergeless> stripping (with command strip and flags -s -p) in  /nix/store/8nmsf42hcxrmwxq35zawn8j2jxk73c55-pg_graphql-1.5.1-mergeless/lib854building '/nix/store/nsc639d0i1mzcdskxc5v8874w8f4zf8x-pg_graphql-1.6.2.drv' on 'ssh-ng://nixbot-remote-build@78.232.36.247'855building '/nix/store/0n0iaya9csx9by2pimrx1yglzw8dp4zs-pg_net-0.13.0.drv' on 'ssh-ng://nixbot-remote-build@78.232.36.247'856building '/nix/store/0n0iaya9csx9by2pimrx1yglzw8dp4zs-pg_net-0.13.0.drv'857pg_net-0.13.0> Running phase: unpackPhase858pg_net-0.13.0> unpacking source archive /nix/store/bxdzbzjn4yi7ch55dlcgzk6npzx2p4jz-source859pg_net-0.13.0> source root is source860pg_net-0.13.0> Running phase: patchPhase861pg_net-0.13.0> Running phase: updateAutotoolsGnuConfigScriptsPhase862pg_net-0.13.0> Running phase: configurePhase863pg_net-0.13.0> no configure script, doing nothing864pg_net-0.13.0> Running phase: buildPhase865pg_net-0.13.0> gcc -Wall -Wmissing-prototypes -Wpointer-arith -Wdeclaration-after-statement -Werror=vla -Wendif-labels -Wmissing-format-attribute -Wimplicit-fallthrough=3 -Wcast-function-type -Wformat-security -fno-strict-aliasing -fwrapv -fexcess-precision=standard -Wno-deprecated-non-prototype -Wno-format-truncation -Wno-stringop-truncation -g -O2 -std=gnu17 -std=c11 -Werror -Wno-declaration-after-statement -fPIC  -DEXTVERSION=\"0.13.0\" -I. -I./ -I/nix/store/48l45fvi99n90x6p9i4cs1lmzby6cb73-postgresql-15.19/include/server -I/nix/store/48l45fvi99n90x6p9i4cs1lmzby6cb73-postgresql-15.19/include/internal -D_GNU_SOURCE  -I/nix/store/p17klc3qq4nl9ihfwqfpi8cnqvcf92xz-libxml2-2.15.1-dev/include/libxml2 -I/nix/store/mglbi4dy4kpx7v1dcgf6iincp5x38hsc-lz4-1.10.0-dev/include -I/nix/store/g41q9md9rdcr3lkydi6f8zd6fza3h1q4-zstd-1.5.7-dev/include -I/nix/store/n2vnr7ycfk6midbzxcwd28qj3bgb50cz-icu4c-75.1-dev/include  -c -o src/worker.o src/worker.c866pg_net-0.13.0> gcc -Wall -Wmissing-prototypes -Wpointer-arith -Wdeclaration-after-statement -Werror=vla -Wendif-labels -Wmissing-format-attribute -Wimplicit-fallthrough=3 -Wcast-function-type -Wformat-security -fno-strict-aliasing -fwrapv -fexcess-precision=standard -Wno-deprecated-non-prototype -Wno-format-truncation -Wno-stringop-truncation -g -O2 -std=gnu17 -std=c11 -Werror -Wno-declaration-after-statement -fPIC  -DEXTVERSION=\"0.13.0\" -I. -I./ -I/nix/store/48l45fvi99n90x6p9i4cs1lmzby6cb73-postgresql-15.19/include/server -I/nix/store/48l45fvi99n90x6p9i4cs1lmzby6cb73-postgresql-15.19/include/internal -D_GNU_SOURCE  -I/nix/store/p17klc3qq4nl9ihfwqfpi8cnqvcf92xz-libxml2-2.15.1-dev/include/libxml2 -I/nix/store/mglbi4dy4kpx7v1dcgf6iincp5x38hsc-lz4-1.10.0-dev/include -I/nix/store/g41q9md9rdcr3lkydi6f8zd6fza3h1q4-zstd-1.5.7-dev/include -I/nix/store/n2vnr7ycfk6midbzxcwd28qj3bgb50cz-icu4c-75.1-dev/include  -c -o src/util.o src/util.c867pg_net-0.13.0> gcc -Wall -Wmissing-prototypes -Wpointer-arith -Wdeclaration-after-statement -Werror=vla -Wendif-labels -Wmissing-format-attribute -Wimplicit-fallthrough=3 -Wcast-function-type -Wformat-security -fno-strict-aliasing -fwrapv -fexcess-precision=standard -Wno-deprecated-non-prototype -Wno-format-truncation -Wno-stringop-truncation -g -O2 -std=gnu17 -std=c11 -Werror -Wno-declaration-after-statement -fPIC  -DEXTVERSION=\"0.13.0\" -I. -I./ -I/nix/store/48l45fvi99n90x6p9i4cs1lmzby6cb73-postgresql-15.19/include/server -I/nix/store/48l45fvi99n90x6p9i4cs1lmzby6cb73-postgresql-15.19/include/internal -D_GNU_SOURCE  -I/nix/store/p17klc3qq4nl9ihfwqfpi8cnqvcf92xz-libxml2-2.15.1-dev/include/libxml2 -I/nix/store/mglbi4dy4kpx7v1dcgf6iincp5x38hsc-lz4-1.10.0-dev/include -I/nix/store/g41q9md9rdcr3lkydi6f8zd6fza3h1q4-zstd-1.5.7-dev/include -I/nix/store/n2vnr7ycfk6midbzxcwd28qj3bgb50cz-icu4c-75.1-dev/include  -c -o src/core.o src/core.c868pg_net-0.13.0> In file included from src/core.c:23:869pg_net-0.13.0> In function 'init_curl_handle',870pg_net-0.13.0>     inlined from 'consume_request_queue' at src/core.c:273:5:871pg_net-0.13.0> src/util.h:6:11: warning: call to 'Wcurl_easy_setopt_err_long' declared with attribute warning: curl_easy_setopt expects a long argument [-Wattribute-warning]872pg_net-0.13.0>     6 |       if (curl_easy_setopt(hdl, opt, prm) != CURLE_OK) \873pg_net-0.13.0>       |           ^~~~~~~~~~~~~~~~874pg_net-0.13.0> src/core.c:94:7: note: in expansion of macro 'CURL_EZ_SETOPT'875pg_net-0.13.0>    94 |       CURL_EZ_SETOPT(curl_ez_handle, CURLOPT_POST, 1);876pg_net-0.13.0>       |       ^~~~~~~~~~~~~~877pg_net-0.13.0> src/util.h:6:11: warning: call to 'Wcurl_easy_setopt_err_long' declared with attribute warning: curl_easy_setopt expects a long argument [-Wattribute-warning]878pg_net-0.13.0>     6 |       if (curl_easy_setopt(hdl, opt, prm) != CURLE_OK) \879pg_net-0.13.0>       |           ^~~~~~~~~~~~~~~~880pg_net-0.13.0> src/core.c:95:7: note: in expansion of macro 'CURL_EZ_SETOPT'881pg_net-0.13.0>    95 |       CURL_EZ_SETOPT(curl_ez_handle, CURLOPT_POSTFIELDSIZE, 0);882pg_net-0.13.0>       |       ^~~~~~~~~~~~~~883pg_net-0.13.0> src/util.h:6:11: warning: call to 'Wcurl_easy_setopt_err_long' declared with attribute warning: curl_easy_setopt expects a long argument [-Wattribute-warning]884pg_net-0.13.0>     6 |       if (curl_easy_setopt(hdl, opt, prm) != CURLE_OK) \885pg_net-0.13.0>       |           ^~~~~~~~~~~~~~~~886pg_net-0.13.0> src/core.c:108:3: note: in expansion of macro 'CURL_EZ_SETOPT'887pg_net-0.13.0>   108 |   CURL_EZ_SETOPT(curl_ez_handle, CURLOPT_TIMEOUT_MS, timeout_milliseconds);888pg_net-0.13.0>       |   ^~~~~~~~~~~~~~889pg_net-0.13.0> src/util.h:6:11: warning: call to 'Wcurl_easy_setopt_err_long' declared with attribute warning: curl_easy_setopt expects a long argument [-Wattribute-warning]890pg_net-0.13.0>     6 |       if (curl_easy_setopt(hdl, opt, prm) != CURLE_OK) \891pg_net-0.13.0>       |           ^~~~~~~~~~~~~~~~892pg_net-0.13.0> src/core.c:110:3: note: in expansion of macro 'CURL_EZ_SETOPT'893pg_net-0.13.0>   110 |   CURL_EZ_SETOPT(curl_ez_handle, CURLOPT_FOLLOWLOCATION, true);894pg_net-0.13.0>       |   ^~~~~~~~~~~~~~895pg_net-0.13.0> gcc -Wall -Wmissing-prototypes -Wpointer-arith -Wdeclaration-after-statement -Werror=vla -Wendif-labels -Wmissing-format-attribute -Wimplicit-fallthrough=3 -Wcast-function-type -Wformat-security -fno-strict-aliasing -fwrapv -fexcess-precision=standard -Wno-deprecated-non-prototype -Wno-format-truncation -Wno-stringop-truncation -g -O2 -std=gnu17 -std=c11 -Werror -Wno-declaration-after-statement -fPIC  -DEXTVERSION=\"0.13.0\" -I. -I./ -I/nix/store/48l45fvi99n90x6p9i4cs1lmzby6cb73-postgresql-15.19/include/server -I/nix/store/48l45fvi99n90x6p9i4cs1lmzby6cb73-postgresql-15.19/include/internal -D_GNU_SOURCE  -I/nix/store/p17klc3qq4nl9ihfwqfpi8cnqvcf92xz-libxml2-2.15.1-dev/include/libxml2 -I/nix/store/mglbi4dy4kpx7v1dcgf6iincp5x38hsc-lz4-1.10.0-dev/include -I/nix/store/g41q9md9rdcr3lkydi6f8zd6fza3h1q4-zstd-1.5.7-dev/include -I/nix/store/n2vnr7ycfk6midbzxcwd28qj3bgb50cz-icu4c-75.1-dev/include  -c -o src/event.o src/event.c896pg_net-0.13.0> In file included from /nix/store/jviasb44hibgh09829gbmbssbz2jjnhz-curl-8.17.0-dev/include/curl/curl.h:3333,897pg_net-0.13.0>                  from /nix/store/jviasb44hibgh09829gbmbssbz2jjnhz-curl-8.17.0-dev/include/curl/multi.h:51,898pg_net-0.13.0>                  from src/event.h:4,899pg_net-0.13.0>                  from src/event.c:6:900pg_net-0.13.0> /nix/store/jviasb44hibgh09829gbmbssbz2jjnhz-curl-8.17.0-dev/include/curl/multi.h:429:23: error: expected identifier or '(' before '__extension__'901pg_net-0.13.0>   429 | CURL_EXTERN CURLMcode curl_multi_setopt(CURLM *multi_handle,902pg_net-0.13.0>       |                       ^~~~~~~~~~~~~~~~~903pg_net-0.13.0> /nix/store/jviasb44hibgh09829gbmbssbz2jjnhz-curl-8.17.0-dev/include/curl/multi.h:429:23: error: expected identifier or '(' before ')' token904pg_net-0.13.0>   429 | CURL_EXTERN CURLMcode curl_multi_setopt(CURLM *multi_handle,905pg_net-0.13.0>       |                       ^~~~~~~~~~~~~~~~~906pg_net-0.13.0> make: *** [<builtin>: src/event.o] Error 1907error: build of '/nix/store/0n0iaya9csx9by2pimrx1yglzw8dp4zs-pg_net-0.13.0.drv' on 'ssh-ng://nixbot-remote-build@78.232.36.247' failed: Cannot build '/nix/store/0n0iaya9csx9by2pimrx1yglzw8dp4zs-pg_net-0.13.0.drv'.908       Reason: builder failed with exit code 2.909       Output paths:910         /nix/store/14dkr1mhbrh869r2k75r03ngw6q7c4ma-pg_net-0.13.0911       Last 25 log lines:912       >       |       ^~~~~~~~~~~~~~913       > src/util.h:6:11: warning: call to 'Wcurl_easy_setopt_err_long' declared with attribute warning: curl_easy_setopt expects a long argument [-Wattribute-warning]914       >     6 |       if (curl_easy_setopt(hdl, opt, prm) != CURLE_OK) \915       >       |           ^~~~~~~~~~~~~~~~916       > src/core.c:108:3: note: in expansion of macro 'CURL_EZ_SETOPT'917       >   108 |   CURL_EZ_SETOPT(curl_ez_handle, CURLOPT_TIMEOUT_MS, timeout_milliseconds);918       >       |   ^~~~~~~~~~~~~~919       > src/util.h:6:11: warning: call to 'Wcurl_easy_setopt_err_long' declared with attribute warning: curl_easy_setopt expects a long argument [-Wattribute-warning]920       >     6 |       if (curl_easy_setopt(hdl, opt, prm) != CURLE_OK) \921       >       |           ^~~~~~~~~~~~~~~~922       > src/core.c:110:3: note: in expansion of macro 'CURL_EZ_SETOPT'923       >   110 |   CURL_EZ_SETOPT(curl_ez_handle, CURLOPT_FOLLOWLOCATION, true);924       >       |   ^~~~~~~~~~~~~~925       > gcc -Wall -Wmissing-prototypes -Wpointer-arith -Wdeclaration-after-statement -Werror=vla -Wendif-labels -Wmissing-format-attribute -Wimplicit-fallthrough=3 -Wcast-function-type -Wformat-security -fno-strict-aliasing -fwrapv -fexcess-precision=standard -Wno-deprecated-non-prototype -Wno-format-truncation -Wno-stringop-truncation -g -O2 -std=gnu17 -std=c11 -Werror -Wno-declaration-after-statement -fPIC  -DEXTVERSION=\"0.13.0\" -I. -I./ -I/nix/store/48l45fvi99n90x6p9i4cs1lmzby6cb73-postgresql-15.19/include/server -I/nix/store/48l45fvi99n90x6p9i4cs1lmzby6cb73-postgresql-15.19/include/internal -D_GNU_SOURCE  -I/nix/store/p17klc3qq4nl9ihfwqfpi8cnqvcf92xz-libxml2-2.15.1-dev/include/libxml2 -I/nix/store/mglbi4dy4kpx7v1dcgf6iincp5x38hsc-lz4-1.10.0-dev/include -I/nix/store/g41q9md9rdcr3lkydi6f8zd6fza3h1q4-zstd-1.5.7-dev/include -I/nix/store/n2vnr7ycfk6midbzxcwd28qj3bgb50cz-icu4c-75.1-dev/include  -c -o src/event.o src/event.c926       > In file included from /nix/store/jviasb44hibgh09829gbmbssbz2jjnhz-curl-8.17.0-dev/include/curl/curl.h:3333,927       >                  from /nix/store/jviasb44hibgh09829gbmbssbz2jjnhz-curl-8.17.0-dev/include/curl/multi.h:51,928       >                  from src/event.h:4,929       >                  from src/event.c:6:930       > /nix/store/jviasb44hibgh09829gbmbssbz2jjnhz-curl-8.17.0-dev/include/curl/multi.h:429:23: error: expected identifier or '(' before '__extension__'931       >   429 | CURL_EXTERN CURLMcode curl_multi_setopt(CURLM *multi_handle,932       >       |                       ^~~~~~~~~~~~~~~~~933       > /nix/store/jviasb44hibgh09829gbmbssbz2jjnhz-curl-8.17.0-dev/include/curl/multi.h:429:23: error: expected identifier or '(' before ')' token934       >   429 | CURL_EXTERN CURLMcode curl_multi_setopt(CURLM *multi_handle,935       >       |                       ^~~~~~~~~~~~~~~~~936       > make: *** [<builtin>: src/event.o] Error 1937       For full logs, run:938         nix log /nix/store/0n0iaya9csx9by2pimrx1yglzw8dp4zs-pg_net-0.13.0.drv939error: Cannot build '/nix/store/0n0iaya9csx9by2pimrx1yglzw8dp4zs-pg_net-0.13.0.drv'.940       Reason: builder failed with exit code 1.941       Output paths:942         /nix/store/14dkr1mhbrh869r2k75r03ngw6q7c4ma-pg_net-0.13.0943building '/nix/store/74dcpcc376carhrdcf8ka4zmkawz1yv6-wrappers-0.5.4.drv' on 'ssh-ng://nixbot-remote-build@78.232.36.247'944building '/nix/store/74dcpcc376carhrdcf8ka4zmkawz1yv6-wrappers-0.5.4.drv'945wrappers-0.5.4> Running phase: unpackPhase946wrappers-0.5.4> unpacking source archive /nix/store/mg75iasix009vbzk24yjb0jf4vvga5f7-source947wrappers-0.5.4> source root is source948wrappers-0.5.4> Executing cargoSetupPostUnpackHook949wrappers-0.5.4> Finished cargoSetupPostUnpackHook950wrappers-0.5.4> Running phase: patchPhase951wrappers-0.5.4> Executing cargoSetupPostPatchHook952wrappers-0.5.4> Validating consistency between /build/source/Cargo.lock and /build/cargo-vendor-dir/Cargo.lock953wrappers-0.5.4> Finished cargoSetupPostPatchHook954wrappers-0.5.4> Running phase: updateAutotoolsGnuConfigScriptsPhase955wrappers-0.5.4> Running phase: configurePhase956wrappers-0.5.4> {"success":"true"}957wrappers-0.5.4> Running phase: buildPhase958wrappers-0.5.4> Executing cargo-pgrx buildPhase959wrappers-0.5.4>    Validating /nix/store/wq2kfr0rkb0hdmf1iwi3mi8pxycakzmq-postgresql-17_22/bin/pg_config960wrappers-0.5.4>  Initializing data directory at /build/tmp.hIQHbvOy8A/data-17961wrappers-0.5.4> waiting for server to start....2026-10-06 14:20:50.883 GMT [74] LOG:  starting PostgreSQL 17.11 on aarch64-unknown-linux-gnu, compiled by gcc (GCC) 15.2.0, 64-bit962wrappers-0.5.4> 2026-10-06 14:20:50.885 GMT [74] LOG:  listening on Unix socket "/build/tmp.oZ1EGczRTl/.s.PGSQL.5432"963wrappers-0.5.4> 2026-10-06 14:20:50.900 GMT [77] LOG:  database system was shut down at 2026-10-06 14:20:50 GMT964wrappers-0.5.4> 2026-10-06 14:20:50.906 GMT [74] LOG:  database system is ready to accept connections965wrappers-0.5.4>  done966wrappers-0.5.4> server started967wrappers-0.5.4> createuser: error: connection to server at "localhost" (127.0.0.1), port 5432 failed: Connection refused968wrappers-0.5.4> 	Is the server running on that host and accepting TCP/IP connections?969wrappers-0.5.4> waiting for server to shut down....2026-10-06 14:20:50.968 GMT [74] LOG:  received fast shutdown request970wrappers-0.5.4> 2026-10-06 14:20:50.972 GMT [74] LOG:  aborting any active transactions971wrappers-0.5.4> 2026-10-06 14:20:50.976 GMT [74] LOG:  background worker "logical replication launcher" (PID 80) exited with exit code 1972wrappers-0.5.4> 2026-10-06 14:20:50.976 GMT [75] LOG:  shutting down973wrappers-0.5.4> 2026-10-06 14:20:50.978 GMT [75] LOG:  checkpoint starting: shutdown immediate974wrappers-0.5.4> 2026-10-06 14:20:51.000 GMT [75] LOG:  checkpoint complete: wrote 3 buffers (0.0%); 0 WAL file(s) added, 0 removed, 0 recycled; write=0.006 s, sync=0.009 s, total=0.024 s; sync files=2, longest=0.009 s, average=0.005 s; distance=0 kB, estimate=0 kB; lsn=0/14EC910, redo lsn=0/14EC910975wrappers-0.5.4> 2026-10-06 14:20:51.005 GMT [74] LOG:  database system is shut down976wrappers-0.5.4>  done977wrappers-0.5.4> server stopped978wrappers-0.5.4> /build/source/wrappers /build/source979wrappers-0.5.4>        Using PgConfig("pg17") and `pg_config` from /nix/store/wq2kfr0rkb0hdmf1iwi3mi8pxycakzmq-postgresql-17_22/bin/pg_config980wrappers-0.5.4>     Building extension with features helloworld_fdw all_fdws pg17981wrappers-0.5.4>      Running command "/nix/store/75b8m9zabmvypzim2d4lca20y5bymiqj-cargo-1.87.0-aarch64-unknown-linux-gnu/bin/cargo" "build" "--lib" "--release" "--features" "helloworld_fdw all_fdws pg17" "--no-default-features" "--message-format=json-render-diagnostics" "--frozen" "-j" "2"982wrappers-0.5.4>    Compiling proc-macro2 v1.0.95983wrappers-0.5.4>    Compiling unicode-ident v1.0.18984wrappers-0.5.4>    Compiling libc v0.2.172985wrappers-0.5.4>    Compiling quote v1.0.40986wrappers-0.5.4>    Compiling syn v2.0.101987wrappers-0.5.4>    Compiling cfg-if v1.0.0988wrappers-0.5.4>    Compiling serde v1.0.219989wrappers-0.5.4>    Compiling autocfg v1.4.0990wrappers-0.5.4>    Compiling version_check v0.9.5991wrappers-0.5.4>    Compiling shlex v1.3.0992wrappers-0.5.4>    Compiling jobserver v0.1.33993wrappers-0.5.4>    Compiling cc v1.2.24994wrappers-0.5.4>    Compiling memchr v2.7.4995wrappers-0.5.4>    Compiling serde_derive v1.0.219996wrappers-0.5.4>    Compiling bytes v1.10.1997wrappers-0.5.4>    Compiling zeroize v1.8.1998wrappers-0.5.4>    Compiling once_cell v1.21.3999wrappers-0.5.4>    Compiling libm v0.2.151000wrappers-0.5.4>    Compiling pin-project-lite v0.2.161001wrappers-0.5.4>    Compiling allocator-api2 v0.2.211002wrappers-0.5.4>    Compiling num-traits v0.2.191003wrappers-0.5.4>    Compiling futures-core v0.3.311004wrappers-0.5.4>    Compiling equivalent v1.0.21005wrappers-0.5.4>    Compiling foldhash v0.1.51006wrappers-0.5.4>    Compiling hashbrown v0.15.31007wrappers-0.5.4>    Compiling getrandom v0.2.161008wrappers-0.5.4>    Compiling smallvec v1.15.01009wrappers-0.5.4>    Compiling log v0.4.271010wrappers-0.5.4>    Compiling typenum v1.18.01011wrappers-0.5.4>    Compiling subtle v2.6.11012wrappers-0.5.4>    Compiling futures-io v0.3.311013wrappers-0.5.4>    Compiling lock_api v0.4.121014wrappers-0.5.4>    Compiling parking_lot_core v0.9.101015wrappers-0.5.4>    Compiling slab v0.4.91016wrappers-0.5.4>    Compiling anyhow v1.0.981017wrappers-0.5.4>    Compiling itoa v1.0.151018wrappers-0.5.4>    Compiling scopeguard v1.2.01019wrappers-0.5.4>    Compiling parking_lot v0.12.31020wrappers-0.5.4>    Compiling generic-array v0.14.71021wrappers-0.5.4>    Compiling socket2 v0.5.101022wrappers-0.5.4>    Compiling tokio-macros v2.5.01023wrappers-0.5.4>    Compiling mio v1.0.41024wrappers-0.5.4>    Compiling signal-hook-registry v1.4.51025wrappers-0.5.4>    Compiling futures-sink v0.3.311026wrappers-0.5.4>    Compiling pin-utils v0.1.01027wrappers-0.5.4>    Compiling tokio v1.45.11028wrappers-0.5.4>    Compiling futures-channel v0.3.311029wrappers-0.5.4>    Compiling futures-macro v0.3.311030wrappers-0.5.4>    Compiling futures-task v0.3.311031wrappers-0.5.4>    Compiling futures-util v0.3.311032wrappers-0.5.4>    Compiling const-oid v0.9.61033wrappers-0.5.4>    Compiling indexmap v2.9.01034wrappers-0.5.4>    Compiling synstructure v0.13.21035wrappers-0.5.4>    Compiling rand_core v0.6.41036wrappers-0.5.4>    Compiling zerofrom-derive v0.1.61037wrappers-0.5.4>    Compiling ryu v1.0.201038wrappers-0.5.4>    Compiling crypto-common v0.1.61039wrappers-0.5.4>    Compiling bitflags v2.9.11040wrappers-0.5.4>    Compiling yoke-derive v0.8.01041wrappers-0.5.4>    Compiling num-integer v0.1.461042wrappers-0.5.4>    Compiling block-buffer v0.10.41043wrappers-0.5.4>    Compiling zerocopy v0.8.251044wrappers-0.5.4>    Compiling fnv v1.0.71045wrappers-0.5.4>    Compiling digest v0.10.71046wrappers-0.5.4>    Compiling zerovec-derive v0.11.11047wrappers-0.5.4>    Compiling getrandom v0.3.31048wrappers-0.5.4>    Compiling tracing-core v0.1.331049wrappers-0.5.4>    Compiling tracing-attributes v0.1.281050wrappers-0.5.4>    Compiling displaydoc v0.2.51051wrappers-0.5.4>    Compiling tracing v0.1.411052wrappers-0.5.4>    Compiling tokio-util v0.7.151053wrappers-0.5.4>    Compiling regex-syntax v0.8.51054wrappers-0.5.4>    Compiling pkg-config v0.3.321055wrappers-0.5.4>    Compiling either v1.15.01056wrappers-0.5.4>    Compiling http v1.3.11057wrappers-0.5.4>    Compiling aho-corasick v1.1.31058wrappers-0.5.4>    Compiling serde_json v1.0.1401059wrappers-0.5.4>    Compiling icu_normalizer_data v2.0.01060wrappers-0.5.4>    Compiling icu_properties_data v2.0.11061wrappers-0.5.4>    Compiling regex-automata v0.4.91062wrappers-0.5.4>    Compiling http-body v1.0.11063wrappers-0.5.4>    Compiling base64ct v1.7.31064wrappers-0.5.4>    Compiling semver v1.0.261065wrappers-0.5.4>    Compiling openssl-probe v0.1.61066wrappers-0.5.4>    Compiling stable_deref_trait v1.2.01067wrappers-0.5.4>    Compiling ring v0.17.141068wrappers-0.5.4>    Compiling cpufeatures v0.2.171069wrappers-0.5.4>    Compiling percent-encoding v2.3.11070wrappers-0.5.4>    Compiling regex v1.11.11071wrappers-0.5.4>    Compiling hmac v0.12.11072wrappers-0.5.4>    Compiling thiserror v1.0.691073wrappers-0.5.4>    Compiling httparse v1.10.11074wrappers-0.5.4>    Compiling zerofrom v0.1.61075wrappers-0.5.4>    Compiling try-lock v0.2.51076wrappers-0.5.4>    Compiling tower-service v0.3.31077wrappers-0.5.4>    Compiling want v0.3.11078wrappers-0.5.4>    Compiling yoke v0.8.01079wrappers-0.5.4>    Compiling http-body-util v0.1.31080wrappers-0.5.4>    Compiling http v0.2.121081wrappers-0.5.4>    Compiling thiserror-impl v1.0.691082wrappers-0.5.4>    Compiling atomic-waker v1.1.21083wrappers-0.5.4>    Compiling httpdate v1.0.31084wrappers-0.5.4>    Compiling untrusted v0.9.01085wrappers-0.5.4>    Compiling sha2 v0.10.91086wrappers-0.5.4>    Compiling cmake v0.1.541087wrappers-0.5.4>    Compiling fs_extra v1.3.01088wrappers-0.5.4>    Compiling dunce v1.0.51089wrappers-0.5.4>    Compiling aws-lc-sys v0.29.01090wrappers-0.5.4>    Compiling zerovec v0.11.21091wrappers-0.5.4>    Compiling ppv-lite86 v0.2.211092wrappers-0.5.4>    Compiling rustls-pki-types v1.12.01093wrappers-0.5.4>    Compiling crc32fast v1.4.21094wrappers-0.5.4>    Compiling iana-time-zone v0.1.631095wrappers-0.5.4>    Compiling chrono v0.4.411096wrappers-0.5.4>    Compiling http-body v0.4.61097wrappers-0.5.4>    Compiling form_urlencoded v1.2.11098wrappers-0.5.4>    Compiling heck v0.5.01099wrappers-0.5.4>    Compiling rustc_version v0.4.11100wrappers-0.5.4>    Compiling aws-lc-rs v1.13.11101wrappers-0.5.4>    Compiling crossbeam-utils v0.8.211102wrappers-0.5.4>    Compiling vcpkg v0.2.151103wrappers-0.5.4>    Compiling tinystr v0.8.11104wrappers-0.5.4>    Compiling writeable v0.6.11105wrappers-0.5.4>    Compiling litemap v0.8.01106wrappers-0.5.4>    Compiling icu_locale_core v2.0.01107wrappers-0.5.4>    Compiling potential_utf v0.1.21108wrappers-0.5.4>    Compiling zerotrie v0.2.21109wrappers-0.5.4>    Compiling powerfmt v0.2.01110wrappers-0.5.4>    Compiling static_assertions v1.1.01111wrappers-0.5.4>    Compiling base64 v0.21.71112wrappers-0.5.4>    Compiling deranged v0.4.01113wrappers-0.5.4>    Compiling icu_provider v2.0.01114wrappers-0.5.4>    Compiling icu_collections v2.0.01115wrappers-0.5.4>    Compiling h2 v0.4.101116wrappers-0.5.4>    Compiling num-iter v0.1.451117wrappers-0.5.4>    Compiling num-bigint v0.4.61118wrappers-0.5.4>    Compiling ahash v0.8.121119wrappers-0.5.4>    Compiling time-core v0.1.41120wrappers-0.5.4>    Compiling hex v0.4.31121wrappers-0.5.4>    Compiling rustix v1.0.71122wrappers-0.5.4>    Compiling rustls v0.23.271123wrappers-0.5.4>    Compiling num-conv v0.1.01124wrappers-0.5.4>    Compiling num_threads v0.1.71125wrappers-0.5.4>    Compiling time v0.3.411126wrappers-0.5.4>    Compiling hyper v1.6.01127wrappers-0.5.4>    Compiling fastrand v2.3.01128wrappers-0.5.4>    Compiling linux-raw-sys v0.9.41129wrappers-0.5.4>    Compiling hyper-util v0.1.121130wrappers-0.5.4>    Compiling icu_properties v2.0.11131wrappers-0.5.4>    Compiling icu_normalizer v2.0.01132wrappers-0.5.4>    Compiling openssl-sys v0.9.1081133wrappers-0.5.4>    Compiling crypto-bigint v0.5.51134wrappers-0.5.4>    Compiling outref v0.5.21135wrappers-0.5.4>    Compiling vsimd v0.8.01136wrappers-0.5.4>    Compiling base64-simd v0.8.01137wrappers-0.5.4>    Compiling idna_adapter v1.2.11138wrappers-0.5.4>    Compiling bytes-utils v0.1.41139wrappers-0.5.4>    Compiling utf8_iter v1.0.41140wrappers-0.5.4>    Compiling byteorder v1.5.01141wrappers-0.5.4>    Compiling idna v1.0.31142wrappers-0.5.4>    Compiling aws-smithy-types v1.3.11143wrappers-0.5.4>    Compiling num-rational v0.4.21144wrappers-0.5.4>    Compiling webpki-roots v1.0.01145wrappers-0.5.4>    Compiling rustls-native-certs v0.8.11146wrappers-0.5.4>    Compiling num-complex v0.4.61147wrappers-0.5.4>    Compiling tower-layer v0.3.31148wrappers-0.5.4>    Compiling num v0.4.31149wrappers-0.5.4>    Compiling url v2.5.41150wrappers-0.5.4>    Compiling rand_chacha v0.3.11151wrappers-0.5.4>    Compiling pem-rfc7468 v0.7.01152wrappers-0.5.4>    Compiling itertools v0.12.11153wrappers-0.5.4>    Compiling toml_datetime v0.6.91154wrappers-0.5.4>    Compiling foreign-types-shared v0.1.11155wrappers-0.5.4>    Compiling openssl v0.10.721156wrappers-0.5.4>    Compiling foreign-types v0.3.21157wrappers-0.5.4>    Compiling prost-derive v0.12.61158wrappers-0.5.4>    Compiling der v0.7.101159wrappers-0.5.4>    Compiling rand v0.8.51160wrappers-0.5.4>    Compiling concurrent-queue v2.5.01161wrappers-0.5.4>    Compiling sync_wrapper v1.0.21162wrappers-0.5.4>    Compiling openssl-macros v0.1.11163wrappers-0.5.4>    Compiling uncased v0.9.101164wrappers-0.5.4>    Compiling native-tls v0.2.141165wrappers-0.5.4>    Compiling tower v0.5.21166wrappers-0.5.4>    Compiling spki v0.7.31167wrappers-0.5.4>    Compiling h2 v0.3.261168wrappers-0.5.4>    Compiling uuid v1.17.01169wrappers-0.5.4>    Compiling aws-smithy-async v1.2.51170wrappers-0.5.4>    Compiling async-trait v0.1.881171wrappers-0.5.4>    Compiling parking v2.2.11172wrappers-0.5.4>    Compiling prettyplease v0.2.321173wrappers-0.5.4>    Compiling base64 v0.22.11174wrappers-0.5.4>    Compiling aws-smithy-runtime-api v1.8.01175building '/nix/store/lbqp8bfrqa2xm82ma6wyq1gijyajh6kh-pg_net-0.13.0.drv' on 'ssh-ng://nixbot-remote-build@78.232.36.247'1176building '/nix/store/lbqp8bfrqa2xm82ma6wyq1gijyajh6kh-pg_net-0.13.0.drv'1177pg_net-0.13.0> Running phase: unpackPhase1178pg_net-0.13.0> unpacking source archive /nix/store/bxdzbzjn4yi7ch55dlcgzk6npzx2p4jz-source1179pg_net-0.13.0> source root is source1180pg_net-0.13.0> Running phase: patchPhase1181pg_net-0.13.0> Running phase: updateAutotoolsGnuConfigScriptsPhase1182pg_net-0.13.0> Running phase: configurePhase1183pg_net-0.13.0> no configure script, doing nothing1184pg_net-0.13.0> Running phase: buildPhase1185pg_net-0.13.0> gcc -Wall -Wmissing-prototypes -Wpointer-arith -Wdeclaration-after-statement -Werror=vla -Wendif-labels -Wmissing-format-attribute -Wimplicit-fallthrough=3 -Wcast-function-type -Wshadow=compatible-local -Wformat-security -fno-strict-aliasing -fwrapv -fexcess-precision=standard -Wno-format-truncation -Wno-stringop-truncation -moutline-atomics -g -O2 -std=c11 -Werror -Wno-declaration-after-statement -fPIC -fvisibility=hidden  -DEXTVERSION=\"0.13.0\" -I. -I./ -I/nix/store/wq2kfr0rkb0hdmf1iwi3mi8pxycakzmq-postgresql-17_22/include/server -I/nix/store/wq2kfr0rkb0hdmf1iwi3mi8pxycakzmq-postgresql-17_22/include/internal -D_GNU_SOURCE  -I/nix/store/p17klc3qq4nl9ihfwqfpi8cnqvcf92xz-libxml2-2.15.1-dev/include/libxml2 -I/nix/store/mglbi4dy4kpx7v1dcgf6iincp5x38hsc-lz4-1.10.0-dev/include -I/nix/store/g41q9md9rdcr3lkydi6f8zd6fza3h1q4-zstd-1.5.7-dev/include -I/nix/store/n2vnr7ycfk6midbzxcwd28qj3bgb50cz-icu4c-75.1-dev/include  -c -o src/worker.o src/worker.c1186pg_net-0.13.0> gcc -Wall -Wmissing-prototypes -Wpointer-arith -Wdeclaration-after-statement -Werror=vla -Wendif-labels -Wmissing-format-attribute -Wimplicit-fallthrough=3 -Wcast-function-type -Wshadow=compatible-local -Wformat-security -fno-strict-aliasing -fwrapv -fexcess-precision=standard -Wno-format-truncation -Wno-stringop-truncation -moutline-atomics -g -O2 -std=c11 -Werror -Wno-declaration-after-statement -fPIC -fvisibility=hidden  -DEXTVERSION=\"0.13.0\" -I. -I./ -I/nix/store/wq2kfr0rkb0hdmf1iwi3mi8pxycakzmq-postgresql-17_22/include/server -I/nix/store/wq2kfr0rkb0hdmf1iwi3mi8pxycakzmq-postgresql-17_22/include/internal -D_GNU_SOURCE  -I/nix/store/p17klc3qq4nl9ihfwqfpi8cnqvcf92xz-libxml2-2.15.1-dev/include/libxml2 -I/nix/store/mglbi4dy4kpx7v1dcgf6iincp5x38hsc-lz4-1.10.0-dev/include -I/nix/store/g41q9md9rdcr3lkydi6f8zd6fza3h1q4-zstd-1.5.7-dev/include -I/nix/store/n2vnr7ycfk6midbzxcwd28qj3bgb50cz-icu4c-75.1-dev/include  -c -o src/util.o src/util.c1187pg_net-0.13.0> gcc -Wall -Wmissing-prototypes -Wpointer-arith -Wdeclaration-after-statement -Werror=vla -Wendif-labels -Wmissing-format-attribute -Wimplicit-fallthrough=3 -Wcast-function-type -Wshadow=compatible-local -Wformat-security -fno-strict-aliasing -fwrapv -fexcess-precision=standard -Wno-format-truncation -Wno-stringop-truncation -moutline-atomics -g -O2 -std=c11 -Werror -Wno-declaration-after-statement -fPIC -fvisibility=hidden  -DEXTVERSION=\"0.13.0\" -I. -I./ -I/nix/store/wq2kfr0rkb0hdmf1iwi3mi8pxycakzmq-postgresql-17_22/include/server -I/nix/store/wq2kfr0rkb0hdmf1iwi3mi8pxycakzmq-postgresql-17_22/include/internal -D_GNU_SOURCE  -I/nix/store/p17klc3qq4nl9ihfwqfpi8cnqvcf92xz-libxml2-2.15.1-dev/include/libxml2 -I/nix/store/mglbi4dy4kpx7v1dcgf6iincp5x38hsc-lz4-1.10.0-dev/include -I/nix/store/g41q9md9rdcr3lkydi6f8zd6fza3h1q4-zstd-1.5.7-dev/include -I/nix/store/n2vnr7ycfk6midbzxcwd28qj3bgb50cz-icu4c-75.1-dev/include  -c -o src/core.o src/core.c1188pg_net-0.13.0> In file included from src/core.c:23:1189pg_net-0.13.0> In function 'init_curl_handle',1190pg_net-0.13.0>     inlined from 'consume_request_queue' at src/core.c:273:5:1191pg_net-0.13.0> src/util.h:6:11: warning: call to 'Wcurl_easy_setopt_err_long' declared with attribute warning: curl_easy_setopt expects a long argument [-Wattribute-warning]1192pg_net-0.13.0>     6 |       if (curl_easy_setopt(hdl, opt, prm) != CURLE_OK) \1193pg_net-0.13.0>       |           ^~~~~~~~~~~~~~~~1194pg_net-0.13.0> src/core.c:94:7: note: in expansion of macro 'CURL_EZ_SETOPT'1195pg_net-0.13.0>    94 |       CURL_EZ_SETOPT(curl_ez_handle, CURLOPT_POST, 1);1196pg_net-0.13.0>       |       ^~~~~~~~~~~~~~1197pg_net-0.13.0> src/util.h:6:11: warning: call to 'Wcurl_easy_setopt_err_long' declared with attribute warning: curl_easy_setopt expects a long argument [-Wattribute-warning]1198pg_net-0.13.0>     6 |       if (curl_easy_setopt(hdl, opt, prm) != CURLE_OK) \1199pg_net-0.13.0>       |           ^~~~~~~~~~~~~~~~1200pg_net-0.13.0> src/core.c:95:7: note: in expansion of macro 'CURL_EZ_SETOPT'1201pg_net-0.13.0>    95 |       CURL_EZ_SETOPT(curl_ez_handle, CURLOPT_POSTFIELDSIZE, 0);1202pg_net-0.13.0>       |       ^~~~~~~~~~~~~~1203pg_net-0.13.0> src/util.h:6:11: warning: call to 'Wcurl_easy_setopt_err_long' declared with attribute warning: curl_easy_setopt expects a long argument [-Wattribute-warning]1204pg_net-0.13.0>     6 |       if (curl_easy_setopt(hdl, opt, prm) != CURLE_OK) \1205pg_net-0.13.0>       |           ^~~~~~~~~~~~~~~~1206pg_net-0.13.0> src/core.c:108:3: note: in expansion of macro 'CURL_EZ_SETOPT'1207pg_net-0.13.0>   108 |   CURL_EZ_SETOPT(curl_ez_handle, CURLOPT_TIMEOUT_MS, timeout_milliseconds);1208pg_net-0.13.0>       |   ^~~~~~~~~~~~~~1209pg_net-0.13.0> src/util.h:6:11: warning: call to 'Wcurl_easy_setopt_err_long' declared with attribute warning: curl_easy_setopt expects a long argument [-Wattribute-warning]1210pg_net-0.13.0>     6 |       if (curl_easy_setopt(hdl, opt, prm) != CURLE_OK) \1211pg_net-0.13.0>       |           ^~~~~~~~~~~~~~~~1212pg_net-0.13.0> src/core.c:110:3: note: in expansion of macro 'CURL_EZ_SETOPT'1213pg_net-0.13.0>   110 |   CURL_EZ_SETOPT(curl_ez_handle, CURLOPT_FOLLOWLOCATION, true);1214pg_net-0.13.0>       |   ^~~~~~~~~~~~~~1215wrappers-0.5.4>    Compiling hyper v0.14.321216pg_net-0.13.0> gcc -Wall -Wmissing-prototypes -Wpointer-arith -Wdeclaration-after-statement -Werror=vla -Wendif-labels -Wmissing-format-attribute -Wimplicit-fallthrough=3 -Wcast-function-type -Wshadow=compatible-local -Wformat-security -fno-strict-aliasing -fwrapv -fexcess-precision=standard -Wno-format-truncation -Wno-stringop-truncation -moutline-atomics -g -O2 -std=c11 -Werror -Wno-declaration-after-statement -fPIC -fvisibility=hidden  -DEXTVERSION=\"0.13.0\" -I. -I./ -I/nix/store/wq2kfr0rkb0hdmf1iwi3mi8pxycakzmq-postgresql-17_22/include/server -I/nix/store/wq2kfr0rkb0hdmf1iwi3mi8pxycakzmq-postgresql-17_22/include/internal -D_GNU_SOURCE  -I/nix/store/p17klc3qq4nl9ihfwqfpi8cnqvcf92xz-libxml2-2.15.1-dev/include/libxml2 -I/nix/store/mglbi4dy4kpx7v1dcgf6iincp5x38hsc-lz4-1.10.0-dev/include -I/nix/store/g41q9md9rdcr3lkydi6f8zd6fza3h1q4-zstd-1.5.7-dev/include -I/nix/store/n2vnr7ycfk6midbzxcwd28qj3bgb50cz-icu4c-75.1-dev/include  -c -o src/event.o src/event.c1217pg_net-0.13.0> In file included from /nix/store/jviasb44hibgh09829gbmbssbz2jjnhz-curl-8.17.0-dev/include/curl/curl.h:3333,1218pg_net-0.13.0>                  from /nix/store/jviasb44hibgh09829gbmbssbz2jjnhz-curl-8.17.0-dev/include/curl/multi.h:51,1219pg_net-0.13.0>                  from src/event.h:4,1220pg_net-0.13.0>                  from src/event.c:6:1221pg_net-0.13.0> /nix/store/jviasb44hibgh09829gbmbssbz2jjnhz-curl-8.17.0-dev/include/curl/multi.h:429:23: error: expected identifier or '(' before '__extension__'1222pg_net-0.13.0>   429 | CURL_EXTERN CURLMcode curl_multi_setopt(CURLM *multi_handle,1223pg_net-0.13.0>       |                       ^~~~~~~~~~~~~~~~~1224pg_net-0.13.0> /nix/store/jviasb44hibgh09829gbmbssbz2jjnhz-curl-8.17.0-dev/include/curl/multi.h:429:23: error: expected identifier or '(' before ')' token1225pg_net-0.13.0>   429 | CURL_EXTERN CURLMcode curl_multi_setopt(CURLM *multi_handle,1226pg_net-0.13.0>       |                       ^~~~~~~~~~~~~~~~~1227pg_net-0.13.0> make: *** [<builtin>: src/event.o] Error 11228error: build of '/nix/store/lbqp8bfrqa2xm82ma6wyq1gijyajh6kh-pg_net-0.13.0.drv' on 'ssh-ng://nixbot-remote-build@78.232.36.247' failed: Cannot build '/nix/store/lbqp8bfrqa2xm82ma6wyq1gijyajh6kh-pg_net-0.13.0.drv'.1229       Reason: builder failed with exit code 2.1230       Output paths:1231         /nix/store/517wbr5c7xb4fvch9kn0zim5j3hnjzpa-pg_net-0.13.01232       Last 25 log lines:1233       >       |       ^~~~~~~~~~~~~~1234       > src/util.h:6:11: warning: call to 'Wcurl_easy_setopt_err_long' declared with attribute warning: curl_easy_setopt expects a long argument [-Wattribute-warning]1235       >     6 |       if (curl_easy_setopt(hdl, opt, prm) != CURLE_OK) \1236       >       |           ^~~~~~~~~~~~~~~~1237       > src/core.c:108:3: note: in expansion of macro 'CURL_EZ_SETOPT'1238       >   108 |   CURL_EZ_SETOPT(curl_ez_handle, CURLOPT_TIMEOUT_MS, timeout_milliseconds);1239       >       |   ^~~~~~~~~~~~~~1240       > src/util.h:6:11: warning: call to 'Wcurl_easy_setopt_err_long' declared with attribute warning: curl_easy_setopt expects a long argument [-Wattribute-warning]1241       >     6 |       if (curl_easy_setopt(hdl, opt, prm) != CURLE_OK) \1242       >       |           ^~~~~~~~~~~~~~~~1243       > src/core.c:110:3: note: in expansion of macro 'CURL_EZ_SETOPT'1244       >   110 |   CURL_EZ_SETOPT(curl_ez_handle, CURLOPT_FOLLOWLOCATION, true);1245       >       |   ^~~~~~~~~~~~~~1246       > gcc -Wall -Wmissing-prototypes -Wpointer-arith -Wdeclaration-after-statement -Werror=vla -Wendif-labels -Wmissing-format-attribute -Wimplicit-fallthrough=3 -Wcast-function-type -Wshadow=compatible-local -Wformat-security -fno-strict-aliasing -fwrapv -fexcess-precision=standard -Wno-format-truncation -Wno-stringop-truncation -moutline-atomics -g -O2 -std=c11 -Werror -Wno-declaration-after-statement -fPIC -fvisibility=hidden  -DEXTVERSION=\"0.13.0\" -I. -I./ -I/nix/store/wq2kfr0rkb0hdmf1iwi3mi8pxycakzmq-postgresql-17_22/include/server -I/nix/store/wq2kfr0rkb0hdmf1iwi3mi8pxycakzmq-postgresql-17_22/include/internal -D_GNU_SOURCE  -I/nix/store/p17klc3qq4nl9ihfwqfpi8cnqvcf92xz-libxml2-2.15.1-dev/include/libxml2 -I/nix/store/mglbi4dy4kpx7v1dcgf6iincp5x38hsc-lz4-1.10.0-dev/include -I/nix/store/g41q9md9rdcr3lkydi6f8zd6fza3h1q4-zstd-1.5.7-dev/include -I/nix/store/n2vnr7ycfk6midbzxcwd28qj3bgb50cz-icu4c-75.1-dev/include  -c -o src/event.o src/event.c1247       > In file included from /nix/store/jviasb44hibgh09829gbmbssbz2jjnhz-curl-8.17.0-dev/include/curl/curl.h:3333,1248       >                  from /nix/store/jviasb44hibgh09829gbmbssbz2jjnhz-curl-8.17.0-dev/include/curl/multi.h:51,1249       >                  from src/event.h:4,1250       >                  from src/event.c:6:1251       > /nix/store/jviasb44hibgh09829gbmbssbz2jjnhz-curl-8.17.0-dev/include/curl/multi.h:429:23: error: expected identifier or '(' before '__extension__'1252       >   429 | CURL_EXTERN CURLMcode curl_multi_setopt(CURLM *multi_handle,1253       >       |                       ^~~~~~~~~~~~~~~~~1254       > /nix/store/jviasb44hibgh09829gbmbssbz2jjnhz-curl-8.17.0-dev/include/curl/multi.h:429:23: error: expected identifier or '(' before ')' token1255       >   429 | CURL_EXTERN CURLMcode curl_multi_setopt(CURLM *multi_handle,1256       >       |                       ^~~~~~~~~~~~~~~~~1257       > make: *** [<builtin>: src/event.o] Error 11258       For full logs, run:1259         nix log /nix/store/lbqp8bfrqa2xm82ma6wyq1gijyajh6kh-pg_net-0.13.0.drv1260error: Cannot build '/nix/store/lbqp8bfrqa2xm82ma6wyq1gijyajh6kh-pg_net-0.13.0.drv'.1261       Reason: builder failed with exit code 1.1262       Output paths:1263         /nix/store/517wbr5c7xb4fvch9kn0zim5j3hnjzpa-pg_net-0.13.01264wrappers-0.5.4>    Compiling pkcs8 v0.10.21265wrappers-0.5.4>    Compiling half v2.6.01266wrappers-0.5.4>    Compiling thiserror v2.0.121267wrappers-0.5.4>    Compiling tempfile v3.20.01268wrappers-0.5.4>    Compiling arrow-buffer v55.1.01269wrappers-0.5.4>    Compiling rustls-webpki v0.103.31270wrappers-0.5.4>    Compiling prost v0.12.61271wrappers-0.5.4>    Compiling rustls-pemfile v1.0.41272wrappers-0.5.4>    Compiling arrow-schema v55.1.01273wrappers-0.5.4>    Compiling tokio-rustls v0.26.21274wrappers-0.5.4>    Compiling hyper-rustls v0.27.61275wrappers-0.5.4>    Compiling der v0.6.11276wrappers-0.5.4>    Compiling multimap v0.10.11277wrappers-0.5.4>    Compiling spki v0.6.01278wrappers-0.5.4>    Compiling arrow-data v55.1.01279wrappers-0.5.4>    Compiling prost-types v0.12.61280wrappers-0.5.4>    Compiling hkdf v0.12.41281wrappers-0.5.4>    Compiling thiserror-impl v2.0.121282wrappers-0.5.4>    Compiling rustls v0.21.121283wrappers-0.5.4>    Compiling unicode-width v0.2.01284wrappers-0.5.4>    Compiling arrow-array v55.1.01285wrappers-0.5.4>    Compiling pkcs8 v0.9.01286wrappers-0.5.4>    Compiling tokio-native-tls v0.3.11287wrappers-0.5.4>    Compiling rustls-webpki v0.101.71288wrappers-0.5.4>    Compiling sct v0.7.11289wrappers-0.5.4>    Compiling ff v0.12.11290wrappers-0.5.4>    Compiling crypto-bigint v0.4.91291wrappers-0.5.4>    Compiling ff v0.13.11292wrappers-0.5.4>    Compiling base16ct v0.1.11293wrappers-0.5.4>    Compiling unicode-segmentation v1.12.01294wrappers-0.5.4>    Compiling eyre v0.6.121295wrappers-0.5.4>    Compiling base16ct v0.2.01296wrappers-0.5.4>    Compiling ident_case v1.0.11297wrappers-0.5.4>    Compiling syn v1.0.1091298wrappers-0.5.4>    Compiling strsim v0.11.11299wrappers-0.5.4>    Compiling darling_core v0.20.111300wrappers-0.5.4>    Compiling sec1 v0.7.31301wrappers-0.5.4>    Compiling sec1 v0.3.01302wrappers-0.5.4>    Compiling group v0.13.01303wrappers-0.5.4>    Compiling group v0.12.11304wrappers-0.5.4>    Compiling event-listener v5.4.01305wrappers-0.5.4>    Compiling aws-smithy-eventstream v0.60.81306wrappers-0.5.4>    Compiling lexical-util v1.0.61307wrappers-0.5.4>    Compiling serde_urlencoded v0.7.11308wrappers-0.5.4>    Compiling signature v2.2.01309wrappers-0.5.4>    Compiling encoding_rs v0.8.351310wrappers-0.5.4>    Compiling crunchy v0.2.31311wrappers-0.5.4>    Compiling siphasher v1.0.11312wrappers-0.5.4>    Compiling unicase v2.8.11313wrappers-0.5.4>    Compiling beef v0.5.21314wrappers-0.5.4>    Compiling lazy_static v1.5.01315wrappers-0.5.4>    Compiling logos-codegen v0.14.41316wrappers-0.5.4>    Compiling phf_shared v0.11.31317wrappers-0.5.4>    Compiling aws-smithy-http v0.62.11318wrappers-0.5.4>    Compiling event-listener-strategy v0.5.41319wrappers-0.5.4>    Compiling tokio-rustls v0.24.11320wrappers-0.5.4>    Compiling elliptic-curve v0.12.31321wrappers-0.5.4>    Compiling elliptic-curve v0.13.81322wrappers-0.5.4>    Compiling darling_macro v0.20.111323wrappers-0.5.4>    Compiling rfc6979 v0.3.11324wrappers-0.5.4>    Compiling rustls-native-certs v0.6.31325wrappers-0.5.4>    Compiling rustls-pemfile v2.2.01326wrappers-0.5.4>    Compiling signature v1.6.41327wrappers-0.5.4>    Compiling mime v0.3.171328wrappers-0.5.4>    Compiling tiny-keccak v2.0.21329wrappers-0.5.4>    Compiling zlib-rs v0.5.01330wrappers-0.5.4>    Compiling adler2 v2.0.01331wrappers-0.5.4>    Compiling cranelift-srcgen v0.119.01332wrappers-0.5.4>    Compiling fixedbitset v0.4.21333wrappers-0.5.4>    Compiling fixedbitset v0.5.71334wrappers-0.5.4>    Compiling petgraph v0.6.51335wrappers-0.5.4>    Compiling cranelift-assembler-x64-meta v0.119.01336wrappers-0.5.4>    Compiling miniz_oxide v0.8.81337wrappers-0.5.4>    Compiling libz-rs-sys v0.5.01338wrappers-0.5.4>    Compiling ecdsa v0.14.8