nixbot

builds

cancelled checks.aarch64-linux.ext-http build #132 · raw · eval 39.2 s · 2.4 GiB allocated · ·

1these 332 derivations will be built:2  /nix/store/09yw6by1xkgwvadzkn03bvaxw955v632-pg_partman.drv3  /nix/store/0cmixqwsz3vb82j49j1mhvyk8crg4dcw-wrappers-0.6.0.drv4  /nix/store/f4fxzxll7q3m5cy6rib758j63zcky8dk-supabase_vault-0.2.8.drv5  /nix/store/0dxji73cc07dbqk8nny6y5mkf5qr6kl8-supabase_vault.drv6  /nix/store/fl27cr5qdrq44nk61x5yjlqxsrc8mg3n-pgsodium-3.0.4.drv7  /nix/store/jl20dg8fxlmlv84f7cda9xa6mq8y46sr-pgsodium-3.1.7.drv8  /nix/store/l6md1p6ahq43yili977j4021ky05la94-pgsodium-3.1.8.drv9  /nix/store/pvz0jf5drhdz4jj5k592kxbdgk4lm52r-pgsodium-3.1.6.drv10  /nix/store/zdz6b4s43i332x3xlvjivc7p4csihzba-pgsodium-3.1.5.drv11  /nix/store/0h7mnh8was4m19z53z0dmakrp0c9271q-pgsodium.drv12  /nix/store/0i6b8yy32fc4mgfm75w94gw9ja033kw5-wrappers-0.5.5.drv13  /nix/store/qbrypyj5k7h0pffxxshbyym24h89f2y1-gdal-3.8.5.drv14  /nix/store/s3myd88a11h86h3h8cvhgd1im0zk6i65-sfcgal-2.2.0.drv15  /nix/store/h1vl8vpk154yppn5lcqms2680igi0mmj-postgis-3.3.2.drv16  /nix/store/2ylkw9crapb58vd5g0vj602jfyb1p3r6-postgis.drv17  /nix/store/58cinn47vbvwr1wxdkspmvi9cj27b07h-safeupdate-1.4.drv18  /nix/store/6c0mnd757hvxppfyrsf4cb1wgnbd4111-safeupdate.drv19  /nix/store/ciwky5vscrx4c52kr30fm8j4idj8qgsn-pg_stat_monitor-2.1.drv20  /nix/store/7a02zvvkkkriis78wgz6n8nnkwm2gh22-pg_stat_monitor.drv21  /nix/store/9gh7fip2wf0wip8wnv1axd8ghar0x5fb-pgmq-1.5.1.drv22  /nix/store/k4swwy7459wf558rbrraclsr4sjccz0h-pgmq-1.4.4.drv23  /nix/store/8zsadvm8mv18kpy4qy724ps2jlbsik0w-pgmq.drv24  /nix/store/4wk9vb1q3kdnhj8hsq8pwgbp82glwg9w-timescaledb-2.9.1.drv25  /nix/store/9wzj3wh6sczzk849dmjwvmnkshggakxp-timescaledb.drv26  /nix/store/2nmg9sxx50xmndps3714hbvwjyd5rqv0-vector-0.8.2.drv27  /nix/store/94d6rmv5v8zdjsgzl3yrhpg7zq6zdjpx-vector-0.5.1.drv28  /nix/store/alajylsl9b90m65n0ps0mkbkw679x4sn-vector-0.6.2.drv29  /nix/store/jmilv9h5p0v4grgqnhfn22i7zl352ybh-vector-0.7.4.drv30  /nix/store/q3mdjvqpw4xbwcjy5y1ps1igxsjvx133-vector-0.7.0.drv31  /nix/store/v5dnr617av2jgk6kpddxbxxqjqgl5kzg-vector-0.8.0.drv32  /nix/store/z40s48rz55qgpw6g6wiqi68hkfas4h1l-vector-0.6.0.drv33  /nix/store/zygvf0wgqsyi96fangshfkwjiyylhvkz-vector-0.4.0.drv34  /nix/store/9zndhfzc45vrfn297g1hav7m6ba3rlzk-vector.drv35  /nix/store/0nln7k62ggiw9s5y0icr3hyribl5iazb-pg_graphql-1.2.3.drv36  /nix/store/63ifr5p2wzl7vygaj7pq847nwnrnxm3p-pg_graphql-1.5.0.drv37  /nix/store/6hfik9nnrihzb6dj53in06v6a4qmgsj3-pg_graphql-1.5.7.drv38  /nix/store/7pqhalqwaggagybgy24lm93c5b8d4isk-pg_graphql-1.4.2.drv39  /nix/store/ag5rlkqwfkwlgvxg1yhivjqfcaq2w14v-pg_graphql-1.5.1-mergeless.drv40  /nix/store/cgazfazb4ak4csd48khgjsa4vxmmddfb-pg_graphql-1.5.11.drv41  /nix/store/d78fjdz9zrccq7f563jz9fj1a45yrq5x-pg_graphql-1.1.0.drv42  /nix/store/dk0a0irlxsl04249qy2dnc6bm4wkk1lc-pg_graphql-1.6.1.drv43  /nix/store/dnwfmlfwyqnkzy2jyzf6h3q044wk6hbg-pg_graphql-1.5.9.drv44  /nix/store/f694g0m8chfk6z6yh787135bzcqwnli4-pg_graphql-1.5.4.drv45  /nix/store/fsgiwnrg38ssgf05vkmzc21v93a36qmd-pg_graphql-1.2.2.drv46  /nix/store/h9damb814a5fmzyc5wgcildkm32vy1bv-pg_graphql-1.6.2.drv47  /nix/store/iq0gzwfxzxkns0gpdkhjx1cc6s4q1i2q-pg_graphql-1.5.6.drv48  /nix/store/q66z8j5qs96rgahzmlrq4n41d2avywar-pg_graphql-1.0.2.drv49  /nix/store/v0mqjlj6j73wpc66h34djrv08j7q3l8w-pg_graphql-1.4.4.drv50  /nix/store/wnn3f47lz59i84mdzvmc1a7man89cmic-pg_graphql-1.2.0.drv51  /nix/store/yds474rgqgxjdw6zm0ylvpvvd4l0xmkl-pg_graphql-1.4.1.drv52  /nix/store/yhfqz2chz94q9k3rv8hgwcsyri02wlm8-pg_graphql-1.5.1.drv53  /nix/store/a4icbsgspmpi3nfs8vffp42sg9v7a25f-pg_graphql.drv54  /nix/store/c08rdgxba5n6zhyp78l8sd6fhnbc4a4c-pgsodium-3.1.7.drv55  /nix/store/hh2jpg5qdwgdwzi96qcay1a5ffhi0f4i-pgsodium-3.1.6.drv56  /nix/store/jwrjvb9m50v44sla4jpig83jab7zn17x-pgsodium-3.1.8.drv57  /nix/store/m1xdmpffkflwgdin5ljvfh72wxq5lxpx-pgsodium-3.1.5.drv58  /nix/store/wjhhlaiwzvm5m08my4d983icdmcpllzd-pgsodium-3.0.4.drv59  /nix/store/a9laaq557mna86dm87lq3211xy5h2zyl-pgsodium.drv60  /nix/store/i0gq8yqxp5h7l782n2ki94b1d62m6zsg-plpgsql_check-2.2.drv61  /nix/store/q117a7mx5d5bzln8xg24fh1vfzq7bsz4-plpgsql_check-2.7.drv62  /nix/store/rj6qw8pwvr91cy6qyp8xibrw4arrpj9j-plpgsql_check-2.8.drv63  /nix/store/c782i897gj20c0r8bmphf8p6r5s5wdli-plpgsql_check.drv64  /nix/store/b139hl0gpc9icb6j6q28gl1chw7i9260-rum-1.3.drv65  /nix/store/csvzp35khfq15v5g275y14094s58v10k-rum.drv66  /nix/store/c2pcswnd4yfp02pas6a7grpm0fmk70wx-supabase_vault-0.3.1.drv67  /nix/store/jb3j93i6ljmvqkv5cnv3lh3d9zn4zcjz-supabase_vault-0.2.8.drv68  /nix/store/gc3nb7r1a8rbf6f8yf4zs2nnb65awkxq-supabase_vault.drv69  /nix/store/7inhp3jz4x6l1m2i6aa1w6bbb91r1hay-pgroonga-3.2.5.drv70  /nix/store/xim497rkcncpxb5vvyli3j4jnziyybgy-pgroonga-3.0.7.drv71  /nix/store/gdd3j67qcdibplv1d440a6gsix87s5xs-pgroonga.drv72  /nix/store/ihx5q75k74a4cqq4k9bwnl5yin262kq2-pgrouting-3.4.1.drv73  /nix/store/hf9dly2ryx969lw950ld454fqfa6c41r-pgrouting.drv74  /nix/store/8kjmsmcqakfh251gpi83kpszgvy3zgj2-pg_jsonschema-0.3.1.drv75  /nix/store/pqncxlsh0gj7xk3n4mwxqiyyzim9c7g7-pg_jsonschema-0.2.0.drv76  /nix/store/iljk5j7rhldnws1iwi3j8qjxnaalxqjv-pg_jsonschema.drv77  /nix/store/82vdx9lfkbv67j79qzi9yzvqrj043w52-wal2json-2.6.drv78  /nix/store/iz713zhjyn0lym6ls12i9vxca9cxf4hi-wal2json.drv79  /nix/store/zfhvj40marmxclav9a5ppx3dmq3xd3hh-pg_partman-5.3.1.drv80  /nix/store/jcxqgl4g37gj09v4km7dl525ym1kxla2-pg_partman.drv81  /nix/store/mc1n2fml7avin2lrpgrd5cx7wjdb4gcg-pg_hashids-1.3.0-cd0e1b31d52b394a0df64079406a14a4f7387cd6.drv82  /nix/store/jsqjxdn4qp571nvc40r8xx103s9qb7c9-pg_hashids.drv83  /nix/store/7lzcc5d36122752hpjb6lij6sc2ai2a0-plv8-3.1.5.drv84  /nix/store/87brzrl1nsm8z4my02aldnxd8fb0i69x-plv8-3.1.4.drv85  /nix/store/k6nh1vivj2dgh0jk2mpsiy4p5v6sjyzk-plv8.drv86  /nix/store/xjfjfch45p5g0snar9qpm4amblh2jya8-plan_filter-0.1.drv87  /nix/store/lhdnha0m1rqpv0cmivzv3s7znjmgxc14-plan_filter.drv88  /nix/store/0n0iaya9csx9by2pimrx1yglzw8dp4zs-pg_net-0.13.0.drv89  /nix/store/25f3j4f5ialq0qwpdpc7gya55q9i2mai-pg_net-0.11.0.drv90  /nix/store/6nzc8mspw5i4qqlvgriv2l1439xlh68v-pg_net-0.10.0.drv91  /nix/store/7iq4z475k625nsn9wc9nf4vxa7x1f1qd-pg_net-0.19.5.drv92  /nix/store/cfrc2vk3cgabx1447j2n7s3zxraq6395-pg_net-0.14.0.drv93  /nix/store/iwq28h7yniccm9ra8q6dc0wma0l6hnqn-pg_net-0.6.drv94  /nix/store/nw3d144zhshkgx1z66g9g2wg5829w36n-pg_net-0.7.1.drv95  /nix/store/nwcnf7x9i2zdx48936w9ixsnxzhbab16-pg_net-0.20.0.drv96  /nix/store/rfdqkjkjdwz7ydrwlfn9cdy68zz9z6rf-pg_net-0.7.drv97  /nix/store/whvqb38akl195470ks3jads9kmq2i9gj-pg_net-0.8.0.drv98  /nix/store/zy29jzcj1bsz7760wbmlg78czaddsrni-pg_net-0.20.3.drv99  /nix/store/q7ak647qv213m4vc4fnr43i09azs1b0p-pg_net.drv100  /nix/store/s7vxni6a17dm43jdicq8ksfjsk2d7c0n-pgaudit.drv101  /nix/store/nwi7hxl3j1cxn7ylrkx8sbbg3sqld8ag-pgtap-1.3.3.drv102  /nix/store/sxzi0qg4ingw35zkbi2pk2vfgxbq5k2a-pgtap.drv103  /nix/store/xcji3ff216yxrc2yf2yss6mza01w0ccm-pg_cron.drv104  /nix/store/21s45rg3i2jfhdarxmqf3dr79allgdgh-wrappers-0.4.5.drv105  /nix/store/56j6z0f3g50m72cj7ynr22p9fdml79q9-wrappers-0.5.3.drv106  /nix/store/9m4hgq2s9z1cy1508wymdcl2n1w3ky5h-wrappers-0.6.2.drv107  /nix/store/f3b53aqd65czxnbbash43yraza54ds7k-wrappers-0.4.3.drv108  /nix/store/fpcwzjw9wdhbljjpcjlbz4w6236qzl70-wrappers-0.3.0.drv109  /nix/store/hygnfcb7az5nw4c4aranasi27gnhzgan-wrappers-0.6.3.drv110  /nix/store/iimlppn24xgvgjvnm4xp8z9bxl4p4p1d-wrappers-0.4.1.drv111  /nix/store/l3ww3jfvj5l8bp25p66wrjziy8m0vi23-wrappers-0.5.0.drv112  /nix/store/ns9rs9anq0rsl3sh1rhxmqcsll7lkjd0-wrappers-0.5.6.drv113  /nix/store/nvjw377g2m07i1z93mngr72qhpjmafvy-wrappers-0.4.6.drv114  /nix/store/qzn17ml7z84zcmcw96j0z0f6m9j6y7qm-wrappers-0.5.4.drv115  /nix/store/xbhixx8nl4iifcfi17lpavbs9cxcg5ka-wrappers-0.6.1.drv116  /nix/store/y06jjr5k7hk7zs8gzilg4g50b184va6a-wrappers-0.4.2.drv117  /nix/store/y1qh08g7i9w1x2s10rq7ammigljy82kw-wrappers-0.4.4.drv118  /nix/store/z1yzqa9qzq4ri1f58lngsljs0abhgjz5-wrappers-0.5.7.drv119  /nix/store/xcq8s20l2ynk52356w6nqkdw7379h4g4-wrappers.drv120  /nix/store/3m1k34jx4kw90mcghzrp83c2dfhrwab8-pg_repack-1.5.1.drv121  /nix/store/c7dnz58z4jqy26qinfmray2nlvxx3442-pg_repack-1.4.8.drv122  /nix/store/iwgg2la44vzaaa2ja2xyaydck2jab651-pg_repack-1.5.2.drv123  /nix/store/xd0qgx5kfkw00jgxs1v9rm4ksfdjky95-pg_repack.drv124  /nix/store/fakh4z5ssr1vhknp3xv3ch232i3ph2ax-postgresql-and-plugins-15.19.drv125  /nix/store/4z7sbcap8vdzfs1smz81k2crr4sgm640-postgresql-and-plugins-15.19.drv126  /nix/store/q4qvxkwv7rl1jac9sf5aap56gjx0n5mb-system-path.drv127  /nix/store/9in45xg9fcahx70h7alf6jg08sin568q-dbus-1.drv128  /nix/store/jffmpfrihfl3k6lfgdc4ii4a62343h7x-X-Restart-Triggers-dbus.drv129  /nix/store/0jyfsa7sd5nhfiwbk0i0i0k7bbgigy6z-unit-dbus.service.drv130  /nix/store/0nn0jglvy3w5hd868rilks6acxx242hj-pg_net-0.19.5.drv131  /nix/store/0q3jswlrym436vq3yzd7nmxpfpc7zbw7-wrappers-0.5.6.drv132  /nix/store/0wbkhlgz00c1nhm74adar4kk6dbid1dq-pg_graphql-1.5.11.drv133  /nix/store/1k3nzf8206jy6jjwdb50jn8rij79dvvj-plan_filter-0.1.drv134  /nix/store/17zhj6r14i4xx0fmzclykpcnyicwhbga-plan_filter.drv135  /nix/store/18746y4c8pvpm3al2bydwcn29pgwkjij-pg_repack-1.4.8.drv136  /nix/store/1hza0wxglhyl1641a3yki78kp045s8x2-wrappers-0.5.7.drv137  /nix/store/1mkhz1wanb7sx61imr6wqda0cqnvnj8q-wal2json-2.6.drv138  /nix/store/1r4ihdrrxnxp1kc97akzkb6yf0rhj5fy-wal2json-2.6.drv139  /nix/store/spkggw5b21kbiq57p7fq00khhxxg9mpm-http-1.6.1.drv140  /nix/store/1s2y3lhnrwphps8mxwxhj6pli5p72pz8-http.drv141  /nix/store/m94894cysabrjwxvvsg00i2c4vxrwj44-pg_graphql-1.6.1.drv142  /nix/store/nsc639d0i1mzcdskxc5v8874w8f4zf8x-pg_graphql-1.6.2.drv143  /nix/store/w47195gn53xxlfnja6kkgpgj0pbxj66m-pg_graphql-1.5.9.drv144  /nix/store/2j0amjv943p6zmhzl3mx9z6jr1qcpn3i-pg_graphql.drv145  /nix/store/2wp2aqp71l4218m1z0aas6789yx18sv3-pgrouting-3.4.1.drv146  /nix/store/564f4p7z536irjy1x7a6i39nk3n3g2r2-pgrouting.drv147  /nix/store/7m924d2lj1z3y952h3rhjixfq3sygp4r-pg_tle.drv148  /nix/store/z008z9r9dipnvldyfh7pklhxwdav0faw-http-1.6.1.drv149  /nix/store/82hvrn43v2lmbsbj2cnaaps4iy6q9dqn-http.drv150  /nix/store/k4qjk97aggz30jlgv2hdqka8fy8z07pg-supabase_vault-0.3.1.drv151  /nix/store/z8jynkjsnrfphim33c02aci4n6i2s9la-supabase_vault-0.2.8.drv152  /nix/store/8ir53vjiqz9rhip8arbxd2b58d0j67w0-supabase_vault.drv153  /nix/store/vrks8v32hwif7cfllbj4kb4i2v9b48y8-hypopg.drv154  /nix/store/yxyw8y9hskg7m2sajbfkix9g2pibkl2w-index_advisor-0.2.0.drv155  /nix/store/9c27ix09f1z8w6a63dkm9idp2vsrixh1-index_advisor.drv156  /nix/store/9sv9z7i53r40xnrigr8aywi98izk30rb-wal2json.drv157  /nix/store/g3yy08xhp6kakigznjmymrvasv6xhzz4-rum-1.3.drv158  /nix/store/apcx516gwjdivwb00nzvgwwq26mp6kbp-rum.drv159  /nix/store/az9kzhbrx32y837x7nl7dfajllv3l3xn-pg_jsonschema.drv160  /nix/store/ynjdlqr0w8h7ici1xdnsr79mwnzmyyri-pgroonga-3.2.5.drv161  /nix/store/c7b5vgzvlwgra3bhwq5fjzl0cg8lxq53-pgroonga.drv162  /nix/store/axpz1dvivwnmwkkcs392nj9cp1zs4x4h-pg_repack-1.4.8.drv163  /nix/store/gpxphj5cc5qbfjvp1kckicqwibgb6870-pg_repack-1.5.0.drv164  /nix/store/nynlpdydjmjk2fk2fsjz9bws5n6pjjyv-pg_repack-1.5.1.drv165  /nix/store/sa036niivyjgc2rqi9xh890msxh349l9-pg_repack-1.5.2.drv166  /nix/store/f4jr9drjzv7wfj2rxqg6fxg4ki5xv8aq-pg_repack.drv167  /nix/store/3cgs2dl0nwcsnwa5j7vkkp9vnqrax686-wrappers-0.6.0.drv168  /nix/store/74dcpcc376carhrdcf8ka4zmkawz1yv6-wrappers-0.5.4.drv169  /nix/store/92vrj7bj8hswwppxa34pv4a5mcishcns-wrappers-0.4.4.drv170  /nix/store/96l1zwmvz2ffcdfraaalfc6lvhah4kbz-wrappers-0.5.5.drv171  /nix/store/adcv6z66z4kpsasjjh1mcxa915lbdppl-wrappers-0.4.5.drv172  /nix/store/b4n3d1kid5pcaqfl3fjnjmc425dgg1p1-wrappers-0.5.0.drv173  /nix/store/jcd2gw4vawwnh0pmxhl4pl3ll6adggx5-wrappers-0.6.2.drv174  /nix/store/vxwdlzq8s4jj92x0jpc4sl9drjywlalq-wrappers-0.6.3.drv175  /nix/store/xwhq66cqc0ms922bxlcgc1jwff6kqv8g-wrappers-0.5.3.drv176  /nix/store/y6kq63cxxc5v5jh87mv9wpbvk0p4ayfg-wrappers-0.6.1.drv177  /nix/store/zdyyj4cgmfdl46zb5ycwmwr6d30w6mbx-wrappers-0.4.6.drv178  /nix/store/fn58ja37h9fw7mszrd75faxdb0999f0i-wrappers.drv179  /nix/store/8yjdx0pjzbx41fx807nrw1js3y16kbz5-vector-0.5.1.drv180  /nix/store/9yiwshvqw6zii2gdbjn3whic00kdi2kk-vector-0.7.4.drv181  /nix/store/gd4y86918lqw8gzxg8nqrz8sy2dqq9fb-vector-0.7.0.drv182  /nix/store/gdgmh15k0z47wvlyk7n79hg9mm7jzisl-vector-0.6.2.drv183  /nix/store/hs3bxh6aa4yj96k9qp50af7qy1jchwk3-vector-0.6.0.drv184  /nix/store/j5mchw8xwd04x2c28fmf7pccna5x7y95-vector-0.8.2.drv185  /nix/store/qa8qkhza8bf74v69dzxgqvy2mjf799yl-vector-0.8.0.drv186  /nix/store/g5mv4minlqr25pj8gqhzcns6w7bwzaph-vector.drv187  /nix/store/lkbp0bzzg49y6z9h7ms156q0jsiq6qh4-safeupdate-1.4.drv188  /nix/store/icwncd52zxyvvybn79pvj2s9day934p8-safeupdate.drv189  /nix/store/j99v4y7ck8sk68hj9m9aw1avc2dkn4nh-pg_stat_monitor.drv190  /nix/store/9kmiqqmclsl8d77yd54al2d2wlwc6dp1-pgsodium-3.0.4.drv191  /nix/store/ckl9zg69wqkncwizrd6lln7h5492wwn6-pgsodium-3.1.6.drv192  /nix/store/lhi0y1xi9i9i1c8kg95nfhdw95j3dz3r-pgsodium-3.1.5.drv193  /nix/store/msmzmvngp6cx4yl0dwgzp3iv7bv796wg-pgsodium-3.1.8.drv194  /nix/store/zwypkv0vf8m8ybs536jq5wglvhfwdx8y-pgsodium-3.1.7.drv195  /nix/store/l68xzbdq736nzdnwvr9q3x29wcngcsj1-pgsodium.drv196  /nix/store/qk4j715gipc827yxrcwv0g9pviaqxkyy-pg_partman.drv197  /nix/store/46l7zbh5kkmyi58x419ar4kly30qvnhi-gdal-3.8.5.drv198  /nix/store/apd0c6nk3x333r1xj0sl2m3cr96pbizv-postgis-3.3.7.drv199  /nix/store/r12320b80inhy5aq434asc4sa8w6bn0g-postgis.drv200  /nix/store/36hfvpcvdxj64718i9mhil3db8835a6q-plpgsql_check-2.7.drv201  /nix/store/9lpr8r6zwzid07ihmr89rnxqcwv0yfja-plpgsql_check-2.8.drv202  /nix/store/rly88629k74w1nj10q0l6mg2jvd3nr1g-plpgsql_check.drv203  /nix/store/83ycsfk9ivb7sah3lq89d8hy5rxj5vpp-pg_net-0.20.3.drv204  /nix/store/a0ldx82cv1chkbdks86c8mjp8ps4lfgn-pg_net-0.20.0.drv205  /nix/store/b0270km6h57kbdxfkhagcpsilp239adm-pg_net-0.11.0.drv206  /nix/store/lbqp8bfrqa2xm82ma6wyq1gijyajh6kh-pg_net-0.13.0.drv207  /nix/store/rdglczxf0sk4hhwsppqw13zl43vf5wr0-pg_net-0.14.0.drv208  /nix/store/w7547z9slhcibw4s6cwkag6w1f49317s-pg_net-0.20.4.drv209  /nix/store/vvs47f973jig6lflvm7cidm6m20glpy5-pg_net.drv210  /nix/store/92dxzgq4qn1jl389a931z1n5n1a8s5ns-pg_hashids-1.3.0-cd0e1b31d52b394a0df64079406a14a4f7387cd6.drv211  /nix/store/x1kpz6n29pqn2xm06lprn5kwpr0pjhhx-pg_hashids.drv212  /nix/store/y1p5dlzmilwxqbf3a4c7hl6gp9p84wsl-pgmq-1.5.1.drv213  /nix/store/y5rgrfmhzrjr0j6zil7ksqdbcglh0s8i-pgmq.drv214  /nix/store/ybhpqdys29q375m5pxxn2w3cbzgf3mxg-pg_cron.drv215  /nix/store/mpyn776iqdn7h94vlp5yxn83a0y4lchc-pgtap-1.3.3.drv216  /nix/store/psjbrnijdnpqyc9s718av7nwmyk0fays-pgtap-1.3.1.drv217  /nix/store/zf19xpsa8jj4bmx09awww0z16cm79z4g-pgtap.drv218  /nix/store/2fndab8axk4hz4s30ijaxnpa1bc9z1dc-postgresql-and-plugins-17_22.drv219  /nix/store/2h15dgac1417g71pjrb4aqcz8yabiv21-plpgsql_check-2.7.drv220  /nix/store/2i3blwmkdwv0753xgc4pb1rm16gk4jmv-wrappers-0.5.6.drv221  /nix/store/2x6xkwfx99zhzhdbmhbrnifqf63l8ica-pg_jsonschema.drv222  /nix/store/381ghgpkv0l9lnv0f1v2jxfg04cspiih-rum-1.3.drv223  /nix/store/3dxfnbp09hx3zc5q8mmvb54v0nb1lrid-plpgsql_check-2.8.drv224  /nix/store/48mqx57r48j330b49mc32k7bvy6445c2-wal2json.drv225  /nix/store/83syfrxa296qd37cig3f07glk8hn533v-pg_stat_monitor.drv226  /nix/store/8szfd9ycs8amd9k5vlvg6prcijxwqr3j-hypopg.drv227  /nix/store/sww4kz29ir2aly4abpn3hb8zfqy4ak06-pg_cron-1.6.4.drv228  /nix/store/9w316phdvwdjv5875fpg98qwdi7hxzv5-pg_cron.drv229  /nix/store/k7h19a5nads14nh23z55wp7vpifpqdcg-pgtap-1.3.3.drv230  /nix/store/b3wykhrc5d96h1ddr0n8jc0vm6lda047-pgtap.drv231  /nix/store/msp1w36fm572jxlq4yj3ilwksxa0qpag-safeupdate-1.4.drv232  /nix/store/fl0xvi8swv20jz0vkfsm12znd6mp9naq-safeupdate.drv233  /nix/store/5ls8sxw33v0sm4agddi4xzky3nvhg3g7-index_advisor-0.2.0.drv234  /nix/store/hnandxbj17d43iq41vk9jgn2mk94s7fg-index_advisor.drv235  /nix/store/4dv0hiafadp1s6dx9i8qfwajgh422j5n-pg_graphql-1.6.1.drv236  /nix/store/5sxmls2c3rj1id1jy8cp90d7aga5vs9y-pg_graphql-1.5.9.drv237  /nix/store/6f7pk59bx81p58zx4lxc0kpr0a4pskc3-pg_graphql-1.5.11.drv238  /nix/store/kxm7a9483vsp4n6zn93isjb5z31l42fd-pg_graphql-1.6.2.drv239  /nix/store/k2r44m3w1mwab1ipx8m72764yyhxr38v-pg_graphql.drv240  /nix/store/k4lajdzpb6zgp35ib3yfg5hk7p7kj1z3-rum.drv241  /nix/store/8p8fsl25zwlaqwhknw8myg0lfhi6rhsg-wrappers-0.6.0.drv242  /nix/store/a9l3bgzraqwg33ax5gcmbqwrkrrxxnag-wrappers-0.4.5.drv243  /nix/store/fh5b65jxgdyzwrs2g7y12ffnk1yhxczn-wrappers-0.5.7.drv244  /nix/store/h81r7798azz2nz8s3pxp1drpa02ma2m8-wrappers-0.5.4.drv245  /nix/store/hlpygbdz705888l5vwvvnz96901jdbkn-wrappers-0.5.5.drv246  /nix/store/kcan9i952k07b3pm1fnq4s0f7pfn7yx9-wrappers-0.5.3.drv247  /nix/store/pvzl31ydc0nhwqmrw9agqqbmk4v4ycr8-wrappers-0.6.3.drv248  /nix/store/q0lgs5nhw27p302wa3gp300l19ad95f0-wrappers-0.4.4.drv249  /nix/store/rfn5rhjy53sq47kjz5qfawd9pz9a38l1-wrappers-0.5.0.drv250  /nix/store/sg3hglpfqxg0bdxvkn36jnvpd752brga-wrappers-0.4.6.drv251  /nix/store/sn2m8z01kbz72vbl839b4qdhql2lf67m-wrappers-0.6.1.drv252  /nix/store/w5gnd7pybydask3lizsy3lirm83jxx56-wrappers-0.6.2.drv253  /nix/store/kplnvybrmx8df99qr3hsafbkky7hfg3v-wrappers.drv254  /nix/store/ibl9nbmh9mbqgqqfkrq7vgqzbsxj392q-pgmq-1.5.1.drv255  /nix/store/kv8jjb4gkylvk18qlsxl5lp9k29b1d31-pgmq.drv256  /nix/store/hnhqkd9jnn7w4z0z0jacwjwg9x016gyl-pg_repack-1.5.0.drv257  /nix/store/rhyhx66rvbmsmh7i4xf5dqi3pr058hjr-pg_repack-1.5.1.drv258  /nix/store/x14ai73x9yl5ckncl830rpbqxpjvvbg5-pg_repack-1.5.2.drv259  /nix/store/m6b5d5vphi1v49cpgr7ff07zvzfri21p-pg_repack.drv260  /nix/store/q8n9c44w9m7lggw81a93q8rvr4jgmslx-plan_filter-0.1.drv261  /nix/store/n1y2c26wz7wmff6xrz6ggk6zvsgma4bk-plan_filter.drv262  /nix/store/8byjp94z4bcpvgpc2s8ga2rqg9c3xc55-pgrouting-3.4.1.drv263  /nix/store/qs7fc4p2b8g3zc4cd29vi1wck7acipz9-pgrouting.drv264  /nix/store/rqv928k6h7v2jlfgznn4wi7km7zvm5qk-pg_tle.drv265  /nix/store/v635079aqf2hhpg4xnhm2226g7khvdav-plpgsql_check.drv266  /nix/store/84hgdiz6hjkzk0cm5bd3vqsbx45n9zkh-vector-0.8.0.drv267  /nix/store/92n1zijp3izg793lrskmws7kyjz1xg5h-vector-0.6.2.drv268  /nix/store/bxnxr2z670m9ri1dc66149krs7h60dnc-vector-0.7.0.drv269  /nix/store/nyx1ahbyki15bmvygqzj2s1nnbmbi8ig-vector-0.7.4.drv270  /nix/store/s72y0nj96pwds84md5hz9x09cidw3azz-vector-0.6.0.drv271  /nix/store/wy228ccg72w2cv5rbhynqgmbxx7dqlws-vector-0.5.1.drv272  /nix/store/za0ss4y8awhkng526g581wdnh0azibcf-vector-0.8.2.drv273  /nix/store/x3iqn55b29mih079vypw11gf008gj74l-vector.drv274  /nix/store/6601flp9bdqz93g493ma3hhb95ia16fh-pgroonga-3.2.5.drv275  /nix/store/xkmdckj5hdcfgqlyjn2qq5vdv6s09h5a-pgroonga.drv276  /nix/store/al6g5cvx86v4ljmh3sg6hmlsl3ab3bwf-pg_net-0.20.3.drv277  /nix/store/b1pyvgjyn940h95bbnsp15qmb0qli5gd-pg_net-0.20.0.drv278  /nix/store/cl8ikglrq6jdd2cp01jad7n483mvqj8g-pg_net-0.11.0.drv279  /nix/store/g6nfp5n056kw2jvfzldzxrrrxfpfcka0-pg_net-0.13.0.drv280  /nix/store/xwiwd8fzjgv67zb2ji446a8vxjj3s7bs-pg_net-0.14.0.drv281  /nix/store/yf5z0qi17vprkjz68rqyp804sx929g9n-pg_net-0.19.5.drv282  /nix/store/y02vszvrhs7b6kn8llgwzdmnmhqiymzk-pg_net.drv283  /nix/store/k684vf2v1w6afbwv98r05j1f5hg9gw2f-pg_hashids-1.3.0-cd0e1b31d52b394a0df64079406a14a4f7387cd6.drv284  /nix/store/yi643dw2hzxidf2jf635pk0da5c4bs96-pg_hashids.drv285  /nix/store/mxhjb2qfqd8l49wakfpw5qiws2v1bcnn-gdal-3.8.5.drv286  /nix/store/mrfs1y0f5l367m93gpss7lp0jg6nz3bf-postgis-3.3.7.drv287  /nix/store/yskfmp4z518h4ff0mli70gsirhsli1ns-postgis.drv288  /nix/store/nj44phx30461wf1ac6n8fg8cc58agpgv-postgresql-and-plugins-17.11.drv289  /nix/store/rn61yq57k8lhdkx7al266vkbandycwv7-postgresql-and-plugins-17.11.drv290  /nix/store/czird9kid1f479i75r0fcy4ivzd3zzs8-system-path.drv291  /nix/store/i0ygxsqq6na1vsqmbklzxrj1xy5ypk6x-dbus-1.drv292  /nix/store/xnzsv2ymk0qx1fdsm8ssls8mlq8852wc-X-Restart-Triggers-dbus.drv293  /nix/store/5q0f5sx5mas5cc56azv1g9pm53yfrmgc-unit-dbus.service.drv294  /nix/store/a03cbyqm7arwjx83nc7jiwxkbbifg33w-user-units.drv295  /nix/store/acfna74pf7f063994dvxzqkrrhi623c4-unit-dbus.service.drv296  /nix/store/wmsihsmjyk0h8yjj86lpmijxpzqwk8gg-postgresql-migrate.drv297  /nix/store/pml1z1qw471w7nshf5dxp826pysqs3fz-unit-postgresql-migrate.service.drv298  /nix/store/rjsqz027b1xj9q5dymzvs3wbqn2dv53m-postgresql-init.drv299  /nix/store/rj8grxjirxn5picmni952n5lj73j75jh-unit-postgresql.service.drv300  /nix/store/bxplw4b8vnymp87mhampir2cgwlqssj8-system-units.drv301  /nix/store/hkk6jajgfa3kq2a6gcaq4h6rmhmrbv00-etc.drv302  /nix/store/hc9q1k7i1swx3f1rvz6brc87xd4jchk4-activate.drv303  /nix/store/3hd2apjsn46yjm4cb9skx60p0rkaz2nn-nixos-system-server-test.drv304  /nix/store/qbfmigmm8fk4v5nhvb8h71hmhmdaky0g-supabase-db-init.drv305  /nix/store/ggfylf6a7iwk3pn3r08m30684z8rrq5l-unit-supabase-db-init.service.drv306  /nix/store/qdnzj94lsswqxk5mp7i7k9gbijdzazls-unit-postgresql.service.drv307  /nix/store/8jfp2dvp8g4hrg54xvmdbffmnd4rmgh4-system-units.drv308  /nix/store/70bg25srcrfnwivfph4bhslzhigdgpxw-unit-dbus.service.drv309  /nix/store/cpy2j0c5ribiykpjaig0axzryxzh1g69-user-units.drv310  /nix/store/nysqx4iqflhbrn83l22ggf3kwnz8c53n-etc.drv311  /nix/store/59dzbm0m834zccwhk5nxgwrcnmn142nw-activate.drv312  /nix/store/i3fy4azgna3zl2za0k3pwx70f2sk6hk8-receipt.drv313  /nix/store/w85w5162f9zdpi7g98sjlk186hrrm57p-postgresql-and-plugins-17_22.drv314  /nix/store/amy1ji0k53n9qihnqys9hvlc60bncr1y-system-path.drv315  /nix/store/7ynly7nv4iq2wvhmmg6p100h3wr2dpxd-dbus-1.drv316  /nix/store/8r4vw45si1w8qby225b0amhay9ybj6c5-postgresql-orioledb-init.drv317  /nix/store/bwsmsmh67xqiaqfxbdj9fb4kvxxcn5ra-unit-postgresql.service.drv318  /nix/store/v749g53p5djbqg3y7kfvdsw5g535j0js-X-Restart-Triggers-dbus.drv319  /nix/store/jika4rfg3aj00vq2nfqx2i6nild4nvd5-unit-dbus.service.drv320  /nix/store/9i9flpkzn6d3cvhin3s644150jhvcazf-supabase-orioledb-db-init.drv321  /nix/store/s4qicdb2kbzvf3lf6m8xidm4lndgs2yl-unit-supabase-db-init.service.drv322  /nix/store/a6q8qhqvq5cfv1rac2v6b0zznycvyjks-system-units.drv323  /nix/store/n7wg70ga6zm8b0prwd4np0azpi732zji-unit-dbus.service.drv324  /nix/store/bmn9rg4vrb07wyj1ls41afzdzcmhdqcm-user-units.drv325  /nix/store/k8hnmf1018bibcpa7la901apv9fwzlym-etc.drv326  /nix/store/kv6kklx0vd2hahla7j2m4snhk8yr2mc4-activate.drv327  /nix/store/wxlz59jjpygb6cwjjr7v3kr2fim6025p-nixos-system-server-test.drv328  /nix/store/fq2rhsxwyjjcizqwi73fw8wzav8kznhc-nixos-system-server-test.drv329  /nix/store/s711jmyb8cvb22ifzk3h91355zfrcg7y-closure-info.drv330  /nix/store/qcmmabg66yi6w2v08gzx88zn216qdryl-run-nixos-vm.drv331  /nix/store/xsagpc5y678qkqijz8a29bc7cg7z02iw-nixos-vm.drv332  /nix/store/8scw6pd5gd89wj96vy1jqidxzadr5gax-nixos-test-driver-http.drv333  /nix/store/c0pkx6ixqj39gbmq5gz9vn66rp7wng3m-vm-test-run-http.drv334building '/nix/store/9w316phdvwdjv5875fpg98qwdi7hxzv5-pg_cron.drv' on 'ssh-ng://nixbot-remote-build@78.232.36.247'335building '/nix/store/c7dnz58z4jqy26qinfmray2nlvxx3442-pg_repack-1.4.8.drv' on 'ssh-ng://nixbot-remote-build@78.232.36.247'336building '/nix/store/c7dnz58z4jqy26qinfmray2nlvxx3442-pg_repack-1.4.8.drv'337pg_repack-1.4.8> Running phase: unpackPhase338pg_repack-1.4.8> unpacking source archive /nix/store/3riysfnrdibbfwpz8hjc9ld58frwh27a-source339pg_repack-1.4.8> source root is source340pg_repack-1.4.8> Running phase: patchPhase341pg_repack-1.4.8> Running phase: updateAutotoolsGnuConfigScriptsPhase342pg_repack-1.4.8> Running phase: configurePhase343pg_repack-1.4.8> no configure script, doing nothing344pg_repack-1.4.8> Running phase: buildPhase345pg_repack-1.4.8> build flags: SHELL=/nix/store/q1lr86rzsxxbbqdz8m6bcv94saaz8wlv-bash-5.3p3/bin/bash346pg_repack-1.4.8> make[1]: Entering directory '/build/source/bin'347pg_repack-1.4.8> gcc -Wall -Wmissing-prototypes -Wpointer-arith -Wdeclaration-after-statement -Werror=vla -Wendif-labels -Wmissing-format-attribute -Wimplicit-fallthrough=3 -Wcast-function-type -Wformat-security -fno-strict-aliasing -fwrapv -fexcess-precision=standard -Wno-deprecated-non-prototype -Wno-format-truncation -Wno-stringop-truncation -g -O2 -std=gnu17 -I/nix/store/48l45fvi99n90x6p9i4cs1lmzby6cb73-postgresql-15.19/include -DREPACK_VERSION=1.4.8 -I. -I./ -I/nix/store/48l45fvi99n90x6p9i4cs1lmzby6cb73-postgresql-15.19/include/server -I/nix/store/48l45fvi99n90x6p9i4cs1lmzby6cb73-postgresql-15.19/include/internal -D_GNU_SOURCE  -I/nix/store/p17klc3qq4nl9ihfwqfpi8cnqvcf92xz-libxml2-2.15.1-dev/include/libxml2 -I/nix/store/mglbi4dy4kpx7v1dcgf6iincp5x38hsc-lz4-1.10.0-dev/include -I/nix/store/g41q9md9rdcr3lkydi6f8zd6fza3h1q4-zstd-1.5.7-dev/include -I/nix/store/n2vnr7ycfk6midbzxcwd28qj3bgb50cz-icu4c-75.1-dev/include  -c -o pg_repack.o pg_repack.c348pg_repack-1.4.8> gcc -Wall -Wmissing-prototypes -Wpointer-arith -Wdeclaration-after-statement -Werror=vla -Wendif-labels -Wmissing-format-attribute -Wimplicit-fallthrough=3 -Wcast-function-type -Wformat-security -fno-strict-aliasing -fwrapv -fexcess-precision=standard -Wno-deprecated-non-prototype -Wno-format-truncation -Wno-stringop-truncation -g -O2 -std=gnu17 -I/nix/store/48l45fvi99n90x6p9i4cs1lmzby6cb73-postgresql-15.19/include -DREPACK_VERSION=1.4.8 -I. -I./ -I/nix/store/48l45fvi99n90x6p9i4cs1lmzby6cb73-postgresql-15.19/include/server -I/nix/store/48l45fvi99n90x6p9i4cs1lmzby6cb73-postgresql-15.19/include/internal -D_GNU_SOURCE  -I/nix/store/p17klc3qq4nl9ihfwqfpi8cnqvcf92xz-libxml2-2.15.1-dev/include/libxml2 -I/nix/store/mglbi4dy4kpx7v1dcgf6iincp5x38hsc-lz4-1.10.0-dev/include -I/nix/store/g41q9md9rdcr3lkydi6f8zd6fza3h1q4-zstd-1.5.7-dev/include -I/nix/store/n2vnr7ycfk6midbzxcwd28qj3bgb50cz-icu4c-75.1-dev/include  -c -o pgut/pgut.o pgut/pgut.c349pg_repack-1.4.8> gcc -Wall -Wmissing-prototypes -Wpointer-arith -Wdeclaration-after-statement -Werror=vla -Wendif-labels -Wmissing-format-attribute -Wimplicit-fallthrough=3 -Wcast-function-type -Wformat-security -fno-strict-aliasing -fwrapv -fexcess-precision=standard -Wno-deprecated-non-prototype -Wno-format-truncation -Wno-stringop-truncation -g -O2 -std=gnu17 -I/nix/store/48l45fvi99n90x6p9i4cs1lmzby6cb73-postgresql-15.19/include -DREPACK_VERSION=1.4.8 -I. -I./ -I/nix/store/48l45fvi99n90x6p9i4cs1lmzby6cb73-postgresql-15.19/include/server -I/nix/store/48l45fvi99n90x6p9i4cs1lmzby6cb73-postgresql-15.19/include/internal -D_GNU_SOURCE  -I/nix/store/p17klc3qq4nl9ihfwqfpi8cnqvcf92xz-libxml2-2.15.1-dev/include/libxml2 -I/nix/store/mglbi4dy4kpx7v1dcgf6iincp5x38hsc-lz4-1.10.0-dev/include -I/nix/store/g41q9md9rdcr3lkydi6f8zd6fza3h1q4-zstd-1.5.7-dev/include -I/nix/store/n2vnr7ycfk6midbzxcwd28qj3bgb50cz-icu4c-75.1-dev/include  -c -o pgut/pgut-fe.o pgut/pgut-fe.c350pg_repack-1.4.8> gcc -Wall -Wmissing-prototypes -Wpointer-arith -Wdeclaration-after-statement -Werror=vla -Wendif-labels -Wmissing-format-attribute -Wimplicit-fallthrough=3 -Wcast-function-type -Wformat-security -fno-strict-aliasing -fwrapv -fexcess-precision=standard -Wno-deprecated-non-prototype -Wno-format-truncation -Wno-stringop-truncation -g -O2 -std=gnu17 pg_repack.o pgut/pgut.o pgut/pgut-fe.o  -L/nix/store/k4dpm55d68aq0df72hjk046xy1124lhn-postgresql-15.19-lib/lib   -L/nix/store/wfk1mrpj1r5f7iyihjnh0jjixr900z7y-libxml2-2.15.1/lib -L/nix/store/62b24z1igfh6ws654fhsgnm3fm7j1z3c-lz4-1.10.0-lib/lib -L/nix/store/fqy9nkaahib56gcy0r77qjk7n03cvnfs-zstd-1.5.7/lib -Wl,--as-needed -Wl,-rpath,'/nix/store/k4dpm55d68aq0df72hjk046xy1124lhn-postgresql-15.19-lib/lib',--enable-new-dtags  -L/nix/store/k4dpm55d68aq0df72hjk046xy1124lhn-postgresql-15.19-lib/lib -lpq -L/nix/store/k4dpm55d68aq0df72hjk046xy1124lhn-postgresql-15.19-lib/lib -lpgcommon -lpgport -lzstd -llz4 -lssl -lcrypto -lz -lreadline -lm -o pg_repack351pg_repack-1.4.8> make[1]: Leaving directory '/build/source/bin'352pg_repack-1.4.8> make[1]: Entering directory '/build/source/lib'353pg_repack-1.4.8> gcc -Wall -Wmissing-prototypes -Wpointer-arith -Wdeclaration-after-statement -Werror=vla -Wendif-labels -Wmissing-format-attribute -Wimplicit-fallthrough=3 -Wcast-function-type -Wformat-security -fno-strict-aliasing -fwrapv -fexcess-precision=standard -Wno-deprecated-non-prototype -Wno-format-truncation -Wno-stringop-truncation -g -O2 -std=gnu17 -fPIC -DREPACK_VERSION=1.4.8 -I. -I./ -I/nix/store/48l45fvi99n90x6p9i4cs1lmzby6cb73-postgresql-15.19/include/server -I/nix/store/48l45fvi99n90x6p9i4cs1lmzby6cb73-postgresql-15.19/include/internal -D_GNU_SOURCE  -I/nix/store/p17klc3qq4nl9ihfwqfpi8cnqvcf92xz-libxml2-2.15.1-dev/include/libxml2 -I/nix/store/mglbi4dy4kpx7v1dcgf6iincp5x38hsc-lz4-1.10.0-dev/include -I/nix/store/g41q9md9rdcr3lkydi6f8zd6fza3h1q4-zstd-1.5.7-dev/include -I/nix/store/n2vnr7ycfk6midbzxcwd28qj3bgb50cz-icu4c-75.1-dev/include  -c -o repack.o repack.c354pg_repack-1.4.8> gcc -Wall -Wmissing-prototypes -Wpointer-arith -Wdeclaration-after-statement -Werror=vla -Wendif-labels -Wmissing-format-attribute -Wimplicit-fallthrough=3 -Wcast-function-type -Wformat-security -fno-strict-aliasing -fwrapv -fexcess-precision=standard -Wno-deprecated-non-prototype -Wno-format-truncation -Wno-stringop-truncation -g -O2 -std=gnu17 -fPIC -DREPACK_VERSION=1.4.8 -I. -I./ -I/nix/store/48l45fvi99n90x6p9i4cs1lmzby6cb73-postgresql-15.19/include/server -I/nix/store/48l45fvi99n90x6p9i4cs1lmzby6cb73-postgresql-15.19/include/internal -D_GNU_SOURCE  -I/nix/store/p17klc3qq4nl9ihfwqfpi8cnqvcf92xz-libxml2-2.15.1-dev/include/libxml2 -I/nix/store/mglbi4dy4kpx7v1dcgf6iincp5x38hsc-lz4-1.10.0-dev/include -I/nix/store/g41q9md9rdcr3lkydi6f8zd6fza3h1q4-zstd-1.5.7-dev/include -I/nix/store/n2vnr7ycfk6midbzxcwd28qj3bgb50cz-icu4c-75.1-dev/include  -c -o pgut/pgut-spi.o pgut/pgut-spi.c355pg_repack-1.4.8> pgut/pgut-spi.c: In function 'execute_with_args':356pg_repack-1.4.8> pgut/pgut-spi.c:90:15: warning: 'c_nulls' may be used uninitialized [-Wmaybe-uninitialized]357pg_repack-1.4.8>    90 |         ret = SPI_execute_with_args(src, nargs, argtypes, values, c_nulls, false, 0);358pg_repack-1.4.8>       |               ^~~~~~~~~~~~~~~~~~~~~~~~~~~~~~~~~~~~~~~~~~~~~~~~~~~~~~~~~~~~~~~~~~~~~~359pg_repack-1.4.8> In file included from pgut/pgut-spi.h:13,360pg_repack-1.4.8>                  from pgut/pgut-spi.c:11:361pg_repack-1.4.8> /nix/store/48l45fvi99n90x6p9i4cs1lmzby6cb73-postgresql-15.19/include/server/executor/spi.h:135:17: note: by argument 5 of type 'const char *' to 'SPI_execute_with_args' declared here362pg_repack-1.4.8>   135 | extern int      SPI_execute_with_args(const char *src,363pg_repack-1.4.8>       |                 ^~~~~~~~~~~~~~~~~~~~~364pg_repack-1.4.8> pgut/pgut-spi.c:85:17: note: 'c_nulls' declared here365pg_repack-1.4.8>    85 |         char    c_nulls[FUNC_MAX_ARGS];366pg_repack-1.4.8>       |                 ^~~~~~~367pg_repack-1.4.8> ( echo '{ global:'; gawk '/^[^#]/ {printf "%s;\n",$1}' exports.txt; echo ' local: *; };' ) >exports.list368pg_repack-1.4.8> gcc -Wall -Wmissing-prototypes -Wpointer-arith -Wdeclaration-after-statement -Werror=vla -Wendif-labels -Wmissing-format-attribute -Wimplicit-fallthrough=3 -Wcast-function-type -Wformat-security -fno-strict-aliasing -fwrapv -fexcess-precision=standard -Wno-deprecated-non-prototype -Wno-format-truncation -Wno-stringop-truncation -g -O2 -std=gnu17 -fPIC -shared -Wl,--version-script=exports.list -o pg_repack.so repack.o pgut/pgut-spi.o -L/nix/store/k4dpm55d68aq0df72hjk046xy1124lhn-postgresql-15.19-lib/lib    -L/nix/store/wfk1mrpj1r5f7iyihjnh0jjixr900z7y-libxml2-2.15.1/lib -L/nix/store/62b24z1igfh6ws654fhsgnm3fm7j1z3c-lz4-1.10.0-lib/lib -L/nix/store/fqy9nkaahib56gcy0r77qjk7n03cvnfs-zstd-1.5.7/lib -Wl,--as-needed -Wl,-rpath,'/nix/store/k4dpm55d68aq0df72hjk046xy1124lhn-postgresql-15.19-lib/lib',--enable-new-dtags  369pg_repack-1.4.8> sed 's,REPACK_VERSION,1.4.8,g' pg_repack.sql.in \370pg_repack-1.4.8> | sed 's,relhasoids,false,g'> pg_repack--1.4.8.sql;371pg_repack-1.4.8> sed 's,REPACK_VERSION,1.4.8,g' pg_repack.control.in > pg_repack.control372pg_repack-1.4.8> make[1]: Leaving directory '/build/source/lib'373pg_repack-1.4.8> make[1]: Entering directory '/build/source/regress'374pg_repack-1.4.8> make[1]: Nothing to be done for 'all'.375pg_repack-1.4.8> make[1]: Leaving directory '/build/source/regress'376pg_repack-1.4.8> Running phase: installPhase377pg_repack-1.4.8> Running phase: fixupPhase378pg_repack-1.4.8> shrinking RPATHs of ELF executables and libraries in /nix/store/lkphy1qcf3p8avd665rm1d1fhwqaywh3-pg_repack-1.4.8379pg_repack-1.4.8> shrinking /nix/store/lkphy1qcf3p8avd665rm1d1fhwqaywh3-pg_repack-1.4.8/bin/pg_repack-1.4.8380pg_repack-1.4.8> shrinking /nix/store/lkphy1qcf3p8avd665rm1d1fhwqaywh3-pg_repack-1.4.8/lib/pg_repack-1.4.8.so381pg_repack-1.4.8> checking for references to /build/ in /nix/store/lkphy1qcf3p8avd665rm1d1fhwqaywh3-pg_repack-1.4.8...382pg_repack-1.4.8> patching script interpreter paths in /nix/store/lkphy1qcf3p8avd665rm1d1fhwqaywh3-pg_repack-1.4.8383pg_repack-1.4.8> stripping (with command strip and flags -S -p) in  /nix/store/lkphy1qcf3p8avd665rm1d1fhwqaywh3-pg_repack-1.4.8/lib /nix/store/lkphy1qcf3p8avd665rm1d1fhwqaywh3-pg_repack-1.4.8/bin384building '/nix/store/0n0iaya9csx9by2pimrx1yglzw8dp4zs-pg_net-0.13.0.drv' on 'ssh-ng://nixbot-remote-build@78.232.36.247'385building '/nix/store/0n0iaya9csx9by2pimrx1yglzw8dp4zs-pg_net-0.13.0.drv'386pg_net-0.13.0> Running phase: unpackPhase387pg_net-0.13.0> unpacking source archive /nix/store/bxdzbzjn4yi7ch55dlcgzk6npzx2p4jz-source388pg_net-0.13.0> source root is source389pg_net-0.13.0> Running phase: patchPhase390pg_net-0.13.0> Running phase: updateAutotoolsGnuConfigScriptsPhase391pg_net-0.13.0> Running phase: configurePhase392pg_net-0.13.0> no configure script, doing nothing393pg_net-0.13.0> Running phase: buildPhase394pg_net-0.13.0> gcc -Wall -Wmissing-prototypes -Wpointer-arith -Wdeclaration-after-statement -Werror=vla -Wendif-labels -Wmissing-format-attribute -Wimplicit-fallthrough=3 -Wcast-function-type -Wformat-security -fno-strict-aliasing -fwrapv -fexcess-precision=standard -Wno-deprecated-non-prototype -Wno-format-truncation -Wno-stringop-truncation -g -O2 -std=gnu17 -std=c11 -Werror -Wno-declaration-after-statement -fPIC  -DEXTVERSION=\"0.13.0\" -I. -I./ -I/nix/store/48l45fvi99n90x6p9i4cs1lmzby6cb73-postgresql-15.19/include/server -I/nix/store/48l45fvi99n90x6p9i4cs1lmzby6cb73-postgresql-15.19/include/internal -D_GNU_SOURCE  -I/nix/store/p17klc3qq4nl9ihfwqfpi8cnqvcf92xz-libxml2-2.15.1-dev/include/libxml2 -I/nix/store/mglbi4dy4kpx7v1dcgf6iincp5x38hsc-lz4-1.10.0-dev/include -I/nix/store/g41q9md9rdcr3lkydi6f8zd6fza3h1q4-zstd-1.5.7-dev/include -I/nix/store/n2vnr7ycfk6midbzxcwd28qj3bgb50cz-icu4c-75.1-dev/include  -c -o src/worker.o src/worker.c395pg_net-0.13.0> gcc -Wall -Wmissing-prototypes -Wpointer-arith -Wdeclaration-after-statement -Werror=vla -Wendif-labels -Wmissing-format-attribute -Wimplicit-fallthrough=3 -Wcast-function-type -Wformat-security -fno-strict-aliasing -fwrapv -fexcess-precision=standard -Wno-deprecated-non-prototype -Wno-format-truncation -Wno-stringop-truncation -g -O2 -std=gnu17 -std=c11 -Werror -Wno-declaration-after-statement -fPIC  -DEXTVERSION=\"0.13.0\" -I. -I./ -I/nix/store/48l45fvi99n90x6p9i4cs1lmzby6cb73-postgresql-15.19/include/server -I/nix/store/48l45fvi99n90x6p9i4cs1lmzby6cb73-postgresql-15.19/include/internal -D_GNU_SOURCE  -I/nix/store/p17klc3qq4nl9ihfwqfpi8cnqvcf92xz-libxml2-2.15.1-dev/include/libxml2 -I/nix/store/mglbi4dy4kpx7v1dcgf6iincp5x38hsc-lz4-1.10.0-dev/include -I/nix/store/g41q9md9rdcr3lkydi6f8zd6fza3h1q4-zstd-1.5.7-dev/include -I/nix/store/n2vnr7ycfk6midbzxcwd28qj3bgb50cz-icu4c-75.1-dev/include  -c -o src/util.o src/util.c396pg_net-0.13.0> gcc -Wall -Wmissing-prototypes -Wpointer-arith -Wdeclaration-after-statement -Werror=vla -Wendif-labels -Wmissing-format-attribute -Wimplicit-fallthrough=3 -Wcast-function-type -Wformat-security -fno-strict-aliasing -fwrapv -fexcess-precision=standard -Wno-deprecated-non-prototype -Wno-format-truncation -Wno-stringop-truncation -g -O2 -std=gnu17 -std=c11 -Werror -Wno-declaration-after-statement -fPIC  -DEXTVERSION=\"0.13.0\" -I. -I./ -I/nix/store/48l45fvi99n90x6p9i4cs1lmzby6cb73-postgresql-15.19/include/server -I/nix/store/48l45fvi99n90x6p9i4cs1lmzby6cb73-postgresql-15.19/include/internal -D_GNU_SOURCE  -I/nix/store/p17klc3qq4nl9ihfwqfpi8cnqvcf92xz-libxml2-2.15.1-dev/include/libxml2 -I/nix/store/mglbi4dy4kpx7v1dcgf6iincp5x38hsc-lz4-1.10.0-dev/include -I/nix/store/g41q9md9rdcr3lkydi6f8zd6fza3h1q4-zstd-1.5.7-dev/include -I/nix/store/n2vnr7ycfk6midbzxcwd28qj3bgb50cz-icu4c-75.1-dev/include  -c -o src/core.o src/core.c397pg_net-0.13.0> In file included from src/core.c:23:398pg_net-0.13.0> In function 'init_curl_handle',399pg_net-0.13.0>     inlined from 'consume_request_queue' at src/core.c:273:5:400pg_net-0.13.0> src/util.h:6:11: warning: call to 'Wcurl_easy_setopt_err_long' declared with attribute warning: curl_easy_setopt expects a long argument [-Wattribute-warning]401pg_net-0.13.0>     6 |       if (curl_easy_setopt(hdl, opt, prm) != CURLE_OK) \402pg_net-0.13.0>       |           ^~~~~~~~~~~~~~~~403pg_net-0.13.0> src/core.c:94:7: note: in expansion of macro 'CURL_EZ_SETOPT'404pg_net-0.13.0>    94 |       CURL_EZ_SETOPT(curl_ez_handle, CURLOPT_POST, 1);405pg_net-0.13.0>       |       ^~~~~~~~~~~~~~406pg_net-0.13.0> src/util.h:6:11: warning: call to 'Wcurl_easy_setopt_err_long' declared with attribute warning: curl_easy_setopt expects a long argument [-Wattribute-warning]407pg_net-0.13.0>     6 |       if (curl_easy_setopt(hdl, opt, prm) != CURLE_OK) \408pg_net-0.13.0>       |           ^~~~~~~~~~~~~~~~409pg_net-0.13.0> src/core.c:95:7: note: in expansion of macro 'CURL_EZ_SETOPT'410pg_net-0.13.0>    95 |       CURL_EZ_SETOPT(curl_ez_handle, CURLOPT_POSTFIELDSIZE, 0);411pg_net-0.13.0>       |       ^~~~~~~~~~~~~~412pg_net-0.13.0> src/util.h:6:11: warning: call to 'Wcurl_easy_setopt_err_long' declared with attribute warning: curl_easy_setopt expects a long argument [-Wattribute-warning]413pg_net-0.13.0>     6 |       if (curl_easy_setopt(hdl, opt, prm) != CURLE_OK) \414pg_net-0.13.0>       |           ^~~~~~~~~~~~~~~~415pg_net-0.13.0> src/core.c:108:3: note: in expansion of macro 'CURL_EZ_SETOPT'416pg_net-0.13.0>   108 |   CURL_EZ_SETOPT(curl_ez_handle, CURLOPT_TIMEOUT_MS, timeout_milliseconds);417pg_net-0.13.0>       |   ^~~~~~~~~~~~~~418pg_net-0.13.0> src/util.h:6:11: warning: call to 'Wcurl_easy_setopt_err_long' declared with attribute warning: curl_easy_setopt expects a long argument [-Wattribute-warning]419pg_net-0.13.0>     6 |       if (curl_easy_setopt(hdl, opt, prm) != CURLE_OK) \420pg_net-0.13.0>       |           ^~~~~~~~~~~~~~~~421pg_net-0.13.0> src/core.c:110:3: note: in expansion of macro 'CURL_EZ_SETOPT'422pg_net-0.13.0>   110 |   CURL_EZ_SETOPT(curl_ez_handle, CURLOPT_FOLLOWLOCATION, true);423pg_net-0.13.0>       |   ^~~~~~~~~~~~~~424pg_net-0.13.0> gcc -Wall -Wmissing-prototypes -Wpointer-arith -Wdeclaration-after-statement -Werror=vla -Wendif-labels -Wmissing-format-attribute -Wimplicit-fallthrough=3 -Wcast-function-type -Wformat-security -fno-strict-aliasing -fwrapv -fexcess-precision=standard -Wno-deprecated-non-prototype -Wno-format-truncation -Wno-stringop-truncation -g -O2 -std=gnu17 -std=c11 -Werror -Wno-declaration-after-statement -fPIC  -DEXTVERSION=\"0.13.0\" -I. -I./ -I/nix/store/48l45fvi99n90x6p9i4cs1lmzby6cb73-postgresql-15.19/include/server -I/nix/store/48l45fvi99n90x6p9i4cs1lmzby6cb73-postgresql-15.19/include/internal -D_GNU_SOURCE  -I/nix/store/p17klc3qq4nl9ihfwqfpi8cnqvcf92xz-libxml2-2.15.1-dev/include/libxml2 -I/nix/store/mglbi4dy4kpx7v1dcgf6iincp5x38hsc-lz4-1.10.0-dev/include -I/nix/store/g41q9md9rdcr3lkydi6f8zd6fza3h1q4-zstd-1.5.7-dev/include -I/nix/store/n2vnr7ycfk6midbzxcwd28qj3bgb50cz-icu4c-75.1-dev/include  -c -o src/event.o src/event.c425pg_net-0.13.0> In file included from /nix/store/jviasb44hibgh09829gbmbssbz2jjnhz-curl-8.17.0-dev/include/curl/curl.h:3333,426pg_net-0.13.0>                  from /nix/store/jviasb44hibgh09829gbmbssbz2jjnhz-curl-8.17.0-dev/include/curl/multi.h:51,427pg_net-0.13.0>                  from src/event.h:4,428pg_net-0.13.0>                  from src/event.c:6:429pg_net-0.13.0> /nix/store/jviasb44hibgh09829gbmbssbz2jjnhz-curl-8.17.0-dev/include/curl/multi.h:429:23: error: expected identifier or '(' before '__extension__'430pg_net-0.13.0>   429 | CURL_EXTERN CURLMcode curl_multi_setopt(CURLM *multi_handle,431pg_net-0.13.0>       |                       ^~~~~~~~~~~~~~~~~432pg_net-0.13.0> /nix/store/jviasb44hibgh09829gbmbssbz2jjnhz-curl-8.17.0-dev/include/curl/multi.h:429:23: error: expected identifier or '(' before ')' token433pg_net-0.13.0>   429 | CURL_EXTERN CURLMcode curl_multi_setopt(CURLM *multi_handle,434pg_net-0.13.0>       |                       ^~~~~~~~~~~~~~~~~435pg_net-0.13.0> make: *** [<builtin>: src/event.o] Error 1436error: build of '/nix/store/0n0iaya9csx9by2pimrx1yglzw8dp4zs-pg_net-0.13.0.drv' on 'ssh-ng://nixbot-remote-build@78.232.36.247' failed: Cannot build '/nix/store/0n0iaya9csx9by2pimrx1yglzw8dp4zs-pg_net-0.13.0.drv'.437       Reason: builder failed with exit code 2.438       Output paths:439         /nix/store/14dkr1mhbrh869r2k75r03ngw6q7c4ma-pg_net-0.13.0440       Last 25 log lines:441       >       |       ^~~~~~~~~~~~~~442       > src/util.h:6:11: warning: call to 'Wcurl_easy_setopt_err_long' declared with attribute warning: curl_easy_setopt expects a long argument [-Wattribute-warning]443       >     6 |       if (curl_easy_setopt(hdl, opt, prm) != CURLE_OK) \444       >       |           ^~~~~~~~~~~~~~~~445       > src/core.c:108:3: note: in expansion of macro 'CURL_EZ_SETOPT'446       >   108 |   CURL_EZ_SETOPT(curl_ez_handle, CURLOPT_TIMEOUT_MS, timeout_milliseconds);447       >       |   ^~~~~~~~~~~~~~448       > src/util.h:6:11: warning: call to 'Wcurl_easy_setopt_err_long' declared with attribute warning: curl_easy_setopt expects a long argument [-Wattribute-warning]449       >     6 |       if (curl_easy_setopt(hdl, opt, prm) != CURLE_OK) \450       >       |           ^~~~~~~~~~~~~~~~451       > src/core.c:110:3: note: in expansion of macro 'CURL_EZ_SETOPT'452       >   110 |   CURL_EZ_SETOPT(curl_ez_handle, CURLOPT_FOLLOWLOCATION, true);453       >       |   ^~~~~~~~~~~~~~454       > gcc -Wall -Wmissing-prototypes -Wpointer-arith -Wdeclaration-after-statement -Werror=vla -Wendif-labels -Wmissing-format-attribute -Wimplicit-fallthrough=3 -Wcast-function-type -Wformat-security -fno-strict-aliasing -fwrapv -fexcess-precision=standard -Wno-deprecated-non-prototype -Wno-format-truncation -Wno-stringop-truncation -g -O2 -std=gnu17 -std=c11 -Werror -Wno-declaration-after-statement -fPIC  -DEXTVERSION=\"0.13.0\" -I. -I./ -I/nix/store/48l45fvi99n90x6p9i4cs1lmzby6cb73-postgresql-15.19/include/server -I/nix/store/48l45fvi99n90x6p9i4cs1lmzby6cb73-postgresql-15.19/include/internal -D_GNU_SOURCE  -I/nix/store/p17klc3qq4nl9ihfwqfpi8cnqvcf92xz-libxml2-2.15.1-dev/include/libxml2 -I/nix/store/mglbi4dy4kpx7v1dcgf6iincp5x38hsc-lz4-1.10.0-dev/include -I/nix/store/g41q9md9rdcr3lkydi6f8zd6fza3h1q4-zstd-1.5.7-dev/include -I/nix/store/n2vnr7ycfk6midbzxcwd28qj3bgb50cz-icu4c-75.1-dev/include  -c -o src/event.o src/event.c455       > In file included from /nix/store/jviasb44hibgh09829gbmbssbz2jjnhz-curl-8.17.0-dev/include/curl/curl.h:3333,456       >                  from /nix/store/jviasb44hibgh09829gbmbssbz2jjnhz-curl-8.17.0-dev/include/curl/multi.h:51,457       >                  from src/event.h:4,458       >                  from src/event.c:6:459       > /nix/store/jviasb44hibgh09829gbmbssbz2jjnhz-curl-8.17.0-dev/include/curl/multi.h:429:23: error: expected identifier or '(' before '__extension__'460       >   429 | CURL_EXTERN CURLMcode curl_multi_setopt(CURLM *multi_handle,461       >       |                       ^~~~~~~~~~~~~~~~~462       > /nix/store/jviasb44hibgh09829gbmbssbz2jjnhz-curl-8.17.0-dev/include/curl/multi.h:429:23: error: expected identifier or '(' before ')' token463       >   429 | CURL_EXTERN CURLMcode curl_multi_setopt(CURLM *multi_handle,464       >       |                       ^~~~~~~~~~~~~~~~~465       > make: *** [<builtin>: src/event.o] Error 1466       For full logs, run:467         nix log /nix/store/0n0iaya9csx9by2pimrx1yglzw8dp4zs-pg_net-0.13.0.drv468error: Cannot build '/nix/store/0n0iaya9csx9by2pimrx1yglzw8dp4zs-pg_net-0.13.0.drv'.469       Reason: builder failed with exit code 1.470       Output paths:471         /nix/store/14dkr1mhbrh869r2k75r03ngw6q7c4ma-pg_net-0.13.0472building '/nix/store/9m4hgq2s9z1cy1508wymdcl2n1w3ky5h-wrappers-0.6.2.drv' on 'ssh-ng://nixbot-remote-build@78.232.36.247'473building '/nix/store/9m4hgq2s9z1cy1508wymdcl2n1w3ky5h-wrappers-0.6.2.drv'474wrappers-0.6.2> Running phase: unpackPhase475wrappers-0.6.2> unpacking source archive /nix/store/klhy76bxklbls3fv5xb90gb7cx84n80r-source476wrappers-0.6.2> source root is source477wrappers-0.6.2> Executing cargoSetupPostUnpackHook478wrappers-0.6.2> Finished cargoSetupPostUnpackHook479wrappers-0.6.2> Running phase: patchPhase480wrappers-0.6.2> Executing cargoSetupPostPatchHook481wrappers-0.6.2> Validating consistency between /build/source/Cargo.lock and /build/cargo-vendor-dir/Cargo.lock482wrappers-0.6.2> Finished cargoSetupPostPatchHook483wrappers-0.6.2> Running phase: updateAutotoolsGnuConfigScriptsPhase484wrappers-0.6.2> Running phase: configurePhase485wrappers-0.6.2> {"success":"true"}486wrappers-0.6.2> Running phase: buildPhase487wrappers-0.6.2> Executing cargo-pgrx buildPhase488wrappers-0.6.2>    Validating /nix/store/48l45fvi99n90x6p9i4cs1lmzby6cb73-postgresql-15.19/bin/pg_config489wrappers-0.6.2>  Initializing data directory at /build/tmp.6XZI8Wv7cF/data-15490wrappers-0.6.2> waiting for server to start....2026-10-06 14:24:02.138 GMT [74] LOG:  starting PostgreSQL 15.19 on aarch64-unknown-linux-gnu, compiled by gcc (GCC) 15.2.0, 64-bit491wrappers-0.6.2> 2026-10-06 14:24:02.140 GMT [74] LOG:  listening on Unix socket "/build/tmp.23U8mYm9My/.s.PGSQL.5432"492wrappers-0.6.2> 2026-10-06 14:24:02.148 GMT [77] LOG:  database system was shut down at 2026-10-06 14:24:01 GMT493wrappers-0.6.2> 2026-10-06 14:24:02.154 GMT [74] LOG:  database system is ready to accept connections494wrappers-0.6.2>  done495wrappers-0.6.2> server started496wrappers-0.6.2> createuser: error: connection to server at "localhost" (127.0.0.1), port 5432 failed: Connection refused497wrappers-0.6.2> 	Is the server running on that host and accepting TCP/IP connections?498wrappers-0.6.2> waiting for server to shut down....2026-10-06 14:24:02.215 GMT [74] LOG:  received fast shutdown request499wrappers-0.6.2> 2026-10-06 14:24:02.218 GMT [74] LOG:  aborting any active transactions500wrappers-0.6.2> 2026-10-06 14:24:02.220 GMT [74] LOG:  background worker "logical replication launcher" (PID 80) exited with exit code 1501wrappers-0.6.2> 2026-10-06 14:24:02.222 GMT [75] LOG:  shutting down502wrappers-0.6.2> 2026-10-06 14:24:02.225 GMT [75] LOG:  checkpoint starting: shutdown immediate503wrappers-0.6.2> 2026-10-06 14:24:02.248 GMT [75] LOG:  checkpoint complete: wrote 3 buffers (0.0%); 0 WAL file(s) added, 0 removed, 0 recycled; write=0.008 s, sync=0.002 s, total=0.026 s; sync files=2, longest=0.002 s, average=0.001 s; distance=0 kB, estimate=0 kB504wrappers-0.6.2> 2026-10-06 14:24:02.253 GMT [74] LOG:  database system is shut down505wrappers-0.6.2>  done506wrappers-0.6.2> server stopped507wrappers-0.6.2> /build/source/wrappers /build/source508wrappers-0.6.2>        Using PgConfig("pg15") and `pg_config` from /nix/store/48l45fvi99n90x6p9i4cs1lmzby6cb73-postgresql-15.19/bin/pg_config509wrappers-0.6.2>     Building extension with features helloworld_fdw all_fdws pg15510wrappers-0.6.2>      Running command "/nix/store/8aa27y4zp6s8cv6f6chng7cv416ngp5c-cargo-1.88.0-aarch64-unknown-linux-gnu/bin/cargo" "build" "--lib" "--release" "--features" "helloworld_fdw all_fdws pg15" "--no-default-features" "--message-format=json-render-diagnostics" "--frozen" "-j" "2"511wrappers-0.6.2>    Compiling proc-macro2 v1.0.103512wrappers-0.6.2>    Compiling quote v1.0.41513wrappers-0.6.2>    Compiling unicode-ident v1.0.20514wrappers-0.6.2>    Compiling libc v0.2.177515wrappers-0.6.2>    Compiling syn v2.0.108516wrappers-0.6.2>    Compiling serde_core v1.0.228517wrappers-0.6.2>    Compiling cfg-if v1.0.4518wrappers-0.6.2>    Compiling serde v1.0.228519wrappers-0.6.2>    Compiling autocfg v1.5.0520wrappers-0.6.2>    Compiling serde_derive v1.0.228521wrappers-0.6.2>    Compiling version_check v0.9.5522wrappers-0.6.2>    Compiling bytes v1.11.1523wrappers-0.6.2>    Compiling memchr v2.7.6524wrappers-0.6.2>    Compiling libm v0.2.15525wrappers-0.6.2>    Compiling portable-atomic v1.11.1526wrappers-0.6.2>    Compiling shlex v1.3.0527wrappers-0.6.2>    Compiling jobserver v0.1.34528wrappers-0.6.2>    Compiling equivalent v1.0.2529wrappers-0.6.2>    Compiling find-msvc-tools v0.1.4530wrappers-0.6.2>    Compiling cc v1.2.43531wrappers-0.6.2>    Compiling critical-section v1.2.0532wrappers-0.6.2>    Compiling zeroize v1.8.2533wrappers-0.6.2>    Compiling once_cell v1.21.3534wrappers-0.6.2>    Compiling num-traits v0.2.19535wrappers-0.6.2>    Compiling pin-project-lite v0.2.16536wrappers-0.6.2>    Compiling smallvec v1.15.1537wrappers-0.6.2>    Compiling futures-core v0.3.31538wrappers-0.6.2>    Compiling allocator-api2 v0.2.21539wrappers-0.6.2>    Compiling hashbrown v0.16.0540wrappers-0.6.2>    Compiling foldhash v0.1.5541wrappers-0.6.2>    Compiling hashbrown v0.15.5542wrappers-0.6.2>    Compiling log v0.4.28543wrappers-0.6.2>    Compiling getrandom v0.2.16544wrappers-0.6.2>    Compiling typenum v1.19.0545wrappers-0.6.2>    Compiling subtle v2.6.1546wrappers-0.6.2>    Compiling itoa v1.0.15547wrappers-0.6.2>    Compiling futures-io v0.3.31548wrappers-0.6.2>    Compiling indexmap v2.12.0549wrappers-0.6.2>    Compiling parking_lot_core v0.9.12550wrappers-0.6.2>    Compiling scopeguard v1.2.0551wrappers-0.6.2>    Compiling lock_api v0.4.14552wrappers-0.6.2>    Compiling generic-array v0.14.9553wrappers-0.6.2>    Compiling parking_lot v0.12.5554wrappers-0.6.2>    Compiling slab v0.4.11555wrappers-0.6.2>    Compiling tokio-macros v2.6.0556wrappers-0.6.2>    Compiling signal-hook-registry v1.4.6557wrappers-0.6.2>    Compiling mio v1.1.0558wrappers-0.6.2>    Compiling socket2 v0.6.1559wrappers-0.6.2>    Compiling pin-utils v0.1.0560wrappers-0.6.2>    Compiling futures-sink v0.3.31561wrappers-0.6.2>    Compiling futures-channel v0.3.31562wrappers-0.6.2>    Compiling tokio v1.48.0563wrappers-0.6.2>    Compiling futures-macro v0.3.31564wrappers-0.6.2>    Compiling futures-task v0.3.31565wrappers-0.6.2>    Compiling futures-util v0.3.31566wrappers-0.6.2>    Compiling anyhow v1.0.100567wrappers-0.6.2>    Compiling const-oid v0.9.6568wrappers-0.6.2>    Compiling num-integer v0.1.46569wrappers-0.6.2>    Compiling ryu v1.0.20570wrappers-0.6.2>    Compiling synstructure v0.13.2571wrappers-0.6.2>    Compiling zerocopy v0.8.27572wrappers-0.6.2>    Compiling zerofrom-derive v0.1.6573wrappers-0.6.2>    Compiling crypto-common v0.1.6574wrappers-0.6.2>    Compiling zerocopy-derive v0.8.27575wrappers-0.6.2>    Compiling yoke-derive v0.8.1576wrappers-0.6.2>    Compiling block-buffer v0.10.4577wrappers-0.6.2>    Compiling rand_core v0.6.4578wrappers-0.6.2>    Compiling bitflags v2.10.0579wrappers-0.6.2>    Compiling digest v0.10.7580wrappers-0.6.2>    Compiling getrandom v0.3.4581wrappers-0.6.2>    Compiling zerovec-derive v0.11.2582wrappers-0.6.2>    Compiling fnv v1.0.7583wrappers-0.6.2>    Compiling tracing-core v0.1.34584wrappers-0.6.2>    Compiling tracing-attributes v0.1.30585wrappers-0.6.2>    Compiling displaydoc v0.2.5586wrappers-0.6.2>    Compiling tokio-util v0.7.16587wrappers-0.6.2>    Compiling tracing v0.1.41588wrappers-0.6.2>    Compiling percent-encoding v2.3.2589wrappers-0.6.2>    Compiling pkg-config v0.3.32590wrappers-0.6.2>    Compiling regex-syntax v0.8.8591wrappers-0.6.2>    Compiling icu_properties_data v2.1.1592wrappers-0.6.2>    Compiling icu_normalizer_data v2.1.1593wrappers-0.6.2>    Compiling heck v0.5.0594wrappers-0.6.2>    Compiling crc32fast v1.5.0595wrappers-0.6.2>    Compiling http v1.3.1596wrappers-0.6.2>    Compiling either v1.15.0597wrappers-0.6.2>    Compiling base64 v0.22.1598wrappers-0.6.2>    Compiling http-body v1.0.1599wrappers-0.6.2>    Compiling cpufeatures v0.2.17600wrappers-0.6.2>    Compiling aho-corasick v1.1.4601wrappers-0.6.2>    Compiling ring v0.17.14602wrappers-0.6.2>    Compiling base64ct v1.8.0603wrappers-0.6.2>    Compiling iana-time-zone v0.1.64604wrappers-0.6.2>    Compiling chrono v0.4.42605wrappers-0.6.2>    Compiling regex-automata v0.4.13606wrappers-0.6.2>    Compiling zerofrom v0.1.6607wrappers-0.6.2>    Compiling openssl-probe v0.1.6608wrappers-0.6.2>    Compiling stable_deref_trait v1.2.1609wrappers-0.6.2>    Compiling yoke v0.8.1610wrappers-0.6.2>    Compiling regex v1.12.2611wrappers-0.6.2>    Compiling hmac v0.12.1612wrappers-0.6.2>    Compiling sha2 v0.10.9613wrappers-0.6.2>    Compiling form_urlencoded v1.2.2614wrappers-0.6.2>    Compiling num-bigint v0.4.6615building '/nix/store/g6nfp5n056kw2jvfzldzxrrrxfpfcka0-pg_net-0.13.0.drv' on 'ssh-ng://nixbot-remote-build@78.232.36.247'616building '/nix/store/g6nfp5n056kw2jvfzldzxrrrxfpfcka0-pg_net-0.13.0.drv'617pg_net-0.13.0> Running phase: unpackPhase618pg_net-0.13.0> unpacking source archive /nix/store/bxdzbzjn4yi7ch55dlcgzk6npzx2p4jz-source619pg_net-0.13.0> source root is source620pg_net-0.13.0> Running phase: patchPhase621pg_net-0.13.0> Running phase: updateAutotoolsGnuConfigScriptsPhase622pg_net-0.13.0> Running phase: configurePhase623pg_net-0.13.0> no configure script, doing nothing624pg_net-0.13.0> Running phase: buildPhase625pg_net-0.13.0> gcc -Wall -Wmissing-prototypes -Wpointer-arith -Wdeclaration-after-statement -Werror=vla -Wendif-labels -Wmissing-format-attribute -Wimplicit-fallthrough=3 -Wcast-function-type -Wshadow=compatible-local -Wformat-security -fno-strict-aliasing -fwrapv -fexcess-precision=standard -Wno-format-truncation -Wno-stringop-truncation -g -O2 -std=c11 -Werror -Wno-declaration-after-statement -fPIC -fvisibility=hidden  -DEXTVERSION=\"0.13.0\" -I. -I./ -I/nix/store/9q4p23a2y63xn8safzzn6lbn07bnkshs-postgresql-17.11/include/server -I/nix/store/9q4p23a2y63xn8safzzn6lbn07bnkshs-postgresql-17.11/include/internal -D_GNU_SOURCE  -I/nix/store/p17klc3qq4nl9ihfwqfpi8cnqvcf92xz-libxml2-2.15.1-dev/include/libxml2 -I/nix/store/mglbi4dy4kpx7v1dcgf6iincp5x38hsc-lz4-1.10.0-dev/include -I/nix/store/g41q9md9rdcr3lkydi6f8zd6fza3h1q4-zstd-1.5.7-dev/include -I/nix/store/n2vnr7ycfk6midbzxcwd28qj3bgb50cz-icu4c-75.1-dev/include  -c -o src/worker.o src/worker.c626wrappers-0.6.2>    Compiling httparse v1.10.1627pg_net-0.13.0> gcc -Wall -Wmissing-prototypes -Wpointer-arith -Wdeclaration-after-statement -Werror=vla -Wendif-labels -Wmissing-format-attribute -Wimplicit-fallthrough=3 -Wcast-function-type -Wshadow=compatible-local -Wformat-security -fno-strict-aliasing -fwrapv -fexcess-precision=standard -Wno-format-truncation -Wno-stringop-truncation -g -O2 -std=c11 -Werror -Wno-declaration-after-statement -fPIC -fvisibility=hidden  -DEXTVERSION=\"0.13.0\" -I. -I./ -I/nix/store/9q4p23a2y63xn8safzzn6lbn07bnkshs-postgresql-17.11/include/server -I/nix/store/9q4p23a2y63xn8safzzn6lbn07bnkshs-postgresql-17.11/include/internal -D_GNU_SOURCE  -I/nix/store/p17klc3qq4nl9ihfwqfpi8cnqvcf92xz-libxml2-2.15.1-dev/include/libxml2 -I/nix/store/mglbi4dy4kpx7v1dcgf6iincp5x38hsc-lz4-1.10.0-dev/include -I/nix/store/g41q9md9rdcr3lkydi6f8zd6fza3h1q4-zstd-1.5.7-dev/include -I/nix/store/n2vnr7ycfk6midbzxcwd28qj3bgb50cz-icu4c-75.1-dev/include  -c -o src/util.o src/util.c628pg_net-0.13.0> gcc -Wall -Wmissing-prototypes -Wpointer-arith -Wdeclaration-after-statement -Werror=vla -Wendif-labels -Wmissing-format-attribute -Wimplicit-fallthrough=3 -Wcast-function-type -Wshadow=compatible-local -Wformat-security -fno-strict-aliasing -fwrapv -fexcess-precision=standard -Wno-format-truncation -Wno-stringop-truncation -g -O2 -std=c11 -Werror -Wno-declaration-after-statement -fPIC -fvisibility=hidden  -DEXTVERSION=\"0.13.0\" -I. -I./ -I/nix/store/9q4p23a2y63xn8safzzn6lbn07bnkshs-postgresql-17.11/include/server -I/nix/store/9q4p23a2y63xn8safzzn6lbn07bnkshs-postgresql-17.11/include/internal -D_GNU_SOURCE  -I/nix/store/p17klc3qq4nl9ihfwqfpi8cnqvcf92xz-libxml2-2.15.1-dev/include/libxml2 -I/nix/store/mglbi4dy4kpx7v1dcgf6iincp5x38hsc-lz4-1.10.0-dev/include -I/nix/store/g41q9md9rdcr3lkydi6f8zd6fza3h1q4-zstd-1.5.7-dev/include -I/nix/store/n2vnr7ycfk6midbzxcwd28qj3bgb50cz-icu4c-75.1-dev/include  -c -o src/core.o src/core.c629wrappers-0.6.2>    Compiling tower-service v0.3.3630wrappers-0.6.2>    Compiling untrusted v0.9.0631wrappers-0.6.2>    Compiling zerovec v0.11.5632pg_net-0.13.0> In file included from src/core.c:23:633pg_net-0.13.0> In function 'init_curl_handle',634pg_net-0.13.0>     inlined from 'consume_request_queue' at src/core.c:273:5:635pg_net-0.13.0> src/util.h:6:11: warning: call to 'Wcurl_easy_setopt_err_long' declared with attribute warning: curl_easy_setopt expects a long argument [-Wattribute-warning]636pg_net-0.13.0>     6 |       if (curl_easy_setopt(hdl, opt, prm) != CURLE_OK) \637pg_net-0.13.0>       |           ^~~~~~~~~~~~~~~~638pg_net-0.13.0> src/core.c:94:7: note: in expansion of macro 'CURL_EZ_SETOPT'639pg_net-0.13.0>    94 |       CURL_EZ_SETOPT(curl_ez_handle, CURLOPT_POST, 1);640pg_net-0.13.0>       |       ^~~~~~~~~~~~~~641pg_net-0.13.0> src/util.h:6:11: warning: call to 'Wcurl_easy_setopt_err_long' declared with attribute warning: curl_easy_setopt expects a long argument [-Wattribute-warning]642pg_net-0.13.0>     6 |       if (curl_easy_setopt(hdl, opt, prm) != CURLE_OK) \643pg_net-0.13.0>       |           ^~~~~~~~~~~~~~~~644pg_net-0.13.0> src/core.c:95:7: note: in expansion of macro 'CURL_EZ_SETOPT'645pg_net-0.13.0>    95 |       CURL_EZ_SETOPT(curl_ez_handle, CURLOPT_POSTFIELDSIZE, 0);646pg_net-0.13.0>       |       ^~~~~~~~~~~~~~647pg_net-0.13.0> src/util.h:6:11: warning: call to 'Wcurl_easy_setopt_err_long' declared with attribute warning: curl_easy_setopt expects a long argument [-Wattribute-warning]648pg_net-0.13.0>     6 |       if (curl_easy_setopt(hdl, opt, prm) != CURLE_OK) \649pg_net-0.13.0>       |           ^~~~~~~~~~~~~~~~650pg_net-0.13.0> src/core.c:108:3: note: in expansion of macro 'CURL_EZ_SETOPT'651pg_net-0.13.0>   108 |   CURL_EZ_SETOPT(curl_ez_handle, CURLOPT_TIMEOUT_MS, timeout_milliseconds);652pg_net-0.13.0>       |   ^~~~~~~~~~~~~~653pg_net-0.13.0> src/util.h:6:11: warning: call to 'Wcurl_easy_setopt_err_long' declared with attribute warning: curl_easy_setopt expects a long argument [-Wattribute-warning]654pg_net-0.13.0>     6 |       if (curl_easy_setopt(hdl, opt, prm) != CURLE_OK) \655pg_net-0.13.0>       |           ^~~~~~~~~~~~~~~~656pg_net-0.13.0> src/core.c:110:3: note: in expansion of macro 'CURL_EZ_SETOPT'657pg_net-0.13.0>   110 |   CURL_EZ_SETOPT(curl_ez_handle, CURLOPT_FOLLOWLOCATION, true);658pg_net-0.13.0>       |   ^~~~~~~~~~~~~~659pg_net-0.13.0> gcc -Wall -Wmissing-prototypes -Wpointer-arith -Wdeclaration-after-statement -Werror=vla -Wendif-labels -Wmissing-format-attribute -Wimplicit-fallthrough=3 -Wcast-function-type -Wshadow=compatible-local -Wformat-security -fno-strict-aliasing -fwrapv -fexcess-precision=standard -Wno-format-truncation -Wno-stringop-truncation -g -O2 -std=c11 -Werror -Wno-declaration-after-statement -fPIC -fvisibility=hidden  -DEXTVERSION=\"0.13.0\" -I. -I./ -I/nix/store/9q4p23a2y63xn8safzzn6lbn07bnkshs-postgresql-17.11/include/server -I/nix/store/9q4p23a2y63xn8safzzn6lbn07bnkshs-postgresql-17.11/include/internal -D_GNU_SOURCE  -I/nix/store/p17klc3qq4nl9ihfwqfpi8cnqvcf92xz-libxml2-2.15.1-dev/include/libxml2 -I/nix/store/mglbi4dy4kpx7v1dcgf6iincp5x38hsc-lz4-1.10.0-dev/include -I/nix/store/g41q9md9rdcr3lkydi6f8zd6fza3h1q4-zstd-1.5.7-dev/include -I/nix/store/n2vnr7ycfk6midbzxcwd28qj3bgb50cz-icu4c-75.1-dev/include  -c -o src/event.o src/event.c660pg_net-0.13.0> In file included from /nix/store/jviasb44hibgh09829gbmbssbz2jjnhz-curl-8.17.0-dev/include/curl/curl.h:3333,661pg_net-0.13.0>                  from /nix/store/jviasb44hibgh09829gbmbssbz2jjnhz-curl-8.17.0-dev/include/curl/multi.h:51,662pg_net-0.13.0>                  from src/event.h:4,663pg_net-0.13.0>                  from src/event.c:6:664pg_net-0.13.0> /nix/store/jviasb44hibgh09829gbmbssbz2jjnhz-curl-8.17.0-dev/include/curl/multi.h:429:23: error: expected identifier or '(' before '__extension__'665pg_net-0.13.0>   429 | CURL_EXTERN CURLMcode curl_multi_setopt(CURLM *multi_handle,666pg_net-0.13.0>       |                       ^~~~~~~~~~~~~~~~~667pg_net-0.13.0> /nix/store/jviasb44hibgh09829gbmbssbz2jjnhz-curl-8.17.0-dev/include/curl/multi.h:429:23: error: expected identifier or '(' before ')' token668pg_net-0.13.0>   429 | CURL_EXTERN CURLMcode curl_multi_setopt(CURLM *multi_handle,669pg_net-0.13.0>       |                       ^~~~~~~~~~~~~~~~~670pg_net-0.13.0> make: *** [<builtin>: src/event.o] Error 1671error: build of '/nix/store/g6nfp5n056kw2jvfzldzxrrrxfpfcka0-pg_net-0.13.0.drv' on 'ssh-ng://nixbot-remote-build@78.232.36.247' failed: Cannot build '/nix/store/g6nfp5n056kw2jvfzldzxrrrxfpfcka0-pg_net-0.13.0.drv'.672       Reason: builder failed with exit code 2.673       Output paths:674         /nix/store/0z6qc5i8vhckm5s9j7br24f5kfxsgds5-pg_net-0.13.0675       Last 25 log lines:676       >       |       ^~~~~~~~~~~~~~677       > src/util.h:6:11: warning: call to 'Wcurl_easy_setopt_err_long' declared with attribute warning: curl_easy_setopt expects a long argument [-Wattribute-warning]678       >     6 |       if (curl_easy_setopt(hdl, opt, prm) != CURLE_OK) \679       >       |           ^~~~~~~~~~~~~~~~680       > src/core.c:108:3: note: in expansion of macro 'CURL_EZ_SETOPT'681       >   108 |   CURL_EZ_SETOPT(curl_ez_handle, CURLOPT_TIMEOUT_MS, timeout_milliseconds);682       >       |   ^~~~~~~~~~~~~~683       > src/util.h:6:11: warning: call to 'Wcurl_easy_setopt_err_long' declared with attribute warning: curl_easy_setopt expects a long argument [-Wattribute-warning]684       >     6 |       if (curl_easy_setopt(hdl, opt, prm) != CURLE_OK) \685       >       |           ^~~~~~~~~~~~~~~~686       > src/core.c:110:3: note: in expansion of macro 'CURL_EZ_SETOPT'687       >   110 |   CURL_EZ_SETOPT(curl_ez_handle, CURLOPT_FOLLOWLOCATION, true);688       >       |   ^~~~~~~~~~~~~~689       > gcc -Wall -Wmissing-prototypes -Wpointer-arith -Wdeclaration-after-statement -Werror=vla -Wendif-labels -Wmissing-format-attribute -Wimplicit-fallthrough=3 -Wcast-function-type -Wshadow=compatible-local -Wformat-security -fno-strict-aliasing -fwrapv -fexcess-precision=standard -Wno-format-truncation -Wno-stringop-truncation -g -O2 -std=c11 -Werror -Wno-declaration-after-statement -fPIC -fvisibility=hidden  -DEXTVERSION=\"0.13.0\" -I. -I./ -I/nix/store/9q4p23a2y63xn8safzzn6lbn07bnkshs-postgresql-17.11/include/server -I/nix/store/9q4p23a2y63xn8safzzn6lbn07bnkshs-postgresql-17.11/include/internal -D_GNU_SOURCE  -I/nix/store/p17klc3qq4nl9ihfwqfpi8cnqvcf92xz-libxml2-2.15.1-dev/include/libxml2 -I/nix/store/mglbi4dy4kpx7v1dcgf6iincp5x38hsc-lz4-1.10.0-dev/include -I/nix/store/g41q9md9rdcr3lkydi6f8zd6fza3h1q4-zstd-1.5.7-dev/include -I/nix/store/n2vnr7ycfk6midbzxcwd28qj3bgb50cz-icu4c-75.1-dev/include  -c -o src/event.o src/event.c690       > In file included from /nix/store/jviasb44hibgh09829gbmbssbz2jjnhz-curl-8.17.0-dev/include/curl/curl.h:3333,691       >                  from /nix/store/jviasb44hibgh09829gbmbssbz2jjnhz-curl-8.17.0-dev/include/curl/multi.h:51,692       >                  from src/event.h:4,693       >                  from src/event.c:6:694       > /nix/store/jviasb44hibgh09829gbmbssbz2jjnhz-curl-8.17.0-dev/include/curl/multi.h:429:23: error: expected identifier or '(' before '__extension__'695       >   429 | CURL_EXTERN CURLMcode curl_multi_setopt(CURLM *multi_handle,696       >       |                       ^~~~~~~~~~~~~~~~~697       > /nix/store/jviasb44hibgh09829gbmbssbz2jjnhz-curl-8.17.0-dev/include/curl/multi.h:429:23: error: expected identifier or '(' before ')' token698       >   429 | CURL_EXTERN CURLMcode curl_multi_setopt(CURLM *multi_handle,699       >       |                       ^~~~~~~~~~~~~~~~~700       > make: *** [<builtin>: src/event.o] Error 1701       For full logs, run:702         nix log /nix/store/g6nfp5n056kw2jvfzldzxrrrxfpfcka0-pg_net-0.13.0.drv703error: Cannot build '/nix/store/g6nfp5n056kw2jvfzldzxrrrxfpfcka0-pg_net-0.13.0.drv'.704       Reason: builder failed with exit code 1.705       Output paths:706         /nix/store/0z6qc5i8vhckm5s9j7br24f5kfxsgds5-pg_net-0.13.0707wrappers-0.6.2>    Compiling cmake v0.1.54708wrappers-0.6.2>    Compiling try-lock v0.2.5709wrappers-0.6.2>    Compiling dunce v1.0.5710wrappers-0.6.2>    Compiling semver v1.0.27711wrappers-0.6.2>    Compiling fs_extra v1.3.0712wrappers-0.6.2>    Compiling aws-lc-sys v0.39.0713wrappers-0.6.2>    Compiling want v0.3.1714wrappers-0.6.2>    Compiling http-body-util v0.1.3715building '/nix/store/lbqp8bfrqa2xm82ma6wyq1gijyajh6kh-pg_net-0.13.0.drv' on 'ssh-ng://nixbot-remote-build@78.232.36.247'716wrappers-0.6.2>    Compiling http v0.2.12717building '/nix/store/lbqp8bfrqa2xm82ma6wyq1gijyajh6kh-pg_net-0.13.0.drv'718pg_net-0.13.0> Running phase: unpackPhase719pg_net-0.13.0> unpacking source archive /nix/store/bxdzbzjn4yi7ch55dlcgzk6npzx2p4jz-source720pg_net-0.13.0> source root is source721pg_net-0.13.0> Running phase: patchPhase722pg_net-0.13.0> Running phase: updateAutotoolsGnuConfigScriptsPhase723pg_net-0.13.0> Running phase: configurePhase724pg_net-0.13.0> no configure script, doing nothing725pg_net-0.13.0> Running phase: buildPhase726pg_net-0.13.0> gcc -Wall -Wmissing-prototypes -Wpointer-arith -Wdeclaration-after-statement -Werror=vla -Wendif-labels -Wmissing-format-attribute -Wimplicit-fallthrough=3 -Wcast-function-type -Wshadow=compatible-local -Wformat-security -fno-strict-aliasing -fwrapv -fexcess-precision=standard -Wno-format-truncation -Wno-stringop-truncation -moutline-atomics -g -O2 -std=c11 -Werror -Wno-declaration-after-statement -fPIC -fvisibility=hidden  -DEXTVERSION=\"0.13.0\" -I. -I./ -I/nix/store/wq2kfr0rkb0hdmf1iwi3mi8pxycakzmq-postgresql-17_22/include/server -I/nix/store/wq2kfr0rkb0hdmf1iwi3mi8pxycakzmq-postgresql-17_22/include/internal -D_GNU_SOURCE  -I/nix/store/p17klc3qq4nl9ihfwqfpi8cnqvcf92xz-libxml2-2.15.1-dev/include/libxml2 -I/nix/store/mglbi4dy4kpx7v1dcgf6iincp5x38hsc-lz4-1.10.0-dev/include -I/nix/store/g41q9md9rdcr3lkydi6f8zd6fza3h1q4-zstd-1.5.7-dev/include -I/nix/store/n2vnr7ycfk6midbzxcwd28qj3bgb50cz-icu4c-75.1-dev/include  -c -o src/worker.o src/worker.c727pg_net-0.13.0> gcc -Wall -Wmissing-prototypes -Wpointer-arith -Wdeclaration-after-statement -Werror=vla -Wendif-labels -Wmissing-format-attribute -Wimplicit-fallthrough=3 -Wcast-function-type -Wshadow=compatible-local -Wformat-security -fno-strict-aliasing -fwrapv -fexcess-precision=standard -Wno-format-truncation -Wno-stringop-truncation -moutline-atomics -g -O2 -std=c11 -Werror -Wno-declaration-after-statement -fPIC -fvisibility=hidden  -DEXTVERSION=\"0.13.0\" -I. -I./ -I/nix/store/wq2kfr0rkb0hdmf1iwi3mi8pxycakzmq-postgresql-17_22/include/server -I/nix/store/wq2kfr0rkb0hdmf1iwi3mi8pxycakzmq-postgresql-17_22/include/internal -D_GNU_SOURCE  -I/nix/store/p17klc3qq4nl9ihfwqfpi8cnqvcf92xz-libxml2-2.15.1-dev/include/libxml2 -I/nix/store/mglbi4dy4kpx7v1dcgf6iincp5x38hsc-lz4-1.10.0-dev/include -I/nix/store/g41q9md9rdcr3lkydi6f8zd6fza3h1q4-zstd-1.5.7-dev/include -I/nix/store/n2vnr7ycfk6midbzxcwd28qj3bgb50cz-icu4c-75.1-dev/include  -c -o src/util.o src/util.c728pg_net-0.13.0> gcc -Wall -Wmissing-prototypes -Wpointer-arith -Wdeclaration-after-statement -Werror=vla -Wendif-labels -Wmissing-format-attribute -Wimplicit-fallthrough=3 -Wcast-function-type -Wshadow=compatible-local -Wformat-security -fno-strict-aliasing -fwrapv -fexcess-precision=standard -Wno-format-truncation -Wno-stringop-truncation -moutline-atomics -g -O2 -std=c11 -Werror -Wno-declaration-after-statement -fPIC -fvisibility=hidden  -DEXTVERSION=\"0.13.0\" -I. -I./ -I/nix/store/wq2kfr0rkb0hdmf1iwi3mi8pxycakzmq-postgresql-17_22/include/server -I/nix/store/wq2kfr0rkb0hdmf1iwi3mi8pxycakzmq-postgresql-17_22/include/internal -D_GNU_SOURCE  -I/nix/store/p17klc3qq4nl9ihfwqfpi8cnqvcf92xz-libxml2-2.15.1-dev/include/libxml2 -I/nix/store/mglbi4dy4kpx7v1dcgf6iincp5x38hsc-lz4-1.10.0-dev/include -I/nix/store/g41q9md9rdcr3lkydi6f8zd6fza3h1q4-zstd-1.5.7-dev/include -I/nix/store/n2vnr7ycfk6midbzxcwd28qj3bgb50cz-icu4c-75.1-dev/include  -c -o src/core.o src/core.c729pg_net-0.13.0> In file included from src/core.c:23:730pg_net-0.13.0> In function 'init_curl_handle',731pg_net-0.13.0>     inlined from 'consume_request_queue' at src/core.c:273:5:732pg_net-0.13.0> src/util.h:6:11: warning: call to 'Wcurl_easy_setopt_err_long' declared with attribute warning: curl_easy_setopt expects a long argument [-Wattribute-warning]733pg_net-0.13.0>     6 |       if (curl_easy_setopt(hdl, opt, prm) != CURLE_OK) \734pg_net-0.13.0>       |           ^~~~~~~~~~~~~~~~735pg_net-0.13.0> src/core.c:94:7: note: in expansion of macro 'CURL_EZ_SETOPT'736pg_net-0.13.0>    94 |       CURL_EZ_SETOPT(curl_ez_handle, CURLOPT_POST, 1);737pg_net-0.13.0>       |       ^~~~~~~~~~~~~~738pg_net-0.13.0> src/util.h:6:11: warning: call to 'Wcurl_easy_setopt_err_long' declared with attribute warning: curl_easy_setopt expects a long argument [-Wattribute-warning]739pg_net-0.13.0>     6 |       if (curl_easy_setopt(hdl, opt, prm) != CURLE_OK) \740pg_net-0.13.0>       |           ^~~~~~~~~~~~~~~~741pg_net-0.13.0> src/core.c:95:7: note: in expansion of macro 'CURL_EZ_SETOPT'742pg_net-0.13.0>    95 |       CURL_EZ_SETOPT(curl_ez_handle, CURLOPT_POSTFIELDSIZE, 0);743pg_net-0.13.0>       |       ^~~~~~~~~~~~~~744pg_net-0.13.0> src/util.h:6:11: warning: call to 'Wcurl_easy_setopt_err_long' declared with attribute warning: curl_easy_setopt expects a long argument [-Wattribute-warning]745pg_net-0.13.0>     6 |       if (curl_easy_setopt(hdl, opt, prm) != CURLE_OK) \746pg_net-0.13.0>       |           ^~~~~~~~~~~~~~~~747pg_net-0.13.0> src/core.c:108:3: note: in expansion of macro 'CURL_EZ_SETOPT'748pg_net-0.13.0>   108 |   CURL_EZ_SETOPT(curl_ez_handle, CURLOPT_TIMEOUT_MS, timeout_milliseconds);749pg_net-0.13.0>       |   ^~~~~~~~~~~~~~750pg_net-0.13.0> src/util.h:6:11: warning: call to 'Wcurl_easy_setopt_err_long' declared with attribute warning: curl_easy_setopt expects a long argument [-Wattribute-warning]751pg_net-0.13.0>     6 |       if (curl_easy_setopt(hdl, opt, prm) != CURLE_OK) \752pg_net-0.13.0>       |           ^~~~~~~~~~~~~~~~753pg_net-0.13.0> src/core.c:110:3: note: in expansion of macro 'CURL_EZ_SETOPT'754pg_net-0.13.0>   110 |   CURL_EZ_SETOPT(curl_ez_handle, CURLOPT_FOLLOWLOCATION, true);755pg_net-0.13.0>       |   ^~~~~~~~~~~~~~756pg_net-0.13.0> gcc -Wall -Wmissing-prototypes -Wpointer-arith -Wdeclaration-after-statement -Werror=vla -Wendif-labels -Wmissing-format-attribute -Wimplicit-fallthrough=3 -Wcast-function-type -Wshadow=compatible-local -Wformat-security -fno-strict-aliasing -fwrapv -fexcess-precision=standard -Wno-format-truncation -Wno-stringop-truncation -moutline-atomics -g -O2 -std=c11 -Werror -Wno-declaration-after-statement -fPIC -fvisibility=hidden  -DEXTVERSION=\"0.13.0\" -I. -I./ -I/nix/store/wq2kfr0rkb0hdmf1iwi3mi8pxycakzmq-postgresql-17_22/include/server -I/nix/store/wq2kfr0rkb0hdmf1iwi3mi8pxycakzmq-postgresql-17_22/include/internal -D_GNU_SOURCE  -I/nix/store/p17klc3qq4nl9ihfwqfpi8cnqvcf92xz-libxml2-2.15.1-dev/include/libxml2 -I/nix/store/mglbi4dy4kpx7v1dcgf6iincp5x38hsc-lz4-1.10.0-dev/include -I/nix/store/g41q9md9rdcr3lkydi6f8zd6fza3h1q4-zstd-1.5.7-dev/include -I/nix/store/n2vnr7ycfk6midbzxcwd28qj3bgb50cz-icu4c-75.1-dev/include  -c -o src/event.o src/event.c757pg_net-0.13.0> In file included from /nix/store/jviasb44hibgh09829gbmbssbz2jjnhz-curl-8.17.0-dev/include/curl/curl.h:3333,758pg_net-0.13.0>                  from /nix/store/jviasb44hibgh09829gbmbssbz2jjnhz-curl-8.17.0-dev/include/curl/multi.h:51,759pg_net-0.13.0>                  from src/event.h:4,760pg_net-0.13.0>                  from src/event.c:6:761pg_net-0.13.0> /nix/store/jviasb44hibgh09829gbmbssbz2jjnhz-curl-8.17.0-dev/include/curl/multi.h:429:23: error: expected identifier or '(' before '__extension__'762pg_net-0.13.0>   429 | CURL_EXTERN CURLMcode curl_multi_setopt(CURLM *multi_handle,763pg_net-0.13.0>       |                       ^~~~~~~~~~~~~~~~~764pg_net-0.13.0> /nix/store/jviasb44hibgh09829gbmbssbz2jjnhz-curl-8.17.0-dev/include/curl/multi.h:429:23: error: expected identifier or '(' before ')' token765pg_net-0.13.0>   429 | CURL_EXTERN CURLMcode curl_multi_setopt(CURLM *multi_handle,766pg_net-0.13.0>       |                       ^~~~~~~~~~~~~~~~~767pg_net-0.13.0> make: *** [<builtin>: src/event.o] Error 1768error: build of '/nix/store/lbqp8bfrqa2xm82ma6wyq1gijyajh6kh-pg_net-0.13.0.drv' on 'ssh-ng://nixbot-remote-build@78.232.36.247' failed: Cannot build '/nix/store/lbqp8bfrqa2xm82ma6wyq1gijyajh6kh-pg_net-0.13.0.drv'.769       Reason: builder failed with exit code 2.770       Output paths:771         /nix/store/517wbr5c7xb4fvch9kn0zim5j3hnjzpa-pg_net-0.13.0772       Last 25 log lines:773       >       |       ^~~~~~~~~~~~~~774       > src/util.h:6:11: warning: call to 'Wcurl_easy_setopt_err_long' declared with attribute warning: curl_easy_setopt expects a long argument [-Wattribute-warning]775       >     6 |       if (curl_easy_setopt(hdl, opt, prm) != CURLE_OK) \776       >       |           ^~~~~~~~~~~~~~~~777       > src/core.c:108:3: note: in expansion of macro 'CURL_EZ_SETOPT'778       >   108 |   CURL_EZ_SETOPT(curl_ez_handle, CURLOPT_TIMEOUT_MS, timeout_milliseconds);779       >       |   ^~~~~~~~~~~~~~780       > src/util.h:6:11: warning: call to 'Wcurl_easy_setopt_err_long' declared with attribute warning: curl_easy_setopt expects a long argument [-Wattribute-warning]781       >     6 |       if (curl_easy_setopt(hdl, opt, prm) != CURLE_OK) \782       >       |           ^~~~~~~~~~~~~~~~783       > src/core.c:110:3: note: in expansion of macro 'CURL_EZ_SETOPT'784       >   110 |   CURL_EZ_SETOPT(curl_ez_handle, CURLOPT_FOLLOWLOCATION, true);785       >       |   ^~~~~~~~~~~~~~786       > gcc -Wall -Wmissing-prototypes -Wpointer-arith -Wdeclaration-after-statement -Werror=vla -Wendif-labels -Wmissing-format-attribute -Wimplicit-fallthrough=3 -Wcast-function-type -Wshadow=compatible-local -Wformat-security -fno-strict-aliasing -fwrapv -fexcess-precision=standard -Wno-format-truncation -Wno-stringop-truncation -moutline-atomics -g -O2 -std=c11 -Werror -Wno-declaration-after-statement -fPIC -fvisibility=hidden  -DEXTVERSION=\"0.13.0\" -I. -I./ -I/nix/store/wq2kfr0rkb0hdmf1iwi3mi8pxycakzmq-postgresql-17_22/include/server -I/nix/store/wq2kfr0rkb0hdmf1iwi3mi8pxycakzmq-postgresql-17_22/include/internal -D_GNU_SOURCE  -I/nix/store/p17klc3qq4nl9ihfwqfpi8cnqvcf92xz-libxml2-2.15.1-dev/include/libxml2 -I/nix/store/mglbi4dy4kpx7v1dcgf6iincp5x38hsc-lz4-1.10.0-dev/include -I/nix/store/g41q9md9rdcr3lkydi6f8zd6fza3h1q4-zstd-1.5.7-dev/include -I/nix/store/n2vnr7ycfk6midbzxcwd28qj3bgb50cz-icu4c-75.1-dev/include  -c -o src/event.o src/event.c787       > In file included from /nix/store/jviasb44hibgh09829gbmbssbz2jjnhz-curl-8.17.0-dev/include/curl/curl.h:3333,788       >                  from /nix/store/jviasb44hibgh09829gbmbssbz2jjnhz-curl-8.17.0-dev/include/curl/multi.h:51,789       >                  from src/event.h:4,790       >                  from src/event.c:6:791       > /nix/store/jviasb44hibgh09829gbmbssbz2jjnhz-curl-8.17.0-dev/include/curl/multi.h:429:23: error: expected identifier or '(' before '__extension__'792       >   429 | CURL_EXTERN CURLMcode curl_multi_setopt(CURLM *multi_handle,793       >       |                       ^~~~~~~~~~~~~~~~~794       > /nix/store/jviasb44hibgh09829gbmbssbz2jjnhz-curl-8.17.0-dev/include/curl/multi.h:429:23: error: expected identifier or '(' before ')' token795       >   429 | CURL_EXTERN CURLMcode curl_multi_setopt(CURLM *multi_handle,796       >       |                       ^~~~~~~~~~~~~~~~~797       > make: *** [<builtin>: src/event.o] Error 1798       For full logs, run:799         nix log /nix/store/lbqp8bfrqa2xm82ma6wyq1gijyajh6kh-pg_net-0.13.0.drv800error: Cannot build '/nix/store/lbqp8bfrqa2xm82ma6wyq1gijyajh6kh-pg_net-0.13.0.drv'.801       Reason: builder failed with exit code 1.802       Output paths:803         /nix/store/517wbr5c7xb4fvch9kn0zim5j3hnjzpa-pg_net-0.13.0804wrappers-0.6.2>    Compiling rustls-pki-types v1.13.0805wrappers-0.6.2>    Compiling ipnet v2.11.0806wrappers-0.6.2>    Compiling httpdate v1.0.3807wrappers-0.6.2>    Compiling atomic-waker v1.1.2808wrappers-0.6.2>    Compiling ppv-lite86 v0.2.21809wrappers-0.6.2>    Compiling tinystr v0.8.2810wrappers-0.6.2>    Compiling aws-lc-rs v1.16.2811wrappers-0.6.2>    Compiling litemap v0.8.1812wrappers-0.6.2>    Compiling writeable v0.6.2813wrappers-0.6.2>    Compiling icu_locale_core v2.1.1814wrappers-0.6.2>    Compiling http-body v0.4.6815wrappers-0.6.2>    Compiling potential_utf v0.1.4816wrappers-0.6.2>    Compiling zerotrie v0.2.3817wrappers-0.6.2>    Compiling crossbeam-utils v0.8.21818wrappers-0.6.2>    Compiling thiserror v2.0.17819wrappers-0.6.2>    Compiling icu_provider v2.1.1820wrappers-0.6.2>    Compiling icu_collections v2.1.1821wrappers-0.6.2>    Compiling time-core v0.1.8822wrappers-0.6.2>    Compiling powerfmt v0.2.0823wrappers-0.6.2>    Compiling num-conv v0.2.0824wrappers-0.6.2>    Compiling time-macros v0.2.27825wrappers-0.6.2>    Compiling deranged v0.5.5