nixbot

builds

cancelled checks.aarch64-linux.docker-image-test build #132 · raw · eval 34.2 s · 1.4 GiB allocated · ·

1these 298 derivations will be built:2  /nix/store/09yw6by1xkgwvadzkn03bvaxw955v632-pg_partman.drv3  /nix/store/0cmixqwsz3vb82j49j1mhvyk8crg4dcw-wrappers-0.6.0.drv4  /nix/store/f4fxzxll7q3m5cy6rib758j63zcky8dk-supabase_vault-0.2.8.drv5  /nix/store/zyzrb73x0fw62dyxqdz0znqnzvgqa7g6-supabase_vault-0.3.1.drv6  /nix/store/0dxji73cc07dbqk8nny6y5mkf5qr6kl8-supabase_vault.drv7  /nix/store/fl27cr5qdrq44nk61x5yjlqxsrc8mg3n-pgsodium-3.0.4.drv8  /nix/store/jl20dg8fxlmlv84f7cda9xa6mq8y46sr-pgsodium-3.1.7.drv9  /nix/store/l6md1p6ahq43yili977j4021ky05la94-pgsodium-3.1.8.drv10  /nix/store/pvz0jf5drhdz4jj5k592kxbdgk4lm52r-pgsodium-3.1.6.drv11  /nix/store/zdz6b4s43i332x3xlvjivc7p4csihzba-pgsodium-3.1.5.drv12  /nix/store/0h7mnh8was4m19z53z0dmakrp0c9271q-pgsodium.drv13  /nix/store/0i6b8yy32fc4mgfm75w94gw9ja033kw5-wrappers-0.5.5.drv14  /nix/store/0n0iaya9csx9by2pimrx1yglzw8dp4zs-pg_net-0.13.0.drv15  /nix/store/0nln7k62ggiw9s5y0icr3hyribl5iazb-pg_graphql-1.2.3.drv16  /nix/store/0nn0jglvy3w5hd868rilks6acxx242hj-pg_net-0.19.5.drv17  /nix/store/0q3jswlrym436vq3yzd7nmxpfpc7zbw7-wrappers-0.5.6.drv18  /nix/store/0wbkhlgz00c1nhm74adar4kk6dbid1dq-pg_graphql-1.5.11.drv19  /nix/store/1k3nzf8206jy6jjwdb50jn8rij79dvvj-plan_filter-0.1.drv20  /nix/store/17zhj6r14i4xx0fmzclykpcnyicwhbga-plan_filter.drv21  /nix/store/18746y4c8pvpm3al2bydwcn29pgwkjij-pg_repack-1.4.8.drv22  /nix/store/1hza0wxglhyl1641a3yki78kp045s8x2-wrappers-0.5.7.drv23  /nix/store/1mkhz1wanb7sx61imr6wqda0cqnvnj8q-wal2json-2.6.drv24  /nix/store/1r4ihdrrxnxp1kc97akzkb6yf0rhj5fy-wal2json-2.6.drv25  /nix/store/spkggw5b21kbiq57p7fq00khhxxg9mpm-http-1.6.1.drv26  /nix/store/1s2y3lhnrwphps8mxwxhj6pli5p72pz8-http.drv27  /nix/store/21s45rg3i2jfhdarxmqf3dr79allgdgh-wrappers-0.4.5.drv28  /nix/store/25f3j4f5ialq0qwpdpc7gya55q9i2mai-pg_net-0.11.0.drv29  /nix/store/m94894cysabrjwxvvsg00i2c4vxrwj44-pg_graphql-1.6.1.drv30  /nix/store/nsc639d0i1mzcdskxc5v8874w8f4zf8x-pg_graphql-1.6.2.drv31  /nix/store/w47195gn53xxlfnja6kkgpgj0pbxj66m-pg_graphql-1.5.9.drv32  /nix/store/2j0amjv943p6zmhzl3mx9z6jr1qcpn3i-pg_graphql.drv33  /nix/store/2wp2aqp71l4218m1z0aas6789yx18sv3-pgrouting-3.4.1.drv34  /nix/store/564f4p7z536irjy1x7a6i39nk3n3g2r2-pgrouting.drv35  /nix/store/7m924d2lj1z3y952h3rhjixfq3sygp4r-pg_tle.drv36  /nix/store/z008z9r9dipnvldyfh7pklhxwdav0faw-http-1.6.1.drv37  /nix/store/82hvrn43v2lmbsbj2cnaaps4iy6q9dqn-http.drv38  /nix/store/k4qjk97aggz30jlgv2hdqka8fy8z07pg-supabase_vault-0.3.1.drv39  /nix/store/z8jynkjsnrfphim33c02aci4n6i2s9la-supabase_vault-0.2.8.drv40  /nix/store/8ir53vjiqz9rhip8arbxd2b58d0j67w0-supabase_vault.drv41  /nix/store/vrks8v32hwif7cfllbj4kb4i2v9b48y8-hypopg.drv42  /nix/store/yxyw8y9hskg7m2sajbfkix9g2pibkl2w-index_advisor-0.2.0.drv43  /nix/store/9c27ix09f1z8w6a63dkm9idp2vsrixh1-index_advisor.drv44  /nix/store/9sv9z7i53r40xnrigr8aywi98izk30rb-wal2json.drv45  /nix/store/g3yy08xhp6kakigznjmymrvasv6xhzz4-rum-1.3.drv46  /nix/store/apcx516gwjdivwb00nzvgwwq26mp6kbp-rum.drv47  /nix/store/m5i71pkvgfbs9l7iwwnbj4hyz9dvj13m-pg_jsonschema-0.3.3.drv48  /nix/store/az9kzhbrx32y837x7nl7dfajllv3l3xn-pg_jsonschema.drv49  /nix/store/ynjdlqr0w8h7ici1xdnsr79mwnzmyyri-pgroonga-3.2.5.drv50  /nix/store/c7b5vgzvlwgra3bhwq5fjzl0cg8lxq53-pgroonga.drv51  /nix/store/axpz1dvivwnmwkkcs392nj9cp1zs4x4h-pg_repack-1.4.8.drv52  /nix/store/gpxphj5cc5qbfjvp1kckicqwibgb6870-pg_repack-1.5.0.drv53  /nix/store/nynlpdydjmjk2fk2fsjz9bws5n6pjjyv-pg_repack-1.5.1.drv54  /nix/store/sa036niivyjgc2rqi9xh890msxh349l9-pg_repack-1.5.2.drv55  /nix/store/f4jr9drjzv7wfj2rxqg6fxg4ki5xv8aq-pg_repack.drv56  /nix/store/3cgs2dl0nwcsnwa5j7vkkp9vnqrax686-wrappers-0.6.0.drv57  /nix/store/74dcpcc376carhrdcf8ka4zmkawz1yv6-wrappers-0.5.4.drv58  /nix/store/92vrj7bj8hswwppxa34pv4a5mcishcns-wrappers-0.4.4.drv59  /nix/store/96l1zwmvz2ffcdfraaalfc6lvhah4kbz-wrappers-0.5.5.drv60  /nix/store/adcv6z66z4kpsasjjh1mcxa915lbdppl-wrappers-0.4.5.drv61  /nix/store/b4n3d1kid5pcaqfl3fjnjmc425dgg1p1-wrappers-0.5.0.drv62  /nix/store/jcd2gw4vawwnh0pmxhl4pl3ll6adggx5-wrappers-0.6.2.drv63  /nix/store/vxwdlzq8s4jj92x0jpc4sl9drjywlalq-wrappers-0.6.3.drv64  /nix/store/xwhq66cqc0ms922bxlcgc1jwff6kqv8g-wrappers-0.5.3.drv65  /nix/store/y6kq63cxxc5v5jh87mv9wpbvk0p4ayfg-wrappers-0.6.1.drv66  /nix/store/zdyyj4cgmfdl46zb5ycwmwr6d30w6mbx-wrappers-0.4.6.drv67  /nix/store/fn58ja37h9fw7mszrd75faxdb0999f0i-wrappers.drv68  /nix/store/8yjdx0pjzbx41fx807nrw1js3y16kbz5-vector-0.5.1.drv69  /nix/store/9yiwshvqw6zii2gdbjn3whic00kdi2kk-vector-0.7.4.drv70  /nix/store/gd4y86918lqw8gzxg8nqrz8sy2dqq9fb-vector-0.7.0.drv71  /nix/store/gdgmh15k0z47wvlyk7n79hg9mm7jzisl-vector-0.6.2.drv72  /nix/store/hs3bxh6aa4yj96k9qp50af7qy1jchwk3-vector-0.6.0.drv73  /nix/store/j5mchw8xwd04x2c28fmf7pccna5x7y95-vector-0.8.2.drv74  /nix/store/qa8qkhza8bf74v69dzxgqvy2mjf799yl-vector-0.8.0.drv75  /nix/store/g5mv4minlqr25pj8gqhzcns6w7bwzaph-vector.drv76  /nix/store/lkbp0bzzg49y6z9h7ms156q0jsiq6qh4-safeupdate-1.4.drv77  /nix/store/icwncd52zxyvvybn79pvj2s9day934p8-safeupdate.drv78  /nix/store/j99v4y7ck8sk68hj9m9aw1avc2dkn4nh-pg_stat_monitor.drv79  /nix/store/9kmiqqmclsl8d77yd54al2d2wlwc6dp1-pgsodium-3.0.4.drv80  /nix/store/ckl9zg69wqkncwizrd6lln7h5492wwn6-pgsodium-3.1.6.drv81  /nix/store/lhi0y1xi9i9i1c8kg95nfhdw95j3dz3r-pgsodium-3.1.5.drv82  /nix/store/msmzmvngp6cx4yl0dwgzp3iv7bv796wg-pgsodium-3.1.8.drv83  /nix/store/zwypkv0vf8m8ybs536jq5wglvhfwdx8y-pgsodium-3.1.7.drv84  /nix/store/l68xzbdq736nzdnwvr9q3x29wcngcsj1-pgsodium.drv85  /nix/store/qk4j715gipc827yxrcwv0g9pviaqxkyy-pg_partman.drv86  /nix/store/46l7zbh5kkmyi58x419ar4kly30qvnhi-gdal-3.8.5.drv87  /nix/store/l9h30apsjb4s39av0lwsad1vv59rdkv6-cgal-6.0.2.drv88  /nix/store/s3myd88a11h86h3h8cvhgd1im0zk6i65-sfcgal-2.2.0.drv89  /nix/store/apd0c6nk3x333r1xj0sl2m3cr96pbizv-postgis-3.3.7.drv90  /nix/store/r12320b80inhy5aq434asc4sa8w6bn0g-postgis.drv91  /nix/store/36hfvpcvdxj64718i9mhil3db8835a6q-plpgsql_check-2.7.drv92  /nix/store/9lpr8r6zwzid07ihmr89rnxqcwv0yfja-plpgsql_check-2.8.drv93  /nix/store/rly88629k74w1nj10q0l6mg2jvd3nr1g-plpgsql_check.drv94  /nix/store/83ycsfk9ivb7sah3lq89d8hy5rxj5vpp-pg_net-0.20.3.drv95  /nix/store/a0ldx82cv1chkbdks86c8mjp8ps4lfgn-pg_net-0.20.0.drv96  /nix/store/b0270km6h57kbdxfkhagcpsilp239adm-pg_net-0.11.0.drv97  /nix/store/lbqp8bfrqa2xm82ma6wyq1gijyajh6kh-pg_net-0.13.0.drv98  /nix/store/rdglczxf0sk4hhwsppqw13zl43vf5wr0-pg_net-0.14.0.drv99  /nix/store/w7547z9slhcibw4s6cwkag6w1f49317s-pg_net-0.20.4.drv100  /nix/store/vvs47f973jig6lflvm7cidm6m20glpy5-pg_net.drv101  /nix/store/92dxzgq4qn1jl389a931z1n5n1a8s5ns-pg_hashids-1.3.0-cd0e1b31d52b394a0df64079406a14a4f7387cd6.drv102  /nix/store/x1kpz6n29pqn2xm06lprn5kwpr0pjhhx-pg_hashids.drv103  /nix/store/y1p5dlzmilwxqbf3a4c7hl6gp9p84wsl-pgmq-1.5.1.drv104  /nix/store/y5rgrfmhzrjr0j6zil7ksqdbcglh0s8i-pgmq.drv105  /nix/store/jk18akz00pd0nr1pixnq9550lnvycgar-pg_cron-1.6.4.drv106  /nix/store/ybhpqdys29q375m5pxxn2w3cbzgf3mxg-pg_cron.drv107  /nix/store/mpyn776iqdn7h94vlp5yxn83a0y4lchc-pgtap-1.3.3.drv108  /nix/store/psjbrnijdnpqyc9s718av7nwmyk0fays-pgtap-1.3.1.drv109  /nix/store/zf19xpsa8jj4bmx09awww0z16cm79z4g-pgtap.drv110  /nix/store/2fndab8axk4hz4s30ijaxnpa1bc9z1dc-postgresql-and-plugins-17_22.drv111  /nix/store/2h15dgac1417g71pjrb4aqcz8yabiv21-plpgsql_check-2.7.drv112  /nix/store/2i3blwmkdwv0753xgc4pb1rm16gk4jmv-wrappers-0.5.6.drv113  /nix/store/2nmg9sxx50xmndps3714hbvwjyd5rqv0-vector-0.8.2.drv114  /nix/store/3bfr1qggn2db554518zgs8fpzyagvfrb-pg_jsonschema-0.3.3.drv115  /nix/store/2x6xkwfx99zhzhdbmhbrnifqf63l8ica-pg_jsonschema.drv116  /nix/store/qbrypyj5k7h0pffxxshbyym24h89f2y1-gdal-3.8.5.drv117  /nix/store/h1vl8vpk154yppn5lcqms2680igi0mmj-postgis-3.3.2.drv118  /nix/store/2ylkw9crapb58vd5g0vj602jfyb1p3r6-postgis.drv119  /nix/store/381ghgpkv0l9lnv0f1v2jxfg04cspiih-rum-1.3.drv120  /nix/store/3dxfnbp09hx3zc5q8mmvb54v0nb1lrid-plpgsql_check-2.8.drv121  /nix/store/3m1k34jx4kw90mcghzrp83c2dfhrwab8-pg_repack-1.5.1.drv122  /nix/store/48mqx57r48j330b49mc32k7bvy6445c2-wal2json.drv123  /nix/store/4dv0hiafadp1s6dx9i8qfwajgh422j5n-pg_graphql-1.6.1.drv124  /nix/store/4wk9vb1q3kdnhj8hsq8pwgbp82glwg9w-timescaledb-2.9.1.drv125  /nix/store/58cinn47vbvwr1wxdkspmvi9cj27b07h-safeupdate-1.4.drv126  /nix/store/6c0mnd757hvxppfyrsf4cb1wgnbd4111-safeupdate.drv127  /nix/store/ciwky5vscrx4c52kr30fm8j4idj8qgsn-pg_stat_monitor-2.1.drv128  /nix/store/7a02zvvkkkriis78wgz6n8nnkwm2gh22-pg_stat_monitor.drv129  /nix/store/9gh7fip2wf0wip8wnv1axd8ghar0x5fb-pgmq-1.5.1.drv130  /nix/store/k4swwy7459wf558rbrraclsr4sjccz0h-pgmq-1.4.4.drv131  /nix/store/8zsadvm8mv18kpy4qy724ps2jlbsik0w-pgmq.drv132  /nix/store/9wzj3wh6sczzk849dmjwvmnkshggakxp-timescaledb.drv133  /nix/store/94d6rmv5v8zdjsgzl3yrhpg7zq6zdjpx-vector-0.5.1.drv134  /nix/store/alajylsl9b90m65n0ps0mkbkw679x4sn-vector-0.6.2.drv135  /nix/store/jmilv9h5p0v4grgqnhfn22i7zl352ybh-vector-0.7.4.drv136  /nix/store/q3mdjvqpw4xbwcjy5y1ps1igxsjvx133-vector-0.7.0.drv137  /nix/store/v5dnr617av2jgk6kpddxbxxqjqgl5kzg-vector-0.8.0.drv138  /nix/store/z40s48rz55qgpw6g6wiqi68hkfas4h1l-vector-0.6.0.drv139  /nix/store/zygvf0wgqsyi96fangshfkwjiyylhvkz-vector-0.4.0.drv140  /nix/store/9zndhfzc45vrfn297g1hav7m6ba3rlzk-vector.drv141  /nix/store/63ifr5p2wzl7vygaj7pq847nwnrnxm3p-pg_graphql-1.5.0.drv142  /nix/store/6hfik9nnrihzb6dj53in06v6a4qmgsj3-pg_graphql-1.5.7.drv143  /nix/store/7pqhalqwaggagybgy24lm93c5b8d4isk-pg_graphql-1.4.2.drv144  /nix/store/ag5rlkqwfkwlgvxg1yhivjqfcaq2w14v-pg_graphql-1.5.1-mergeless.drv145  /nix/store/cgazfazb4ak4csd48khgjsa4vxmmddfb-pg_graphql-1.5.11.drv146  /nix/store/d78fjdz9zrccq7f563jz9fj1a45yrq5x-pg_graphql-1.1.0.drv147  /nix/store/dk0a0irlxsl04249qy2dnc6bm4wkk1lc-pg_graphql-1.6.1.drv148  /nix/store/dnwfmlfwyqnkzy2jyzf6h3q044wk6hbg-pg_graphql-1.5.9.drv149  /nix/store/f694g0m8chfk6z6yh787135bzcqwnli4-pg_graphql-1.5.4.drv150  /nix/store/fsgiwnrg38ssgf05vkmzc21v93a36qmd-pg_graphql-1.2.2.drv151  /nix/store/h9damb814a5fmzyc5wgcildkm32vy1bv-pg_graphql-1.6.2.drv152  /nix/store/iq0gzwfxzxkns0gpdkhjx1cc6s4q1i2q-pg_graphql-1.5.6.drv153  /nix/store/q66z8j5qs96rgahzmlrq4n41d2avywar-pg_graphql-1.0.2.drv154  /nix/store/v0mqjlj6j73wpc66h34djrv08j7q3l8w-pg_graphql-1.4.4.drv155  /nix/store/wnn3f47lz59i84mdzvmc1a7man89cmic-pg_graphql-1.2.0.drv156  /nix/store/yds474rgqgxjdw6zm0ylvpvvd4l0xmkl-pg_graphql-1.4.1.drv157  /nix/store/yhfqz2chz94q9k3rv8hgwcsyri02wlm8-pg_graphql-1.5.1.drv158  /nix/store/a4icbsgspmpi3nfs8vffp42sg9v7a25f-pg_graphql.drv159  /nix/store/a7qnf8v2hw96v6kdba9j02fljccy432g-pg_tle.drv160  /nix/store/c08rdgxba5n6zhyp78l8sd6fhnbc4a4c-pgsodium-3.1.7.drv161  /nix/store/hh2jpg5qdwgdwzi96qcay1a5ffhi0f4i-pgsodium-3.1.6.drv162  /nix/store/jwrjvb9m50v44sla4jpig83jab7zn17x-pgsodium-3.1.8.drv163  /nix/store/m1xdmpffkflwgdin5ljvfh72wxq5lxpx-pgsodium-3.1.5.drv164  /nix/store/wjhhlaiwzvm5m08my4d983icdmcpllzd-pgsodium-3.0.4.drv165  /nix/store/a9laaq557mna86dm87lq3211xy5h2zyl-pgsodium.drv166  /nix/store/ag6xlrckwkx594nhf6j3sq2ngwbryyz8-http.drv167  /nix/store/i0gq8yqxp5h7l782n2ki94b1d62m6zsg-plpgsql_check-2.2.drv168  /nix/store/q117a7mx5d5bzln8xg24fh1vfzq7bsz4-plpgsql_check-2.7.drv169  /nix/store/rj6qw8pwvr91cy6qyp8xibrw4arrpj9j-plpgsql_check-2.8.drv170  /nix/store/c782i897gj20c0r8bmphf8p6r5s5wdli-plpgsql_check.drv171  /nix/store/b139hl0gpc9icb6j6q28gl1chw7i9260-rum-1.3.drv172  /nix/store/csvzp35khfq15v5g275y14094s58v10k-rum.drv173  /nix/store/c2pcswnd4yfp02pas6a7grpm0fmk70wx-supabase_vault-0.3.1.drv174  /nix/store/jb3j93i6ljmvqkv5cnv3lh3d9zn4zcjz-supabase_vault-0.2.8.drv175  /nix/store/gc3nb7r1a8rbf6f8yf4zs2nnb65awkxq-supabase_vault.drv176  /nix/store/7inhp3jz4x6l1m2i6aa1w6bbb91r1hay-pgroonga-3.2.5.drv177  /nix/store/xim497rkcncpxb5vvyli3j4jnziyybgy-pgroonga-3.0.7.drv178  /nix/store/gdd3j67qcdibplv1d440a6gsix87s5xs-pgroonga.drv179  /nix/store/ihx5q75k74a4cqq4k9bwnl5yin262kq2-pgrouting-3.4.1.drv180  /nix/store/hf9dly2ryx969lw950ld454fqfa6c41r-pgrouting.drv181  /nix/store/8kjmsmcqakfh251gpi83kpszgvy3zgj2-pg_jsonschema-0.3.1.drv182  /nix/store/dllk76mn670xnq6146jk4lmj5hpxmp4c-pg_jsonschema-0.3.3.drv183  /nix/store/pqncxlsh0gj7xk3n4mwxqiyyzim9c7g7-pg_jsonschema-0.2.0.drv184  /nix/store/iljk5j7rhldnws1iwi3j8qjxnaalxqjv-pg_jsonschema.drv185  /nix/store/82vdx9lfkbv67j79qzi9yzvqrj043w52-wal2json-2.6.drv186  /nix/store/iz713zhjyn0lym6ls12i9vxca9cxf4hi-wal2json.drv187  /nix/store/zfhvj40marmxclav9a5ppx3dmq3xd3hh-pg_partman-5.3.1.drv188  /nix/store/jcxqgl4g37gj09v4km7dl525ym1kxla2-pg_partman.drv189  /nix/store/mc1n2fml7avin2lrpgrd5cx7wjdb4gcg-pg_hashids-1.3.0-cd0e1b31d52b394a0df64079406a14a4f7387cd6.drv190  /nix/store/jsqjxdn4qp571nvc40r8xx103s9qb7c9-pg_hashids.drv191  /nix/store/7lzcc5d36122752hpjb6lij6sc2ai2a0-plv8-3.1.5.drv192  /nix/store/87brzrl1nsm8z4my02aldnxd8fb0i69x-plv8-3.1.4.drv193  /nix/store/k6nh1vivj2dgh0jk2mpsiy4p5v6sjyzk-plv8.drv194  /nix/store/xjfjfch45p5g0snar9qpm4amblh2jya8-plan_filter-0.1.drv195  /nix/store/lhdnha0m1rqpv0cmivzv3s7znjmgxc14-plan_filter.drv196  /nix/store/5xdj291zxpgm4qhx0749x7j0wwlfilf4-pg_net-0.1.drv197  /nix/store/6nzc8mspw5i4qqlvgriv2l1439xlh68v-pg_net-0.10.0.drv198  /nix/store/7iq4z475k625nsn9wc9nf4vxa7x1f1qd-pg_net-0.19.5.drv199  /nix/store/cfrc2vk3cgabx1447j2n7s3zxraq6395-pg_net-0.14.0.drv200  /nix/store/iwq28h7yniccm9ra8q6dc0wma0l6hnqn-pg_net-0.6.drv201  /nix/store/nw3d144zhshkgx1z66g9g2wg5829w36n-pg_net-0.7.1.drv202  /nix/store/nwcnf7x9i2zdx48936w9ixsnxzhbab16-pg_net-0.20.0.drv203  /nix/store/rfdqkjkjdwz7ydrwlfn9cdy68zz9z6rf-pg_net-0.7.drv204  /nix/store/whvqb38akl195470ks3jads9kmq2i9gj-pg_net-0.8.0.drv205  /nix/store/zy29jzcj1bsz7760wbmlg78czaddsrni-pg_net-0.20.3.drv206  /nix/store/q7ak647qv213m4vc4fnr43i09azs1b0p-pg_net.drv207  /nix/store/s7vxni6a17dm43jdicq8ksfjsk2d7c0n-pgaudit.drv208  /nix/store/nwi7hxl3j1cxn7ylrkx8sbbg3sqld8ag-pgtap-1.3.3.drv209  /nix/store/sxzi0qg4ingw35zkbi2pk2vfgxbq5k2a-pgtap.drv210  /nix/store/wza7bzcbymwld5yd1bh5p859l0fgd9af-pg_cron-1.4.2.drv211  /nix/store/xcji3ff216yxrc2yf2yss6mza01w0ccm-pg_cron.drv212  /nix/store/56j6z0f3g50m72cj7ynr22p9fdml79q9-wrappers-0.5.3.drv213  /nix/store/9m4hgq2s9z1cy1508wymdcl2n1w3ky5h-wrappers-0.6.2.drv214  /nix/store/f3b53aqd65czxnbbash43yraza54ds7k-wrappers-0.4.3.drv215  /nix/store/fpcwzjw9wdhbljjpcjlbz4w6236qzl70-wrappers-0.3.0.drv216  /nix/store/hygnfcb7az5nw4c4aranasi27gnhzgan-wrappers-0.6.3.drv217  /nix/store/iimlppn24xgvgjvnm4xp8z9bxl4p4p1d-wrappers-0.4.1.drv218  /nix/store/l3ww3jfvj5l8bp25p66wrjziy8m0vi23-wrappers-0.5.0.drv219  /nix/store/ns9rs9anq0rsl3sh1rhxmqcsll7lkjd0-wrappers-0.5.6.drv220  /nix/store/nvjw377g2m07i1z93mngr72qhpjmafvy-wrappers-0.4.6.drv221  /nix/store/qzn17ml7z84zcmcw96j0z0f6m9j6y7qm-wrappers-0.5.4.drv222  /nix/store/xbhixx8nl4iifcfi17lpavbs9cxcg5ka-wrappers-0.6.1.drv223  /nix/store/y06jjr5k7hk7zs8gzilg4g50b184va6a-wrappers-0.4.2.drv224  /nix/store/y1qh08g7i9w1x2s10rq7ammigljy82kw-wrappers-0.4.4.drv225  /nix/store/z1yzqa9qzq4ri1f58lngsljs0abhgjz5-wrappers-0.5.7.drv226  /nix/store/xcq8s20l2ynk52356w6nqkdw7379h4g4-wrappers.drv227  /nix/store/c7dnz58z4jqy26qinfmray2nlvxx3442-pg_repack-1.4.8.drv228  /nix/store/iwgg2la44vzaaa2ja2xyaydck2jab651-pg_repack-1.5.2.drv229  /nix/store/xd0qgx5kfkw00jgxs1v9rm4ksfdjky95-pg_repack.drv230  /nix/store/fakh4z5ssr1vhknp3xv3ch232i3ph2ax-postgresql-and-plugins-15.19.drv231  /nix/store/4z7sbcap8vdzfs1smz81k2crr4sgm640-postgresql-and-plugins-15.19.drv232  /nix/store/5ls8sxw33v0sm4agddi4xzky3nvhg3g7-index_advisor-0.2.0.drv233  /nix/store/5sxmls2c3rj1id1jy8cp90d7aga5vs9y-pg_graphql-1.5.9.drv234  /nix/store/6601flp9bdqz93g493ma3hhb95ia16fh-pgroonga-3.2.5.drv235  /nix/store/6f7pk59bx81p58zx4lxc0kpr0a4pskc3-pg_graphql-1.5.11.drv236  /nix/store/83syfrxa296qd37cig3f07glk8hn533v-pg_stat_monitor.drv237  /nix/store/84hgdiz6hjkzk0cm5bd3vqsbx45n9zkh-vector-0.8.0.drv238  /nix/store/8byjp94z4bcpvgpc2s8ga2rqg9c3xc55-pgrouting-3.4.1.drv239  /nix/store/8p8fsl25zwlaqwhknw8myg0lfhi6rhsg-wrappers-0.6.0.drv240  /nix/store/8szfd9ycs8amd9k5vlvg6prcijxwqr3j-hypopg.drv241  /nix/store/92n1zijp3izg793lrskmws7kyjz1xg5h-vector-0.6.2.drv242  /nix/store/sww4kz29ir2aly4abpn3hb8zfqy4ak06-pg_cron-1.6.4.drv243  /nix/store/9w316phdvwdjv5875fpg98qwdi7hxzv5-pg_cron.drv244  /nix/store/a9l3bgzraqwg33ax5gcmbqwrkrrxxnag-wrappers-0.4.5.drv245  /nix/store/al6g5cvx86v4ljmh3sg6hmlsl3ab3bwf-pg_net-0.20.3.drv246  /nix/store/b1pyvgjyn940h95bbnsp15qmb0qli5gd-pg_net-0.20.0.drv247  /nix/store/f2nm4421r3k58c32661m7na2f1q95dbh-pgtap-1.3.1.drv248  /nix/store/k7h19a5nads14nh23z55wp7vpifpqdcg-pgtap-1.3.3.drv249  /nix/store/b3wykhrc5d96h1ddr0n8jc0vm6lda047-pgtap.drv250  /nix/store/bxnxr2z670m9ri1dc66149krs7h60dnc-vector-0.7.0.drv251  /nix/store/cl8ikglrq6jdd2cp01jad7n483mvqj8g-pg_net-0.11.0.drv252  /nix/store/msp1w36fm572jxlq4yj3ilwksxa0qpag-safeupdate-1.4.drv253  /nix/store/fl0xvi8swv20jz0vkfsm12znd6mp9naq-safeupdate.drv254  /nix/store/hnandxbj17d43iq41vk9jgn2mk94s7fg-index_advisor.drv255  /nix/store/kxm7a9483vsp4n6zn93isjb5z31l42fd-pg_graphql-1.6.2.drv256  /nix/store/k2r44m3w1mwab1ipx8m72764yyhxr38v-pg_graphql.drv257  /nix/store/k4lajdzpb6zgp35ib3yfg5hk7p7kj1z3-rum.drv258  /nix/store/fh5b65jxgdyzwrs2g7y12ffnk1yhxczn-wrappers-0.5.7.drv259  /nix/store/h81r7798azz2nz8s3pxp1drpa02ma2m8-wrappers-0.5.4.drv260  /nix/store/hlpygbdz705888l5vwvvnz96901jdbkn-wrappers-0.5.5.drv261  /nix/store/kcan9i952k07b3pm1fnq4s0f7pfn7yx9-wrappers-0.5.3.drv262  /nix/store/pvzl31ydc0nhwqmrw9agqqbmk4v4ycr8-wrappers-0.6.3.drv263  /nix/store/q0lgs5nhw27p302wa3gp300l19ad95f0-wrappers-0.4.4.drv264  /nix/store/rfn5rhjy53sq47kjz5qfawd9pz9a38l1-wrappers-0.5.0.drv265  /nix/store/sg3hglpfqxg0bdxvkn36jnvpd752brga-wrappers-0.4.6.drv266  /nix/store/sn2m8z01kbz72vbl839b4qdhql2lf67m-wrappers-0.6.1.drv267  /nix/store/w5gnd7pybydask3lizsy3lirm83jxx56-wrappers-0.6.2.drv268  /nix/store/kplnvybrmx8df99qr3hsafbkky7hfg3v-wrappers.drv269  /nix/store/ibl9nbmh9mbqgqqfkrq7vgqzbsxj392q-pgmq-1.5.1.drv270  /nix/store/kv8jjb4gkylvk18qlsxl5lp9k29b1d31-pgmq.drv271  /nix/store/hnhqkd9jnn7w4z0z0jacwjwg9x016gyl-pg_repack-1.5.0.drv272  /nix/store/rhyhx66rvbmsmh7i4xf5dqi3pr058hjr-pg_repack-1.5.1.drv273  /nix/store/x14ai73x9yl5ckncl830rpbqxpjvvbg5-pg_repack-1.5.2.drv274  /nix/store/m6b5d5vphi1v49cpgr7ff07zvzfri21p-pg_repack.drv275  /nix/store/q8n9c44w9m7lggw81a93q8rvr4jgmslx-plan_filter-0.1.drv276  /nix/store/n1y2c26wz7wmff6xrz6ggk6zvsgma4bk-plan_filter.drv277  /nix/store/qs7fc4p2b8g3zc4cd29vi1wck7acipz9-pgrouting.drv278  /nix/store/rqv928k6h7v2jlfgznn4wi7km7zvm5qk-pg_tle.drv279  /nix/store/v635079aqf2hhpg4xnhm2226g7khvdav-plpgsql_check.drv280  /nix/store/nyx1ahbyki15bmvygqzj2s1nnbmbi8ig-vector-0.7.4.drv281  /nix/store/s72y0nj96pwds84md5hz9x09cidw3azz-vector-0.6.0.drv282  /nix/store/wy228ccg72w2cv5rbhynqgmbxx7dqlws-vector-0.5.1.drv283  /nix/store/za0ss4y8awhkng526g581wdnh0azibcf-vector-0.8.2.drv284  /nix/store/x3iqn55b29mih079vypw11gf008gj74l-vector.drv285  /nix/store/xkmdckj5hdcfgqlyjn2qq5vdv6s09h5a-pgroonga.drv286  /nix/store/g6nfp5n056kw2jvfzldzxrrrxfpfcka0-pg_net-0.13.0.drv287  /nix/store/xwiwd8fzjgv67zb2ji446a8vxjj3s7bs-pg_net-0.14.0.drv288  /nix/store/yf5z0qi17vprkjz68rqyp804sx929g9n-pg_net-0.19.5.drv289  /nix/store/y02vszvrhs7b6kn8llgwzdmnmhqiymzk-pg_net.drv290  /nix/store/k684vf2v1w6afbwv98r05j1f5hg9gw2f-pg_hashids-1.3.0-cd0e1b31d52b394a0df64079406a14a4f7387cd6.drv291  /nix/store/yi643dw2hzxidf2jf635pk0da5c4bs96-pg_hashids.drv292  /nix/store/mxhjb2qfqd8l49wakfpw5qiws2v1bcnn-gdal-3.8.5.drv293  /nix/store/mrfs1y0f5l367m93gpss7lp0jg6nz3bf-postgis-3.3.7.drv294  /nix/store/yskfmp4z518h4ff0mli70gsirhsli1ns-postgis.drv295  /nix/store/nj44phx30461wf1ac6n8fg8cc58agpgv-postgresql-and-plugins-17.11.drv296  /nix/store/rn61yq57k8lhdkx7al266vkbandycwv7-postgresql-and-plugins-17.11.drv297  /nix/store/i3fy4azgna3zl2za0k3pwx70f2sk6hk8-receipt.drv298  /nix/store/w85w5162f9zdpi7g98sjlk186hrrm57p-postgresql-and-plugins-17_22.drv299  /nix/store/fggd2pzx0mw42sm4gam72pw4gka8dyl8-docker-image-test.drv300building '/nix/store/ag6xlrckwkx594nhf6j3sq2ngwbryyz8-http.drv' on 'ssh-ng://nixbot-remote-build@78.232.36.247'301building '/nix/store/ag6xlrckwkx594nhf6j3sq2ngwbryyz8-http.drv'302http> created 14 symlinks in user environment303building '/nix/store/9c27ix09f1z8w6a63dkm9idp2vsrixh1-index_advisor.drv' on 'ssh-ng://nixbot-remote-build@78.232.36.247'304building '/nix/store/6f7pk59bx81p58zx4lxc0kpr0a4pskc3-pg_graphql-1.5.11.drv' on 'ssh-ng://nixbot-remote-build@78.232.36.247'305building '/nix/store/6f7pk59bx81p58zx4lxc0kpr0a4pskc3-pg_graphql-1.5.11.drv'306pg_graphql-1.5.11> Running phase: unpackPhase307pg_graphql-1.5.11> unpacking source archive /nix/store/7fifqwfl0gqcak1a1lqswmmpjpj11rag-source308pg_graphql-1.5.11> source root is source309pg_graphql-1.5.11> Executing cargoSetupPostUnpackHook310pg_graphql-1.5.11> Finished cargoSetupPostUnpackHook311pg_graphql-1.5.11> Running phase: patchPhase312pg_graphql-1.5.11> Executing cargoSetupPostPatchHook313pg_graphql-1.5.11> Validating consistency between /build/source/Cargo.lock and /build/cargo-vendor-dir/Cargo.lock314pg_graphql-1.5.11> Finished cargoSetupPostPatchHook315pg_graphql-1.5.11> Running phase: updateAutotoolsGnuConfigScriptsPhase316pg_graphql-1.5.11> Running phase: configurePhase317pg_graphql-1.5.11> Running phase: buildPhase318pg_graphql-1.5.11> Executing cargo-pgrx buildPhase319pg_graphql-1.5.11>    Validating /nix/store/9q4p23a2y63xn8safzzn6lbn07bnkshs-postgresql-17.11/bin/pg_config320pg_graphql-1.5.11>  Initializing data directory at /build/tmp.BWu5PFcMht/data-17321pg_graphql-1.5.11> waiting for server to start....2026-10-06 14:05:52.067 GMT [73] LOG:  starting PostgreSQL 17.11 on aarch64-unknown-linux-gnu, compiled by gcc (GCC) 15.2.0, 64-bit322pg_graphql-1.5.11> 2026-10-06 14:05:52.070 GMT [73] LOG:  listening on Unix socket "/build/tmp.nNhzeUYdcU/.s.PGSQL.5432"323pg_graphql-1.5.11> 2026-10-06 14:05:52.078 GMT [76] LOG:  database system was shut down at 2026-10-06 14:05:51 GMT324pg_graphql-1.5.11> 2026-10-06 14:05:52.084 GMT [73] LOG:  database system is ready to accept connections325pg_graphql-1.5.11>  done326pg_graphql-1.5.11> server started327pg_graphql-1.5.11> createuser: error: connection to server at "localhost" (127.0.0.1), port 5432 failed: Connection refused328pg_graphql-1.5.11> 	Is the server running on that host and accepting TCP/IP connections?329pg_graphql-1.5.11> waiting for server to shut down....2026-10-06 14:05:52.149 GMT [73] LOG:  received fast shutdown request330pg_graphql-1.5.11> 2026-10-06 14:05:52.151 GMT [73] LOG:  aborting any active transactions331pg_graphql-1.5.11> 2026-10-06 14:05:52.153 GMT [73] LOG:  background worker "logical replication launcher" (PID 79) exited with exit code 1332pg_graphql-1.5.11> 2026-10-06 14:05:52.155 GMT [74] LOG:  shutting down333pg_graphql-1.5.11> 2026-10-06 14:05:52.163 GMT [74] LOG:  checkpoint starting: shutdown immediate334pg_graphql-1.5.11> 2026-10-06 14:05:52.176 GMT [74] LOG:  checkpoint complete: wrote 3 buffers (0.0%); 0 WAL file(s) added, 0 removed, 0 recycled; write=0.004 s, sync=0.003 s, total=0.021 s; sync files=2, longest=0.002 s, average=0.002 s; distance=0 kB, estimate=0 kB; lsn=0/14EC338, redo lsn=0/14EC338335pg_graphql-1.5.11> 2026-10-06 14:05:52.180 GMT [73] LOG:  database system is shut down336pg_graphql-1.5.11>  done337pg_graphql-1.5.11> server stopped338pg_graphql-1.5.11>        Using PgConfig("pg17") and `pg_config` from /nix/store/9q4p23a2y63xn8safzzn6lbn07bnkshs-postgresql-17.11/bin/pg_config339pg_graphql-1.5.11>     Building extension with features  pg17340pg_graphql-1.5.11>      Running command "/nix/store/hxlcfmjxs6akpyya3k1d4qk1ghbw11ij-rust-default-1.81.0/bin/cargo" "build" "--lib" "--release" "--features" " pg17" "--no-default-features" "--message-format=json-render-diagnostics" "--frozen" "-j" "2"341pg_graphql-1.5.11>    Compiling proc-macro2 v1.0.93342pg_graphql-1.5.11>    Compiling unicode-ident v1.0.16343pg_graphql-1.5.11>    Compiling libc v0.2.169344pg_graphql-1.5.11>    Compiling stable_deref_trait v1.2.0345pg_graphql-1.5.11>    Compiling memchr v2.7.4346pg_graphql-1.5.11>    Compiling quote v1.0.38347pg_graphql-1.5.11>    Compiling syn v2.0.98348pg_graphql-1.5.11>    Compiling thiserror v1.0.69349pg_graphql-1.5.11>    Compiling serde v1.0.217350pg_graphql-1.5.11>    Compiling litemap v0.7.4351pg_graphql-1.5.11>    Compiling writeable v0.5.5352pg_graphql-1.5.11>    Compiling eyre v0.6.12353pg_graphql-1.5.11>    Compiling equivalent v1.0.1354pg_graphql-1.5.11>    Compiling hashbrown v0.15.2355pg_graphql-1.5.11>    Compiling indexmap v2.7.1356pg_graphql-1.5.11>    Compiling icu_locid_transform_data v1.5.0357pg_graphql-1.5.11>    Compiling icu_properties_data v1.5.0358pg_graphql-1.5.11>    Compiling smallvec v1.13.2359pg_graphql-1.5.11>    Compiling glob v0.3.2360pg_graphql-1.5.11>    Compiling utf8_iter v1.0.4361pg_graphql-1.5.11>    Compiling synstructure v0.13.1362pg_graphql-1.5.11>    Compiling thiserror v2.0.11363pg_graphql-1.5.11>    Compiling icu_normalizer_data v1.5.0364pg_graphql-1.5.11>    Compiling serde_json v1.0.138365pg_graphql-1.5.11>    Compiling shlex v1.3.0366pg_graphql-1.5.11>    Compiling utf16_iter v1.0.5367pg_graphql-1.5.11>    Compiling write16 v1.0.0368pg_graphql-1.5.11>    Compiling clang-sys v1.8.1369pg_graphql-1.5.11>    Compiling anyhow v1.0.95370pg_graphql-1.5.11>    Compiling indenter v0.3.3371pg_graphql-1.5.11>    Compiling cfg-if v1.0.0372pg_graphql-1.5.11>    Compiling winnow v0.7.0373pg_graphql-1.5.11>    Compiling zerofrom-derive v0.1.5374pg_graphql-1.5.11>    Compiling yoke-derive v0.7.5375pg_graphql-1.5.11>    Compiling zerofrom v0.1.5376pg_graphql-1.5.11>    Compiling zerovec-derive v0.10.3377pg_graphql-1.5.11>    Compiling yoke v0.7.5378pg_graphql-1.5.11>    Compiling serde_derive v1.0.217379pg_graphql-1.5.11>    Compiling zerovec v0.10.4380pg_graphql-1.5.11>    Compiling displaydoc v0.2.5381pg_graphql-1.5.11>    Compiling tinystr v0.7.6382pg_graphql-1.5.11>    Compiling icu_locid v1.5.0383pg_graphql-1.5.11>    Compiling icu_provider_macros v1.5.0384pg_graphql-1.5.11>    Compiling thiserror-impl v1.0.69385pg_graphql-1.5.11>    Compiling icu_provider v1.5.0386pg_graphql-1.5.11>    Compiling icu_locid_transform v1.5.0387pg_graphql-1.5.11>    Compiling icu_collections v1.5.0388pg_graphql-1.5.11>    Compiling icu_properties v1.5.1389pg_graphql-1.5.11>    Compiling serde_spanned v0.6.8390pg_graphql-1.5.11>    Compiling toml_datetime v0.6.8391pg_graphql-1.5.11>    Compiling thiserror-impl v2.0.11392pg_graphql-1.5.11>    Compiling icu_normalizer v1.5.0393pg_graphql-1.5.11>    Compiling is_ci v1.2.0394pg_graphql-1.5.11>    Compiling once_cell v1.20.2395pg_graphql-1.5.11>    Compiling idna_adapter v1.2.0396pg_graphql-1.5.11>    Compiling toml_edit v0.22.23397pg_graphql-1.5.11>    Compiling cc v1.2.11398pg_graphql-1.5.11>    Compiling is-terminal v0.4.15399pg_graphql-1.5.11>    Compiling owo-colors v4.1.0400pg_graphql-1.5.11>    Compiling percent-encoding v2.3.1401pg_graphql-1.5.11>    Compiling minimal-lexical v0.2.1402pg_graphql-1.5.11>    Compiling ucd-trie v0.1.7403pg_graphql-1.5.11>    Compiling regex-syntax v0.8.5404pg_graphql-1.5.11>    Compiling pest v2.7.15405pg_graphql-1.5.11>    Compiling regex-automata v0.4.9406pg_graphql-1.5.11>    Compiling nom v7.1.3407pg_graphql-1.5.11>    Compiling libloading v0.8.6408pg_graphql-1.5.11>    Compiling form_urlencoded v1.2.1409pg_graphql-1.5.11>    Compiling supports-color v2.1.0410pg_graphql-1.5.11>    Compiling toml v0.8.19411pg_graphql-1.5.11>    Compiling idna v1.0.3412pg_graphql-1.5.11>    Compiling supports-color v3.0.2413pg_graphql-1.5.11>    Compiling either v1.13.0414pg_graphql-1.5.11>    Compiling itoa v1.0.14415pg_graphql-1.5.11>    Compiling ryu v1.0.19416pg_graphql-1.5.11>    Compiling yansi-term v0.1.2417pg_graphql-1.5.11>    Compiling syn v1.0.109418pg_graphql-1.5.11>    Compiling bindgen v0.70.1419pg_graphql-1.5.11>    Compiling unicode-width v0.1.14420pg_graphql-1.5.11>    Compiling byteorder v1.5.0421pg_graphql-1.5.11>    Compiling annotate-snippets v0.9.2422pg_graphql-1.5.11>    Compiling itertools v0.13.0423pg_graphql-1.5.11>    Compiling url v2.5.4424pg_graphql-1.5.11>    Compiling cargo_toml v0.19.2425pg_graphql-1.5.11>    Compiling pathsearch v0.2.0426pg_graphql-1.5.11>    Compiling cexpr v0.6.0427pg_graphql-1.5.11>    Compiling regex v1.11.1428pg_graphql-1.5.11>    Compiling semver-parser v0.10.3429pg_graphql-1.5.11>    Compiling same-file v1.0.6430pg_graphql-1.5.11>    Compiling rustc-hash v1.1.0431pg_graphql-1.5.11>    Compiling home v0.5.11432pg_graphql-1.5.11>    Compiling bitflags v2.8.0433pg_graphql-1.5.11>    Compiling pgrx-pg-config v0.12.9434pg_graphql-1.5.11>    Compiling walkdir v2.5.0435pg_graphql-1.5.11>    Compiling semver v0.11.0436pg_graphql-1.5.11>    Compiling getrandom v0.2.15437pg_graphql-1.5.11>    Compiling ident_case v1.0.1438pg_graphql-1.5.11>    Compiling strsim v0.10.0439pg_graphql-1.5.11>    Compiling fnv v1.0.7440pg_graphql-1.5.11>    Compiling fixedbitset v0.4.2441pg_graphql-1.5.11>    Compiling unicode-segmentation v1.12.0442pg_graphql-1.5.11>    Compiling convert_case v0.6.0443pg_graphql-1.5.11>    Compiling darling_core v0.14.4444pg_graphql-1.5.11>    Compiling petgraph v0.6.5445pg_graphql-1.5.11>    Compiling rustc_version v0.3.3446pg_graphql-1.5.11>    Compiling pgrx-bindgen v0.12.9447pg_graphql-1.5.11>    Compiling cee-scape v0.2.0448pg_graphql-1.5.11>    Compiling zerocopy-derive v0.7.35449pg_graphql-1.5.11>    Compiling radium v0.7.0450pg_graphql-1.5.11>    Compiling unescape v0.1.0451pg_graphql-1.5.11>    Compiling pgrx-sql-entity-graph v0.12.9452pg_graphql-1.5.11>    Compiling zerocopy v0.7.35453pg_graphql-1.5.11>    Compiling pgrx-pg-sys v0.12.9454pg_graphql-1.5.11>    Compiling atomic-traits v0.3.0455pg_graphql-1.5.11>    Compiling darling_macro v0.14.4456pg_graphql-1.5.11>    Compiling heapless v0.8.0457pg_graphql-1.5.11>    Compiling tap v1.0.1458pg_graphql-1.5.11>    Compiling wyz v0.5.1459pg_graphql-1.5.11>    Compiling darling v0.14.4460pg_graphql-1.5.11>    Compiling pgrx-macros v0.12.9461pg_graphql-1.5.11>    Compiling ppv-lite86 v0.2.20462pg_graphql-1.5.11>    Compiling rand_core v0.6.4463pg_graphql-1.5.11>    Compiling hash32 v0.3.1464pg_graphql-1.5.11>    Compiling enum-map-derive v0.17.0465pg_graphql-1.5.11>    Compiling half v1.8.3466pg_graphql-1.5.11>    Compiling funty v2.0.0467pg_graphql-1.5.11>    Compiling bytes v1.10.0468pg_graphql-1.5.11>    Compiling sptr v0.3.2469pg_graphql-1.5.11>    Compiling combine v4.6.7470pg_graphql-1.5.11>    Compiling bitvec v1.0.1471pg_graphql-1.5.11>    Compiling serde_cbor v0.11.2472pg_graphql-1.5.11>    Compiling enum-map v2.7.3473pg_graphql-1.5.11>    Compiling rand_chacha v0.3.1474pg_graphql-1.5.11>    Compiling cached_proc_macro v0.18.1475building '/nix/store/f694g0m8chfk6z6yh787135bzcqwnli4-pg_graphql-1.5.4.drv' on 'ssh-ng://nixbot-remote-build@78.232.36.247'476pg_graphql-1.5.11>    Compiling uuid v1.12.1477pg_graphql-1.5.11>    Compiling instant v0.1.13478building '/nix/store/f694g0m8chfk6z6yh787135bzcqwnli4-pg_graphql-1.5.4.drv'479pg_graphql-1.5.11>    Compiling seahash v4.1.0480pg_graphql-1.5.4> Running phase: unpackPhase481pg_graphql-1.5.4> unpacking source archive /nix/store/cpj3bng9bbvjg90083hzwzvhbrzrhxg8-source482pg_graphql-1.5.11>    Compiling cached_proc_macro_types v0.1.1483pg_graphql-1.5.4> source root is source484pg_graphql-1.5.4> Executing cargoSetupPostUnpackHook485pg_graphql-1.5.11>    Compiling hashbrown v0.14.5486pg_graphql-1.5.11>    Compiling itertools v0.10.5487pg_graphql-1.5.4> Finished cargoSetupPostUnpackHook488pg_graphql-1.5.4> Running phase: patchPhase489pg_graphql-1.5.4> Executing cargoSetupPostPatchHook490pg_graphql-1.5.4> Validating consistency between /build/source/Cargo.lock and /build/cargo-vendor-dir/Cargo.lock491pg_graphql-1.5.4> Finished cargoSetupPostPatchHook492pg_graphql-1.5.4> Running phase: updateAutotoolsGnuConfigScriptsPhase493pg_graphql-1.5.4> Running phase: configurePhase494pg_graphql-1.5.4> Running phase: buildPhase495pg_graphql-1.5.4> Executing cargo-pgrx buildPhase496pg_graphql-1.5.4>    Validating /nix/store/48l45fvi99n90x6p9i4cs1lmzby6cb73-postgresql-15.19/bin/pg_config497pg_graphql-1.5.4>  Initializing data directory at /build/tmp.mCJIMDbx4j/data-15498pg_graphql-1.5.11>    Compiling cached v0.46.1499pg_graphql-1.5.4> waiting for server to start....2026-10-06 14:09:05.558 GMT [87] LOG:  starting PostgreSQL 15.19 on aarch64-unknown-linux-gnu, compiled by gcc (GCC) 15.2.0, 64-bit500pg_graphql-1.5.4> 2026-10-06 14:09:05.561 GMT [87] LOG:  listening on Unix socket "/build/tmp.RKs5czepr4/.s.PGSQL.5432"501pg_graphql-1.5.4> 2026-10-06 14:09:05.568 GMT [90] LOG:  database system was shut down at 2026-10-06 14:09:05 GMT502pg_graphql-1.5.4> 2026-10-06 14:09:05.576 GMT [87] LOG:  database system is ready to accept connections503pg_graphql-1.5.4>  done504pg_graphql-1.5.4> server started505pg_graphql-1.5.4> createuser: error: connection to server at "localhost" (127.0.0.1), port 5432 failed: Connection refused506pg_graphql-1.5.4> 	Is the server running on that host and accepting TCP/IP connections?507pg_graphql-1.5.4> waiting for server to shut down....2026-10-06 14:09:05.641 GMT [87] LOG:  received fast shutdown request508pg_graphql-1.5.4> 2026-10-06 14:09:05.643 GMT [87] LOG:  aborting any active transactions509pg_graphql-1.5.4> 2026-10-06 14:09:05.645 GMT [87] LOG:  background worker "logical replication launcher" (PID 93) exited with exit code 1510pg_graphql-1.5.4> 2026-10-06 14:09:05.645 GMT [88] LOG:  shutting down511pg_graphql-1.5.4> 2026-10-06 14:09:05.648 GMT [88] LOG:  checkpoint starting: shutdown immediate512pg_graphql-1.5.4> 2026-10-06 14:09:05.661 GMT [88] LOG:  checkpoint complete: wrote 3 buffers (0.0%); 0 WAL file(s) added, 0 removed, 0 recycled; write=0.004 s, sync=0.002 s, total=0.016 s; sync files=2, longest=0.001 s, average=0.001 s; distance=0 kB, estimate=0 kB513pg_graphql-1.5.4> 2026-10-06 14:09:05.665 GMT [87] LOG:  database system is shut down514pg_graphql-1.5.4>  done515pg_graphql-1.5.4> server stopped516pg_graphql-1.5.4> warning: `/build/source/.cargo/config` is deprecated in favor of `config.toml`517pg_graphql-1.5.4> note: if you need to support cargo 1.38 or earlier, you can symlink `config` to `config.toml`518pg_graphql-1.5.11>    Compiling pgrx v0.12.9519pg_graphql-1.5.4>        Using PgConfig("pg15") and `pg_config` from /nix/store/48l45fvi99n90x6p9i4cs1lmzby6cb73-postgresql-15.19/bin/pg_config520pg_graphql-1.5.4>     Building extension with features  pg15521pg_graphql-1.5.4>      Running command "/nix/store/kpxwf6dpminza6mhj8xddnaxx6fgnfy6-rust-default-1.85.1/bin/cargo" "build" "--release" "--features" " pg15" "--no-default-features" "--message-format=json-render-diagnostics" "--frozen" "-j" "2"522pg_graphql-1.5.4> warning: `/build/source/.cargo/config` is deprecated in favor of `config.toml`523pg_graphql-1.5.4> note: if you need to support cargo 1.38 or earlier, you can symlink `config` to `config.toml`524pg_graphql-1.5.4>    Compiling proc-macro2 v1.0.79525pg_graphql-1.5.4>    Compiling unicode-ident v1.0.12526pg_graphql-1.5.4>    Compiling libc v0.2.153527pg_graphql-1.5.4>    Compiling syn v1.0.109528pg_graphql-1.5.11>    Compiling rand v0.8.5529pg_graphql-1.5.4>    Compiling memchr v2.7.2530pg_graphql-1.5.4>    Compiling quote v1.0.36531pg_graphql-1.5.4>    Compiling thiserror v1.0.58532pg_graphql-1.5.4>    Compiling syn v2.0.58533pg_graphql-1.5.4>    Compiling serde v1.0.197534pg_graphql-1.5.11>    Compiling graphql-parser v0.4.1535pg_graphql-1.5.4>    Compiling equivalent v1.0.1536pg_graphql-1.5.4>    Compiling eyre v0.6.12537pg_graphql-1.5.4>    Compiling hashbrown v0.14.3538pg_graphql-1.5.4>    Compiling indexmap v2.2.6539pg_graphql-1.5.11>    Compiling bimap v0.6.3540pg_graphql-1.5.11>    Compiling lazy_static v1.5.0541pg_graphql-1.5.11>    Compiling base64 v0.13.1542pg_graphql-1.5.4>    Compiling serde_derive v1.0.197543pg_graphql-1.5.4>    Compiling thiserror-impl v1.0.58544pg_graphql-1.5.4>    Compiling serde_json v1.0.115545pg_graphql-1.5.4>    Compiling cfg-if v1.0.0546pg_graphql-1.5.4>    Compiling tinyvec_macros v0.1.1547pg_graphql-1.5.4>    Compiling glob v0.3.1548pg_graphql-1.5.4>    Compiling clang-sys v1.7.0549pg_graphql-1.5.4>    Compiling tinyvec v1.6.0550pg_graphql-1.5.4>    Compiling ucd-trie v0.1.6551pg_graphql-1.5.4>    Compiling serde_spanned v0.6.5552pg_graphql-1.5.4>    Compiling toml_datetime v0.6.5553pg_graphql-1.5.4>    Compiling indenter v0.3.3554pg_graphql-1.5.4>    Compiling winnow v0.6.5555pg_graphql-1.5.4>    Compiling once_cell v1.19.0556pg_graphql-1.5.4>    Compiling anyhow v1.0.82557pg_graphql-1.5.4>    Compiling pest v2.7.9558pg_graphql-1.5.4>    Compiling toml_edit v0.22.9559pg_graphql-1.5.4>    Compiling unicode-normalization v0.1.23560pg_graphql-1.5.4>    Compiling minimal-lexical v0.2.1561pg_graphql-1.5.4>    Compiling percent-encoding v2.3.1562pg_graphql-1.5.11>    Compiling pg_graphql v1.5.11 (/build/source)563pg_graphql-1.5.4>    Compiling option-ext v0.2.0564pg_graphql-1.5.4>    Compiling regex-syntax v0.8.3565pg_graphql-1.5.4>    Compiling unicode-bidi v0.3.15566pg_graphql-1.5.4>    Compiling semver v1.0.22567pg_graphql-1.5.4>    Compiling libloading v0.8.3568pg_graphql-1.5.4>    Compiling idna v0.5.0569pg_graphql-1.5.4>    Compiling regex-automata v0.4.6570pg_graphql-1.5.4>    Compiling dirs-sys v0.4.1571pg_graphql-1.5.4>    Compiling toml v0.8.12572pg_graphql-1.5.4>    Compiling form_urlencoded v1.2.1573pg_graphql-1.5.4>    Compiling nom v7.1.3574pg_graphql-1.5.4>    Compiling semver-parser v0.10.2575pg_graphql-1.5.4>    Compiling itoa v1.0.11576pg_graphql-1.5.4>    Compiling bindgen v0.69.4577pg_graphql-1.5.4>    Compiling ryu v1.0.17578pg_graphql-1.5.4>    Compiling either v1.10.0579pg_graphql-1.5.4>    Compiling itertools v0.12.1580pg_graphql-1.5.4>    Compiling pathsearch v0.2.0581pg_graphql-1.5.4>    Compiling cexpr v0.6.0582pg_graphql-1.5.4>    Compiling semver v0.11.0583pg_graphql-1.5.4>    Compiling url v2.5.0584pg_graphql-1.5.4>    Compiling regex v1.10.4585pg_graphql-1.5.4>    Compiling cargo_toml v0.16.3586pg_graphql-1.5.4>    Compiling dirs v5.0.1587pg_graphql-1.5.4>    Compiling getrandom v0.2.14588pg_graphql-1.5.4>    Compiling ident_case v1.0.1589pg_graphql-1.5.4>    Compiling lazy_static v1.4.0590pg_graphql-1.5.4>    Compiling unicode-segmentation v1.11.0591pg_graphql-1.5.4>    Compiling byteorder v1.5.0592pg_graphql-1.5.4>    Compiling fixedbitset v0.4.2593pg_graphql-1.5.4>    Compiling lazycell v1.3.0594pg_graphql-1.5.4>    Compiling same-file v1.0.6595pg_graphql-1.5.4>    Compiling bitflags v2.5.0596pg_graphql-1.5.4>    Compiling strsim v0.10.0597pg_graphql-1.5.4>    Compiling autocfg v1.2.0598pg_graphql-1.5.4>    Compiling owo-colors v3.5.0599pg_graphql-1.5.4>    Compiling fnv v1.0.7600pg_graphql-1.5.4>    Compiling shlex v1.3.0601pg_graphql-1.5.4>    Compiling rustc-hash v1.1.0602pg_graphql-1.5.4>    Compiling darling_core v0.14.4603pg_graphql-1.5.4>    Compiling pgrx-pg-config v0.11.3604pg_graphql-1.5.4>    Compiling memoffset v0.9.1605pg_graphql-1.5.4>    Compiling walkdir v2.5.0606pg_graphql-1.5.4>    Compiling petgraph v0.6.4607pg_graphql-1.5.4>    Compiling convert_case v0.6.0608pg_graphql-1.5.4>    Compiling rustc_version v0.4.0609pg_graphql-1.5.4>    Compiling rustc_version v0.3.3610pg_graphql-1.5.4>    Compiling unescape v0.1.0611pg_graphql-1.5.4>    Compiling radium v0.7.0612pg_graphql-1.5.4>    Compiling pgrx-sql-entity-graph v0.11.3613pg_graphql-1.5.4>    Compiling atomic-traits v0.3.0614pg_graphql-1.5.4>    Compiling heapless v0.7.17615pg_graphql-1.5.4>    Compiling pgrx-pg-sys v0.11.3616pg_graphql-1.5.4>    Compiling darling_macro v0.14.4617pg_graphql-1.5.4>    Compiling void v1.0.2618pg_graphql-1.5.4>    Compiling tap v1.0.1619pg_graphql-1.5.11>     Finished `release` profile [optimized] target(s) in 4m 54s620pg_graphql-1.5.11>   Installing extension621pg_graphql-1.5.11>      Copying control file to /nix/store/w08ahw28ylp1k41li9zx2j9v7bw10sm8-pg_graphql-1.5.11/nix/store/9q4p23a2y63xn8safzzn6lbn07bnkshs-postgresql-17.11/share/postgresql/extension/pg_graphql.control622pg_graphql-1.5.11>      Copying shared library to /nix/store/w08ahw28ylp1k41li9zx2j9v7bw10sm8-pg_graphql-1.5.11/nix/store/07zklik5dwl2sfqym1gwbrrkfby7lrjn-postgresql-17.11-lib/lib/pg_graphql.so623pg_graphql-1.5.11>   Discovered 5 SQL entities: 0 schemas (0 unique), 1 functions, 0 types, 0 enums, 4 sqls, 0 ords, 0 hashes, 0 aggregates, 0 triggers624pg_graphql-1.5.11>   Rebuilding pgrx_embed, in debug mode, for SQL generation with features  pg17625pg_graphql-1.5.11>    Compiling proc-macro2 v1.0.93626pg_graphql-1.5.11>    Compiling unicode-ident v1.0.16627pg_graphql-1.5.11>    Compiling libc v0.2.169628pg_graphql-1.5.11>    Compiling quote v1.0.38629pg_graphql-1.5.11>    Compiling syn v2.0.98630pg_graphql-1.5.11>    Compiling stable_deref_trait v1.2.0631pg_graphql-1.5.11>    Compiling memchr v2.7.4632pg_graphql-1.5.11>    Compiling cfg-if v1.0.0633pg_graphql-1.5.11>    Compiling hashbrown v0.15.2634pg_graphql-1.5.11>    Compiling serde v1.0.217635pg_graphql-1.5.11>    Compiling writeable v0.5.5636pg_graphql-1.5.11>    Compiling equivalent v1.0.1637pg_graphql-1.5.11>    Compiling litemap v0.7.4638pg_graphql-1.5.11>    Compiling indexmap v2.7.1639pg_graphql-1.5.4>    Compiling wyz v0.5.1640pg_graphql-1.5.4>    Compiling unreachable v1.0.0641pg_graphql-1.5.4>    Compiling darling v0.14.4642pg_graphql-1.5.11>    Compiling thiserror v1.0.69643pg_graphql-1.5.11>    Compiling icu_locid_transform_data v1.5.0644pg_graphql-1.5.11>    Compiling eyre v0.6.12645pg_graphql-1.5.11>    Compiling once_cell v1.20.2646pg_graphql-1.5.11>    Compiling icu_properties_data v1.5.0647pg_graphql-1.5.11>    Compiling smallvec v1.13.2648pg_graphql-1.5.11>    Compiling utf8_iter v1.0.4649pg_graphql-1.5.11>    Compiling utf16_iter v1.0.5650pg_graphql-1.5.11>    Compiling glob v0.3.2651pg_graphql-1.5.11>    Compiling thiserror v2.0.11652pg_graphql-1.5.11>    Compiling synstructure v0.13.1653pg_graphql-1.5.11>    Compiling write16 v1.0.0654pg_graphql-1.5.11>    Compiling icu_normalizer_data v1.5.0655pg_graphql-1.5.11>    Compiling indenter v0.3.3656pg_graphql-1.5.11>    Compiling shlex v1.3.0657pg_graphql-1.5.11>    Compiling clang-sys v1.8.1658pg_graphql-1.5.11>    Compiling winnow v0.7.0659pg_graphql-1.5.11>    Compiling zerofrom-derive v0.1.5660pg_graphql-1.5.11>    Compiling yoke-derive v0.7.5661pg_graphql-1.5.4>    Compiling pgrx-macros v0.11.3662pg_graphql-1.5.11>    Compiling zerofrom v0.1.5663pg_graphql-1.5.11>    Compiling serde_derive v1.0.217664pg_graphql-1.5.11>    Compiling yoke v0.7.5665pg_graphql-1.5.11>    Compiling zerovec-derive v0.10.3666pg_graphql-1.5.4>    Compiling hash32 v0.2.1667pg_graphql-1.5.4>    Compiling rand_core v0.6.4668pg_graphql-1.5.4>    Compiling enum-map-derive v0.17.0669pg_graphql-1.5.11>    Compiling zerovec v0.10.4670pg_graphql-1.5.4>    Compiling ppv-lite86 v0.2.17671pg_graphql-1.5.4>    Compiling sptr v0.3.2672pg_graphql-1.5.4>    Compiling funty v2.0.0673pg_graphql-1.5.11>    Compiling displaydoc v0.2.5674pg_graphql-1.5.4>    Compiling half v1.8.3675pg_graphql-1.5.4>    Compiling stable_deref_trait v1.2.0676pg_graphql-1.5.4>    Compiling ascii v0.9.3677pg_graphql-1.5.11>    Compiling icu_provider_macros v1.5.0678pg_graphql-1.5.11>    Compiling tinystr v0.7.6679pg_graphql-1.5.11>    Compiling icu_locid v1.5.0680pg_graphql-1.5.4>    Compiling combine v3.8.1681pg_graphql-1.5.4>    Compiling serde_cbor v0.11.2682pg_graphql-1.5.11>    Compiling icu_provider v1.5.0683pg_graphql-1.5.4>    Compiling bitvec v1.0.1684pg_graphql-1.5.11>    Compiling thiserror-impl v1.0.69685pg_graphql-1.5.11>    Compiling icu_locid_transform v1.5.0686pg_graphql-1.5.11>    Compiling icu_collections v1.5.0687pg_graphql-1.5.11>    Compiling icu_properties v1.5.1688pg_graphql-1.5.11>    Compiling toml_datetime v0.6.8689pg_graphql-1.5.11>    Compiling serde_spanned v0.6.8690pg_graphql-1.5.11>    Compiling thiserror-impl v2.0.11691pg_graphql-1.5.11>    Compiling icu_normalizer v1.5.0692pg_graphql-1.5.11>    Compiling serde_json v1.0.138693pg_graphql-1.5.11>    Compiling anyhow v1.0.95694pg_graphql-1.5.4>    Compiling rand_chacha v0.3.1695pg_graphql-1.5.11>    Compiling is_ci v1.2.0696pg_graphql-1.5.11>    Compiling idna_adapter v1.2.0697pg_graphql-1.5.11>    Compiling toml_edit v0.22.23698pg_graphql-1.5.11>    Compiling cc v1.2.11699pg_graphql-1.5.4>    Compiling enum-map v2.7.3700pg_graphql-1.5.4>    Compiling cached_proc_macro v0.18.1701pg_graphql-1.5.11>    Compiling is-terminal v0.4.15702pg_graphql-1.5.11>    Compiling owo-colors v4.1.0703pg_graphql-1.5.11>    Compiling percent-encoding v2.3.1704pg_graphql-1.5.4>    Compiling uuid v1.8.0705pg_graphql-1.5.11>    Compiling ryu v1.0.19706pg_graphql-1.5.11>    Compiling ucd-trie v0.1.7707pg_graphql-1.5.4>    Compiling instant v0.1.12708pg_graphql-1.5.4>    Compiling seahash v4.1.0709pg_graphql-1.5.11>    Compiling minimal-lexical v0.2.1710pg_graphql-1.5.4>    Compiling cached_proc_macro_types v0.1.1711pg_graphql-1.5.4>    Compiling seq-macro v0.3.5712pg_graphql-1.5.11>    Compiling regex-syntax v0.8.5713pg_graphql-1.5.4>    Compiling cached v0.46.1714pg_graphql-1.5.4>    Compiling rand v0.8.5715pg_graphql-1.5.11>    Compiling itoa v1.0.14716pg_graphql-1.5.11>    Compiling nom v7.1.3717pg_graphql-1.5.4>    Compiling graphql-parser v0.4.0718pg_graphql-1.5.11>    Compiling regex-automata v0.4.9719pg_graphql-1.5.11>    Compiling pest v2.7.15720pg_graphql-1.5.11>    Compiling toml v0.8.19721pg_graphql-1.5.4>    Compiling itertools v0.10.5722pg_graphql-1.5.11>    Compiling form_urlencoded v1.2.1723pg_graphql-1.5.11>    Compiling supports-color v2.1.0724pg_graphql-1.5.11>    Compiling idna v1.0.3725pg_graphql-1.5.11>    Compiling supports-color v3.0.2726pg_graphql-1.5.11>    Compiling libloading v0.8.6727pg_graphql-1.5.11>    Compiling bindgen v0.70.1728pg_graphql-1.5.11>    Compiling either v1.13.0729pg_graphql-1.5.11>    Compiling byteorder v1.5.0730pg_graphql-1.5.11>    Compiling yansi-term v0.1.2731pg_graphql-1.5.11>    Compiling unicode-width v0.1.14732pg_graphql-1.5.11>    Compiling syn v1.0.109733pg_graphql-1.5.11>    Compiling annotate-snippets v0.9.2734pg_graphql-1.5.4>    Compiling bimap v0.6.3735pg_graphql-1.5.11>    Compiling itertools v0.13.0736pg_graphql-1.5.4>    Compiling base64 v0.13.1737pg_graphql-1.5.4>    Compiling pgrx v0.11.3738pg_graphql-1.5.11>    Compiling url v2.5.4739pg_graphql-1.5.11>    Compiling pathsearch v0.2.0740pg_graphql-1.5.11>    Compiling cargo_toml v0.19.2741pg_graphql-1.5.11>    Compiling semver-parser v0.10.3742pg_graphql-1.5.11>    Compiling regex v1.11.1743pg_graphql-1.5.11>    Compiling cexpr v0.6.0744pg_graphql-1.5.11>    Compiling fixedbitset v0.4.2745pg_graphql-1.5.11>    Compiling bitflags v2.8.0746pg_graphql-1.5.11>    Compiling rustc-hash v1.1.0747pg_graphql-1.5.11>    Compiling same-file v1.0.6748pg_graphql-1.5.11>    Compiling unicode-segmentation v1.12.0749pg_graphql-1.5.11>    Compiling home v0.5.11750pg_graphql-1.5.11>    Compiling pgrx-pg-config v0.12.9751pg_graphql-1.5.11>    Compiling convert_case v0.6.0752pg_graphql-1.5.11>    Compiling walkdir v2.5.0753pg_graphql-1.5.11>    Compiling petgraph v0.6.5754pg_graphql-1.5.11>    Compiling semver v0.11.0755pg_graphql-1.5.11>    Compiling getrandom v0.2.15756pg_graphql-1.5.11>    Compiling ident_case v1.0.1757pg_graphql-1.5.11>    Compiling strsim v0.10.0758pg_graphql-1.5.11>    Compiling fnv v1.0.7759pg_graphql-1.5.11>    Compiling unescape v0.1.0760pg_graphql-1.5.11>    Compiling pgrx-bindgen v0.12.9761pg_graphql-1.5.11>    Compiling rustc_version v0.3.3762pg_graphql-1.5.11>    Compiling darling_core v0.14.4763pg_graphql-1.5.11>    Compiling cee-scape v0.2.0764pg_graphql-1.5.11>    Compiling zerocopy-derive v0.7.35765pg_graphql-1.5.11>    Compiling radium v0.7.0766pg_graphql-1.5.11>    Compiling darling_macro v0.14.4767pg_graphql-1.5.11>    Compiling zerocopy v0.7.35768pg_graphql-1.5.11>    Compiling atomic-traits v0.3.0769pg_graphql-1.5.11>    Compiling pgrx-pg-sys v0.12.9770pg_graphql-1.5.11>    Compiling pgrx-sql-entity-graph v0.12.9771pg_graphql-1.5.11>    Compiling heapless v0.8.0772pg_graphql-1.5.11>    Compiling tap v1.0.1773pg_graphql-1.5.11>    Compiling wyz v0.5.1774pg_graphql-1.5.11>    Compiling pgrx-macros v0.12.9775pg_graphql-1.5.11>    Compiling ppv-lite86 v0.2.20776pg_graphql-1.5.11>    Compiling darling v0.14.4777pg_graphql-1.5.11>    Compiling rand_core v0.6.4778pg_graphql-1.5.11>    Compiling hash32 v0.3.1779pg_graphql-1.5.11>    Compiling enum-map-derive v0.17.0780pg_graphql-1.5.11>    Compiling sptr v0.3.2781pg_graphql-1.5.11>    Compiling bytes v1.10.0782pg_graphql-1.5.11>    Compiling funty v2.0.0783pg_graphql-1.5.11>    Compiling half v1.8.3784pg_graphql-1.5.11>    Compiling serde_cbor v0.11.2785pg_graphql-1.5.11>    Compiling bitvec v1.0.1786pg_graphql-1.5.11>    Compiling combine v4.6.7787pg_graphql-1.5.11>    Compiling enum-map v2.7.3788pg_graphql-1.5.11>    Compiling rand_chacha v0.3.1789pg_graphql-1.5.11>    Compiling cached_proc_macro v0.18.1790pg_graphql-1.5.11>    Compiling uuid v1.12.1791pg_graphql-1.5.11>    Compiling instant v0.1.13792pg_graphql-1.5.11>    Compiling cached_proc_macro_types v0.1.1793pg_graphql-1.5.11>    Compiling hashbrown v0.14.5794pg_graphql-1.5.11>    Compiling seahash v4.1.0795pg_graphql-1.5.11>    Compiling cached v0.46.1796pg_graphql-1.5.11>    Compiling itertools v0.10.5797pg_graphql-1.5.11>    Compiling rand v0.8.5798pg_graphql-1.5.11>    Compiling graphql-parser v0.4.1799pg_graphql-1.5.11>    Compiling pgrx v0.12.9800pg_graphql-1.5.11>    Compiling bimap v0.6.3801pg_graphql-1.5.11>    Compiling lazy_static v1.5.0802pg_graphql-1.5.11>    Compiling base64 v0.13.1803pg_graphql-1.5.11>    Compiling pg_graphql v1.5.11 (/build/source)804pg_graphql-1.5.11>     Finished `dev` profile [unoptimized + debuginfo] target(s) in 3m 28s805pg_graphql-1.5.11>      Writing SQL entities to /nix/store/w08ahw28ylp1k41li9zx2j9v7bw10sm8-pg_graphql-1.5.11/nix/store/9q4p23a2y63xn8safzzn6lbn07bnkshs-postgresql-17.11/share/postgresql/extension/pg_graphql--1.5.11.sql806pg_graphql-1.5.11>     Finished installing pg_graphql807pg_graphql-1.5.11> buildPhase completed in 8 minutes 25 seconds808pg_graphql-1.5.11> Running phase: checkPhase809pg_graphql-1.5.11>    Validating /nix/store/9q4p23a2y63xn8safzzn6lbn07bnkshs-postgresql-17.11/bin/pg_config810pg_graphql-1.5.11>  Initializing data directory at /build/tmp.QIf17Lo6ts/data-17811pg_graphql-1.5.11> waiting for server to start....2026-10-06 14:14:17.236 GMT [4925] LOG:  starting PostgreSQL 17.11 on aarch64-unknown-linux-gnu, compiled by gcc (GCC) 15.2.0, 64-bit812pg_graphql-1.5.11> 2026-10-06 14:14:17.239 GMT [4925] LOG:  listening on Unix socket "/build/tmp.Yw87o1c3Ca/.s.PGSQL.5432"813pg_graphql-1.5.11> 2026-10-06 14:14:17.247 GMT [4928] LOG:  database system was shut down at 2026-10-06 14:14:16 GMT814pg_graphql-1.5.11> 2026-10-06 14:14:17.254 GMT [4925] LOG:  database system is ready to accept connections815pg_graphql-1.5.11>  done816pg_graphql-1.5.11> server started817pg_graphql-1.5.11> createuser: error: connection to server at "localhost" (127.0.0.1), port 5432 failed: Connection refused818pg_graphql-1.5.11> 	Is the server running on that host and accepting TCP/IP connections?819pg_graphql-1.5.11> waiting for server to shut down....2026-10-06 14:14:17.318 GMT [4925] LOG:  received fast shutdown request820pg_graphql-1.5.11> 2026-10-06 14:14:17.324 GMT [4925] LOG:  aborting any active transactions821pg_graphql-1.5.11> 2026-10-06 14:14:17.326 GMT [4925] LOG:  background worker "logical replication launcher" (PID 4931) exited with exit code 1822pg_graphql-1.5.11> 2026-10-06 14:14:17.326 GMT [4926] LOG:  shutting down823pg_graphql-1.5.11> 2026-10-06 14:14:17.330 GMT [4926] LOG:  checkpoint starting: shutdown immediate824pg_graphql-1.5.11> 2026-10-06 14:14:17.354 GMT [4926] LOG:  checkpoint complete: wrote 3 buffers (0.0%); 0 WAL file(s) added, 0 removed, 0 recycled; write=0.009 s, sync=0.003 s, total=0.028 s; sync files=2, longest=0.002 s, average=0.002 s; distance=0 kB, estimate=0 kB; lsn=0/14EC338, redo lsn=0/14EC338825pg_graphql-1.5.11> 2026-10-06 14:14:17.359 GMT [4925] LOG:  database system is shut down826pg_graphql-1.5.11>  done827pg_graphql-1.5.11> server stopped828pg_graphql-1.5.11>    Validating /build/tmp.0oyG7eYzwI/17/bin/pg_config829pg_graphql-1.5.11>  Initializing data directory at /build/tmp.0oyG7eYzwI/data-17830pg_graphql-1.5.11>        Using PgConfig("pg17") and `pg_config` from /build/tmp.0oyG7eYzwI/17/bin/pg_config831pg_graphql-1.5.11>     Building extension with features pg17832pg_graphql-1.5.11>      Running command "/nix/store/hxlcfmjxs6akpyya3k1d4qk1ghbw11ij-rust-default-1.81.0/bin/cargo" "build" "--lib" "--release" "--features" "pg17" "--no-default-features" "--message-format=json-render-diagnostics" "--frozen" "-j" "2"833pg_graphql-1.5.11>     Finished `release` profile [optimized] target(s) in 0.15s834pg_graphql-1.5.11>   Installing extension835pg_graphql-1.5.11>      Copying control file to /build/tmp.0oyG7eYzwI/17/share/postgresql/extension/pg_graphql.control836pg_graphql-1.5.11>      Copying shared library to /build/tmp.0oyG7eYzwI/17/lib/pg_graphql.so837pg_graphql-1.5.11>   Discovered 5 SQL entities: 0 schemas (0 unique), 1 functions, 0 types, 0 enums, 4 sqls, 0 ords, 0 hashes, 0 aggregates, 0 triggers838pg_graphql-1.5.11>   Rebuilding pgrx_embed, in debug mode, for SQL generation with features pg17839pg_graphql-1.5.11>    Compiling pg_graphql v1.5.11 (/build/source)840pg_graphql-1.5.4>    Compiling pg_graphql v1.5.4 (/build/source)841pg_graphql-1.5.4> warning: unexpected `cfg` condition value: `pg11`842pg_graphql-1.5.4>   --> src/lib.rs:18:1843pg_graphql-1.5.4>    |844pg_graphql-1.5.4> 18 | pg_module_magic!();845pg_graphql-1.5.4>    | ^^^^^^^^^^^^^^^^^^846pg_graphql-1.5.4>    |847pg_graphql-1.5.4>    = note: expected values for `feature` are: `default`, `pg14`, `pg15`, `pg16`, and `pg_test`848pg_graphql-1.5.4>    = note: using a cfg inside a macro will use the cfgs from the destination crate and not the ones from the defining crate849pg_graphql-1.5.4>    = help: try referring to `$crate::pg_magic_func` crate for guidance on how handle this unexpected cfg850pg_graphql-1.5.4>    = help: the macro `$crate::pg_magic_func` may come from an old version of the `pgrx` crate, try updating your dependency with `cargo update -p pgrx`851pg_graphql-1.5.4>    = note: see <https://doc.rust-lang.org/nightly/rustc/check-cfg/cargo-specifics.html> for more information about checking conditional configuration852pg_graphql-1.5.4>    = note: `#[warn(unexpected_cfgs)]` on by default853pg_graphql-1.5.4>    = note: this warning originates in the macro `$crate::pg_magic_func` which comes from the expansion of the macro `pg_module_magic` (in Nightly builds, run with -Z macro-backtrace for more info)854pg_graphql-1.5.4> 855pg_graphql-1.5.4> warning: unexpected `cfg` condition value: `pg12`856pg_graphql-1.5.4>   --> src/lib.rs:18:1857pg_graphql-1.5.4>    |858pg_graphql-1.5.4> 18 | pg_module_magic!();859pg_graphql-1.5.4>    | ^^^^^^^^^^^^^^^^^^860pg_graphql-1.5.4>    |861pg_graphql-1.5.4>    = note: expected values for `feature` are: `default`, `pg14`, `pg15`, `pg16`, and `pg_test`862pg_graphql-1.5.4>    = note: using a cfg inside a macro will use the cfgs from the destination crate and not the ones from the defining crate863pg_graphql-1.5.4>    = help: try referring to `$crate::pg_magic_func` crate for guidance on how handle this unexpected cfg864pg_graphql-1.5.4>    = help: the macro `$crate::pg_magic_func` may come from an old version of the `pgrx` crate, try updating your dependency with `cargo update -p pgrx`865pg_graphql-1.5.4>    = note: see <https://doc.rust-lang.org/nightly/rustc/check-cfg/cargo-specifics.html> for more information about checking conditional configuration866pg_graphql-1.5.4>    = note: this warning originates in the macro `$crate::pg_magic_func` which comes from the expansion of the macro `pg_module_magic` (in Nightly builds, run with -Z macro-backtrace for more info)867pg_graphql-1.5.4> 868pg_graphql-1.5.4> warning: unexpected `cfg` condition value: `pg13`869pg_graphql-1.5.4>   --> src/lib.rs:18:1870pg_graphql-1.5.4>    |871pg_graphql-1.5.4> 18 | pg_module_magic!();872pg_graphql-1.5.4>    | ^^^^^^^^^^^^^^^^^^873pg_graphql-1.5.4>    |874pg_graphql-1.5.4>    = note: expected values for `feature` are: `default`, `pg14`, `pg15`, `pg16`, and `pg_test`875pg_graphql-1.5.4>    = note: using a cfg inside a macro will use the cfgs from the destination crate and not the ones from the defining crate876pg_graphql-1.5.4>    = help: try referring to `$crate::pg_magic_func` crate for guidance on how handle this unexpected cfg877pg_graphql-1.5.4>    = help: the macro `$crate::pg_magic_func` may come from an old version of the `pgrx` crate, try updating your dependency with `cargo update -p pgrx`878pg_graphql-1.5.4>    = note: see <https://doc.rust-lang.org/nightly/rustc/check-cfg/cargo-specifics.html> for more information about checking conditional configuration879pg_graphql-1.5.4>    = note: this warning originates in the macro `$crate::pg_magic_func` which comes from the expansion of the macro `pg_module_magic` (in Nightly builds, run with -Z macro-backtrace for more info)880pg_graphql-1.5.4> 881pg_graphql-1.5.4> warning: field `alias` is never read882pg_graphql-1.5.4>   --> src/builder.rs:15:9883pg_graphql-1.5.4>    |884pg_graphql-1.5.4> 14 | pub struct InsertBuilder {885pg_graphql-1.5.4>    |            ------------- field in this struct886pg_graphql-1.5.4> 15 |     pub alias: String,887pg_graphql-1.5.4>    |         ^^^^^888pg_graphql-1.5.4>    |889pg_graphql-1.5.4>    = note: `InsertBuilder` has derived impls for the traits `Debug` and `Clone`, but these are intentionally ignored during dead code analysis890pg_graphql-1.5.4>    = note: `#[warn(dead_code)]` on by default891pg_graphql-1.5.4> 892pg_graphql-1.5.4> warning: field `alias` is never read893pg_graphql-1.5.4>    --> src/builder.rs:338:9894pg_graphql-1.5.4>     |895pg_graphql-1.5.4> 337 | pub struct UpdateBuilder {896pg_graphql-1.5.4>     |            ------------- field in this struct897pg_graphql-1.5.4> 338 |     pub alias: String,898pg_graphql-1.5.4>     |         ^^^^^899pg_graphql-1.5.4>     |900pg_graphql-1.5.4>     = note: `UpdateBuilder` has derived impls for the traits `Debug` and `Clone`, but these are intentionally ignored during dead code analysis901pg_graphql-1.5.4> 902pg_graphql-1.5.4> warning: field `alias` is never read903pg_graphql-1.5.4>    --> src/builder.rs:510:9904pg_graphql-1.5.4>     |905pg_graphql-1.5.4> 509 | pub struct DeleteBuilder {906pg_graphql-1.5.4>     |            ------------- field in this struct907pg_graphql-1.5.4> 510 |     pub alias: String,908pg_graphql-1.5.4>     |         ^^^^^909pg_graphql-1.5.4>     |910pg_graphql-1.5.4>     = note: `DeleteBuilder` has derived impls for the traits `Debug` and `Clone`, but these are intentionally ignored during dead code analysis911pg_graphql-1.5.4> 912pg_graphql-1.5.4> warning: field `alias` is never read913pg_graphql-1.5.4>    --> src/builder.rs:612:9914pg_graphql-1.5.4>     |915pg_graphql-1.5.4> 611 | pub struct FunctionCallBuilder {916pg_graphql-1.5.4>     |            ------------------- field in this struct917pg_graphql-1.5.4> 612 |     pub alias: String,918pg_graphql-1.5.4>     |         ^^^^^919pg_graphql-1.5.4> 920pg_graphql-1.5.4> warning: field `schema` is never read921pg_graphql-1.5.4>     --> src/builder.rs:1980:9922pg_graphql-1.5.4>      |923pg_graphql-1.5.4> 1979 | pub struct __SchemaBuilder {924pg_graphql-1.5.4>      |            --------------- field in this struct925pg_graphql-1.5.4> 1980 |     pub schema: __Schema,926pg_graphql-1.5.4>      |         ^^^^^^927pg_graphql-1.5.4>      |928pg_graphql-1.5.4>      = note: `__SchemaBuilder` has a derived impl for the trait `Clone`, but this is intentionally ignored during dead code analysis929pg_graphql-1.5.4> 930pg_graphql-1.5.4> warning: method `arg_map` is never used931pg_graphql-1.5.4>    --> src/graphql.rs:349:8932pg_graphql-1.5.4>     |933pg_graphql-1.5.4> 325 | pub trait ___Field {934pg_graphql-1.5.4>     |           -------- method in this trait935pg_graphql-1.5.4> ...936pg_graphql-1.5.4> 349 |     fn arg_map(&self) -> HashMap<String, __InputValue> {937pg_graphql-1.5.4>     |        ^^^^^^^938pg_graphql-1.5.4> 939pg_graphql-1.5.11>     Finished `dev` profile [unoptimized + debuginfo] target(s) in 23.24s940pg_graphql-1.5.11>      Writing SQL entities to /build/tmp.0oyG7eYzwI/17/share/postgresql/extension/pg_graphql--1.5.11.sql941pg_graphql-1.5.11>     Finished installing pg_graphql942pg_graphql-1.5.11> ++ mktemp -d943pg_graphql-1.5.11> + TMPDIR=/build/tmp.BUZGYQQCay944pg_graphql-1.5.11> + export PGDATA=/build/tmp.BUZGYQQCay945pg_graphql-1.5.11> + PGDATA=/build/tmp.BUZGYQQCay946pg_graphql-1.5.11> + export PGHOST=/build/tmp.BUZGYQQCay947pg_graphql-1.5.11> + PGHOST=/build/tmp.BUZGYQQCay948pg_graphql-1.5.11> + export PGUSER=postgres949pg_graphql-1.5.11> + PGUSER=postgres950pg_graphql-1.5.11> + export PGDATABASE=postgres951pg_graphql-1.5.11> + PGDATABASE=postgres952pg_graphql-1.5.11> + export PGTZ=UTC953pg_graphql-1.5.11> + PGTZ=UTC954pg_graphql-1.5.11> + export PG_COLOR=auto955pg_graphql-1.5.11> + PG_COLOR=auto956pg_graphql-1.5.11> + trap 'pg_ctl stop -m i' sigint sigterm exit957pg_graphql-1.5.11> + rm -rf /build/tmp.BUZGYQQCay958pg_graphql-1.5.11> + initdb --no-locale --encoding=UTF8 --nosync -U postgres959pg_graphql-1.5.11> The files belonging to this database system will be owned by user "nixbld".960pg_graphql-1.5.11> This user must also own the server process.961pg_graphql-1.5.11> 962pg_graphql-1.5.11> The database cluster will be initialized with locale "C".963pg_graphql-1.5.11> The default text search configuration will be set to "english".964pg_graphql-1.5.11> 965pg_graphql-1.5.11> Data page checksums are disabled.966pg_graphql-1.5.11> 967pg_graphql-1.5.11> creating directory /build/tmp.BUZGYQQCay ... ok968pg_graphql-1.5.11> creating subdirectories ... ok969pg_graphql-1.5.11> selecting dynamic shared memory implementation ... posix970pg_graphql-1.5.11> selecting default "max_connections" ... 100971pg_graphql-1.5.11> selecting default "shared_buffers" ... 128MB972pg_graphql-1.5.11> selecting default time zone ... UTC973pg_graphql-1.5.11> creating configuration files ... ok974pg_graphql-1.5.11> running bootstrap script ... ok975pg_graphql-1.5.11> performing post-bootstrap initialization ... ok976pg_graphql-1.5.11> 977pg_graphql-1.5.11> Sync to disk skipped.978pg_graphql-1.5.11> The data directory might become corrupt if the operating system crashes.979pg_graphql-1.5.11> 980pg_graphql-1.5.11> initdb: warning: enabling "trust" authentication for local connections981pg_graphql-1.5.11> initdb: hint: You can change this by editing pg_hba.conf or using the option -A, or --auth-local and --auth-host, the next time you run initdb.982pg_graphql-1.5.11> 983pg_graphql-1.5.11> Success. You can now start the database server using:984pg_graphql-1.5.11> 985pg_graphql-1.5.11>     /build/tmp.0oyG7eYzwI/17/bin/pg_ctl -D /build/tmp.BUZGYQQCay -l logfile start986pg_graphql-1.5.11> 987pg_graphql-1.5.11> + pg_ctl start -o '-F -c listen_addresses="" -c log_min_messages=WARNING -k /build/tmp.BUZGYQQCay'988pg_graphql-1.5.11> waiting for server to start....2026-10-06 14:14:42.900 UTC [5202] LOG:  starting PostgreSQL 17.11 on aarch64-unknown-linux-gnu, compiled by gcc (GCC) 15.2.0, 64-bit989pg_graphql-1.5.11> 2026-10-06 14:14:42.900 UTC [5202] LOG:  listening on Unix socket "/build/tmp.BUZGYQQCay/.s.PGSQL.5432"990pg_graphql-1.5.11> 2026-10-06 14:14:42.902 UTC [5205] LOG:  database system was shut down at 2026-10-06 14:14:42 UTC991pg_graphql-1.5.11> 2026-10-06 14:14:42.907 UTC [5202] LOG:  database system is ready to accept connections992pg_graphql-1.5.11>  done993pg_graphql-1.5.11> server started994pg_graphql-1.5.11> + createdb contrib_regression995pg_graphql-1.5.11> + TESTDIR=test996pg_graphql-1.5.11> +++ pg_config --pgxs997pg_graphql-1.5.11> ++ dirname /nix/store/9q4p23a2y63xn8safzzn6lbn07bnkshs-postgresql-17.11/lib/pgxs/src/makefiles/pgxs.mk998pg_graphql-1.5.11> + PGXS=/nix/store/9q4p23a2y63xn8safzzn6lbn07bnkshs-postgresql-17.11/lib/pgxs/src/makefiles999pg_graphql-1.5.11> + REGRESS=/nix/store/9q4p23a2y63xn8safzzn6lbn07bnkshs-postgresql-17.11/lib/pgxs/src/makefiles/../test/regress/pg_regress1000pg_graphql-1.5.11> + '[' 0 -ne 0 ']'1001pg_graphql-1.5.11> ++ ls test/sql1002pg_graphql-1.5.11> ++ sed -e 's/\..*$//'1003pg_graphql-1.5.11> ++ sort1004pg_graphql-1.5.11> + TESTS=$'aliases\nallow_camel_names\narray_args_and_return_types\nbigint_is_string\nbuiltin_directives\ncomment_directive\ncomment_directive_description\ncompound_filters\nempty_mutations\nenum_mappings\nextend_type_with_function\nextend_type_with_function_relation\nextend_type_with_generated_column\nfilter_by_node_id\nfragment_on_mutation\nfragment_on_query\nfunction_calls\nfunction_calls_default_args\nfunction_calls_unsupported\nfunction_return_row_is_selectable\nfunction_return_view_has_pkey\ninflection_fields\ninflection_function\ninflection_relationships\ninflection_types\nissue_163\nissue_170\nissue_225\nissue_237_field_merging\nissue_237_field_merging_mismatched\nissue_300\nissue_306\nissue_312\nissue_334_ambiguous_function\nissue_337\nissue_339_function_return_json\nissue_339_function_return_table\nissue_353_too_many_fields\nissue_370_citext_as_string\nissue_373\nissue_377_enum_search_path\nissue_409_fkey_rls_nullability\nissue_444\nissue_463\nissue_511\nissue_533\nissue_542_partial_unique\nissue_551_too_many_fields\nissue_557_1_to_1_nullability\nissue_fragment_spread_cycles\njson_is_stringified\nmax_page_size\nmax_rows_directive\nmulti_column_primary_key\nmultiple_mutations\nmultiple_queries\nmutation_delete\nmutation_delete_variable\nmutation_insert\nmutation_update\nnull_argument\nomit_exotic_types\nomit_weird_names\noperation_name\noverride_enum_name\noverride_field_name\noverride_func_field_name\noverride_relationship_field_name\noverride_type_name\npage_info\npermissions_connection_column\npermissions_functions\npermissions_node_column\npermissions_table_level\npermissions_types\nprimary_key_is_required\nrelationship_one_to_one\nresolve___schema\nresolve___type\nresolve___typename\nresolve_array_type\nresolve_connection_filter\nresolve_connection_named\nresolve_connection_order_by\nresolve_connection_pagination_args\nresolve_connection_to_conn\nresolve_connection_to_node\nresolve_error_connection_edge_no_field\nresolve_error_connection_edge_node_no_field\nresolve_error_connection_no_field\nresolve_error_from_parser\nresolve_error_mutation_no_field\nresolve_error_node_no_field\nresolve_error_query_no_field\nresolve_fragment\nresolve_graphiql_schema\nresolve_one\nroundtrip_types\nrow_level_security\nsqli_connection\nstring_filters\ntest_error_anon_and_named_operations\ntest_error_invalid_offset\ntest_error_multiple_anon_operations\ntest_error_mutation_transpilation\ntest_error_operation_name_not_found\ntest_error_operation_names_not_unique\ntest_error_query_transpilation\ntest_error_subscription\ntest_query__type\ntotal_count\ntype_bigfloat\ntype_modifier_max_length\ntype_opaque\nvariable_default\nviews_integration'1005pg_graphql-1.5.11> + psql -v ON_ERROR_STOP=1 -f test/fixtures.sql -d contrib_regression1006pg_graphql-1.5.11> psql:test/fixtures.sql:1: NOTICE:  extension "pg_graphql" does not exist, skipping1007pg_graphql-1.5.11> DROP EXTENSION1008pg_graphql-1.5.11> CREATE EXTENSION1009pg_graphql-1.5.11> COMMENT1010pg_graphql-1.5.11> CREATE FUNCTION1011pg_graphql-1.5.11> + /nix/store/9q4p23a2y63xn8safzzn6lbn07bnkshs-postgresql-17.11/lib/pgxs/src/makefiles/../test/regress/pg_regress --use-existing --dbname=contrib_regression --inputdir=test aliases allow_camel_names array_args_and_return_types bigint_is_string builtin_directives comment_directive comment_directive_description compound_filters empty_mutations enum_mappings extend_type_with_function extend_type_with_function_relation extend_type_with_generated_column filter_by_node_id fragment_on_mutation fragment_on_query function_calls function_calls_default_args function_calls_unsupported function_return_row_is_selectable function_return_view_has_pkey inflection_fields inflection_function inflection_relationships inflection_types issue_163 issue_170 issue_225 issue_237_field_merging issue_237_field_merging_mismatched issue_300 issue_306 issue_312 issue_334_ambiguous_function issue_337 issue_339_function_return_json issue_339_function_return_table issue_353_too_many_fields issue_370_citext_as_string issue_373 issue_377_enum_search_path issue_409_fkey_rls_nullability issue_444 issue_463 issue_511 issue_533 issue_542_partial_unique issue_551_too_many_fields issue_557_1_to_1_nullability issue_fragment_spread_cycles json_is_stringified max_page_size max_rows_directive multi_column_primary_key multiple_mutations multiple_queries mutation_delete mutation_delete_variable mutation_insert mutation_update null_argument omit_exotic_types omit_weird_names operation_name override_enum_name override_field_name override_func_field_name override_relationship_field_name override_type_name page_info permissions_connection_column permissions_functions permissions_node_column permissions_table_level permissions_types primary_key_is_required relationship_one_to_one resolve___schema resolve___type resolve___typename resolve_array_type resolve_connection_filter resolve_connection_named resolve_connection_order_by resolve_connection_pagination_args resolve_connection_to_conn resolve_connection_to_node resolve_error_connection_edge_no_field resolve_error_connection_edge_node_no_field resolve_error_connection_no_field resolve_error_from_parser resolve_error_mutation_no_field resolve_error_node_no_field resolve_error_query_no_field resolve_fragment resolve_graphiql_schema resolve_one roundtrip_types row_level_security sqli_connection string_filters test_error_anon_and_named_operations test_error_invalid_offset test_error_multiple_anon_operations test_error_mutation_transpilation test_error_operation_name_not_found test_error_operation_names_not_unique test_error_query_transpilation test_error_subscription test_query__type total_count type_bigfloat type_modifier_max_length type_opaque variable_default views_integration1012pg_graphql-1.5.11> # using postmaster on /build/tmp.BUZGYQQCay, default port1013pg_graphql-1.5.11> ok 1         - aliases                                    55 ms1014pg_graphql-1.5.11> ok 2         - allow_camel_names                          54 ms1015pg_graphql-1.5.11> ok 3         - array_args_and_return_types              1559 ms1016pg_graphql-1.5.11> ok 4         - bigint_is_string                           52 ms1017pg_graphql-1.5.11> ok 5         - builtin_directives                         59 ms1018pg_graphql-1.5.11> ok 6         - comment_directive                          10 ms1019pg_graphql-1.5.11> ok 7         - comment_directive_description              47 ms1020pg_graphql-1.5.11> ok 8         - compound_filters                          252 ms1021pg_graphql-1.5.11> ok 9         - empty_mutations                            51 ms1022pg_graphql-1.5.11> ok 10        - enum_mappings                              54 ms1023pg_graphql-1.5.11> ok 11        - extend_type_with_function                  51 ms1024pg_graphql-1.5.11> ok 12        - extend_type_with_function_relation        144 ms1025pg_graphql-1.5.11> ok 13        - extend_type_with_generated_column          54 ms1026pg_graphql-1.5.11> ok 14        - filter_by_node_id                          53 ms1027pg_graphql-1.5.11> ok 15        - fragment_on_mutation                       47 ms1028pg_graphql-1.5.11> ok 16        - fragment_on_query                          47 ms1029pg_graphql-1.5.11> ok 17        - function_calls                           1316 ms1030pg_graphql-1.5.11> ok 18        - function_calls_default_args                98 ms1031pg_graphql-1.5.11> ok 19        - function_calls_unsupported                299 ms1032pg_graphql-1.5.11> ok 20        - function_return_row_is_selectable          79 ms1033pg_graphql-1.5.11> ok 21        - function_return_view_has_pkey              76 ms1034pg_graphql-1.5.11> ok 22        - inflection_fields                         124 ms1035pg_graphql-1.5.11> ok 23        - inflection_function                       125 ms1036pg_graphql-1.5.11> ok 24        - inflection_relationships                  184 ms1037pg_graphql-1.5.11> ok 25        - inflection_types                          125 ms1038pg_graphql-1.5.11> ok 26        - issue_163                                  46 ms1039pg_graphql-1.5.11> ok 27        - issue_170                                  47 ms1040pg_graphql-1.5.11> ok 28        - issue_225                                  51 ms1041pg_graphql-1.5.11> ok 29        - issue_237_field_merging                    89 ms1042pg_graphql-1.5.11> ok 30        - issue_237_field_merging_mismatched         82 ms1043pg_graphql-1.5.11> ok 31        - issue_300                                  51 ms1044pg_graphql-1.5.11> ok 32        - issue_306                                  53 ms1045pg_graphql-1.5.11> ok 33        - issue_312                                  48 ms1046pg_graphql-1.5.11> ok 34        - issue_334_ambiguous_function               49 ms1047pg_graphql-1.5.11> ok 35        - issue_337                                  84 ms1048pg_graphql-1.5.11> ok 36        - issue_339_function_return_json             48 ms1049pg_graphql-1.5.11> ok 37        - issue_339_function_return_table            49 ms1050pg_graphql-1.5.11> ok 38        - issue_353_too_many_fields                  58 ms1051pg_graphql-1.5.11> ok 39        - issue_370_citext_as_string                 63 ms1052pg_graphql-1.5.11> ok 40        - issue_373                                  51 ms1053pg_graphql-1.5.11> ok 41        - issue_377_enum_search_path                 75 ms1054pg_graphql-1.5.11> ok 42        - issue_409_fkey_rls_nullability            105 ms1055pg_graphql-1.5.11> ok 43        - issue_444                                  44 ms1056pg_graphql-1.5.11> ok 44        - issue_463                                  53 ms1057pg_graphql-1.5.11> ok 45        - issue_511                                  55 ms1058pg_graphql-1.5.11> ok 46        - issue_533                                  99 ms1059pg_graphql-1.5.11> ok 47        - issue_542_partial_unique                   78 ms1060pg_graphql-1.5.11> ok 48        - issue_551_too_many_fields                  68 ms1061pg_graphql-1.5.11> ok 49        - issue_557_1_to_1_nullability               55 ms1062pg_graphql-1.5.11> ok 50        - issue_fragment_spread_cycles              205 ms1063pg_graphql-1.5.11> ok 51        - json_is_stringified                        52 ms1064pg_graphql-1.5.11> ok 52        - max_page_size                              47 ms1065pg_graphql-1.5.11> ok 53        - max_rows_directive                         99 ms1066pg_graphql-1.5.11> ok 54        - multi_column_primary_key                   59 ms1067pg_graphql-1.5.11> ok 55        - multiple_mutations                         55 ms1068pg_graphql-1.5.11> ok 56        - multiple_queries                           49 ms1069pg_graphql-1.5.11> ok 57        - mutation_delete                            63 ms1070pg_graphql-1.5.11> ok 58        - mutation_delete_variable                   54 ms1071pg_graphql-1.5.11> ok 59        - mutation_insert                            62 ms1072pg_graphql-1.5.11> ok 60        - mutation_update                            65 ms1073pg_graphql-1.5.11> ok 61        - null_argument                              47 ms1074pg_graphql-1.5.11> ok 62        - omit_exotic_types                          49 ms1075pg_graphql-1.5.11> ok 63        - omit_weird_names                           73 ms1076pg_graphql-1.5.11> ok 64        - operation_name                             49 ms1077pg_graphql-1.5.11> ok 65        - override_enum_name                         43 ms1078pg_graphql-1.5.11> ok 66        - override_field_name                        52 ms1079pg_graphql-1.5.11> ok 67        - override_func_field_name                   47 ms1080pg_graphql-1.5.11> ok 68        - override_relationship_field_name           49 ms1081pg_graphql-1.5.11> ok 69        - override_type_name                         47 ms1082pg_graphql-1.5.11> ok 70        - page_info                                  66 ms1083pg_graphql-1.5.11> ok 71        - permissions_connection_column              82 ms1084pg_graphql-1.5.11> ok 72        - permissions_functions                      76 ms1085pg_graphql-1.5.11> ok 73        - permissions_node_column                    84 ms1086pg_graphql-1.5.11> ok 74        - permissions_table_level                   163 ms1087pg_graphql-1.5.11> ok 75        - permissions_types                          98 ms1088pg_graphql-1.5.11> ok 76        - primary_key_is_required                    74 ms1089pg_graphql-1.5.11> ok 77        - relationship_one_to_one                    53 ms1090pg_graphql-1.5.11> ok 78        - resolve___schema                           57 ms1091pg_graphql-1.5.11> ok 79        - resolve___type                             48 ms1092pg_graphql-1.5.11> ok 80        - resolve___typename                         51 ms1093pg_graphql-1.5.11> ok 81        - resolve_array_type                         52 ms1094pg_graphql-1.5.11> ok 82        - resolve_connection_filter                 106 ms1095pg_graphql-1.5.11> ok 83        - resolve_connection_named                   48 ms1096pg_graphql-1.5.11> ok 84        - resolve_connection_order_by                81 ms1097pg_graphql-1.5.11> ok 85        - resolve_connection_pagination_args         95 ms1098pg_graphql-1.5.11> ok 86        - resolve_connection_to_conn                 57 ms1099pg_graphql-1.5.11> ok 87        - resolve_connection_to_node                 52 ms1100pg_graphql-1.5.11> ok 88        - resolve_error_connection_edge_no_field       46 ms1101pg_graphql-1.5.11> ok 89        - resolve_error_connection_edge_node_no_field       46 ms1102pg_graphql-1.5.11> ok 90        - resolve_error_connection_no_field          45 ms1103pg_graphql-1.5.11> ok 91        - resolve_error_from_parser                  11 ms1104pg_graphql-1.5.11> ok 92        - resolve_error_mutation_no_field            41 ms1105pg_graphql-1.5.11> ok 93        - resolve_error_node_no_field                47 ms1106pg_graphql-1.5.11> ok 94        - resolve_error_query_no_field               41 ms1107pg_graphql-1.5.11> ok 95        - resolve_fragment                           49 ms1108pg_graphql-1.5.11> ok 96        - resolve_graphiql_schema                   108 ms1109pg_graphql-1.5.11> ok 97        - resolve_one                                87 ms1110pg_graphql-1.5.11> ok 98        - roundtrip_types                            64 ms1111pg_graphql-1.5.11> ok 99        - row_level_security                         52 ms1112pg_graphql-1.5.11> ok 100       - sqli_connection                            58 ms1113pg_graphql-1.5.11> ok 101       - string_filters                             57 ms1114pg_graphql-1.5.11> ok 102       - test_error_anon_and_named_operations       40 ms1115pg_graphql-1.5.11> ok 103       - test_error_invalid_offset                  74 ms1116pg_graphql-1.5.11> ok 104       - test_error_multiple_anon_operations        41 ms1117pg_graphql-1.5.11> ok 105       - test_error_mutation_transpilation          47 ms1118pg_graphql-1.5.11> ok 106       - test_error_operation_name_not_found        41 ms1119pg_graphql-1.5.11> ok 107       - test_error_operation_names_not_unique       41 ms1120pg_graphql-1.5.11> ok 108       - test_error_query_transpilation             49 ms1121pg_graphql-1.5.11> ok 109       - test_error_subscription                    42 ms1122pg_graphql-1.5.11> ok 110       - test_query__type                           41 ms1123pg_graphql-1.5.11> ok 111       - total_count                                74 ms1124pg_graphql-1.5.11> ok 112       - type_bigfloat                              50 ms1125pg_graphql-1.5.11> ok 113       - type_modifier_max_length                   50 ms1126pg_graphql-1.5.11> ok 114       - type_opaque                                51 ms1127pg_graphql-1.5.11> ok 115       - variable_default                           49 ms1128pg_graphql-1.5.11> ok 116       - views_integration                         169 ms1129pg_graphql-1.5.11> 1..1161130pg_graphql-1.5.11> # All 116 tests passed.1131pg_graphql-1.5.11> + pg_ctl stop -m i1132pg_graphql-1.5.11> waiting for server to shut down....2026-10-06 14:14:54.010 UTC [5202] LOG:  received immediate shutdown request1133pg_graphql-1.5.11> 2026-10-06 14:14:54.017 UTC [5202] LOG:  database system is shut down1134pg_graphql-1.5.11>  done1135pg_graphql-1.5.11> server stopped1136pg_graphql-1.5.11> checkPhase completed in 38 seconds1137pg_graphql-1.5.11> Running phase: installPhase1138pg_graphql-1.5.11> Executing buildPgrxExtension install1139pg_graphql-1.5.11> Running phase: fixupPhase1140pg_graphql-1.5.11> shrinking RPATHs of ELF executables and libraries in /nix/store/w08ahw28ylp1k41li9zx2j9v7bw10sm8-pg_graphql-1.5.111141pg_graphql-1.5.11> shrinking /nix/store/w08ahw28ylp1k41li9zx2j9v7bw10sm8-pg_graphql-1.5.11/lib/pg_graphql-1.5.11.so1142pg_graphql-1.5.11> checking for references to /build/ in /nix/store/w08ahw28ylp1k41li9zx2j9v7bw10sm8-pg_graphql-1.5.11...1143pg_graphql-1.5.11> patching script interpreter paths in /nix/store/w08ahw28ylp1k41li9zx2j9v7bw10sm8-pg_graphql-1.5.111144pg_graphql-1.5.11> stripping (with command strip and flags -S -p) in  /nix/store/w08ahw28ylp1k41li9zx2j9v7bw10sm8-pg_graphql-1.5.11/lib1145pg_graphql-1.5.11> stripping (with command strip and flags -s -p) in  /nix/store/w08ahw28ylp1k41li9zx2j9v7bw10sm8-pg_graphql-1.5.11/lib1146pg_graphql-1.5.4> warning: `pg_graphql` (lib) generated 9 warnings1147pg_graphql-1.5.4>     Finished `release` profile [optimized] target(s) in 6m 59s1148pg_graphql-1.5.4>   Installing extension1149pg_graphql-1.5.4>      Copying control file to /nix/store/jg9mlzayb3xhw8ivj40fkcnbafxaf4v4-pg_graphql-1.5.4/nix/store/48l45fvi99n90x6p9i4cs1lmzby6cb73-postgresql-15.19/share/postgresql/extension/pg_graphql.control1150pg_graphql-1.5.4>      Copying shared library to /nix/store/jg9mlzayb3xhw8ivj40fkcnbafxaf4v4-pg_graphql-1.5.4/nix/store/k4dpm55d68aq0df72hjk046xy1124lhn-postgresql-15.19-lib/lib/pg_graphql.so1151pg_graphql-1.5.4>  Discovering SQL entities1152pg_graphql-1.5.4>   Discovered 5 SQL entities: 0 schemas (0 unique), 1 functions, 0 types, 0 enums, 4 sqls, 0 ords, 0 hashes, 0 aggregates, 0 triggers1153pg_graphql-1.5.4>      Writing SQL entities to /nix/store/jg9mlzayb3xhw8ivj40fkcnbafxaf4v4-pg_graphql-1.5.4/nix/store/48l45fvi99n90x6p9i4cs1lmzby6cb73-postgresql-15.19/share/postgresql/extension/pg_graphql--1.5.4.sql1154pg_graphql-1.5.4>     Finished installing pg_graphql1155pg_graphql-1.5.4> buildPhase completed in 7 minutes 13 seconds1156pg_graphql-1.5.4> Running phase: checkPhase1157pg_graphql-1.5.4>    Validating /nix/store/48l45fvi99n90x6p9i4cs1lmzby6cb73-postgresql-15.19/bin/pg_config1158pg_graphql-1.5.4>  Initializing data directory at /build/tmp.GfcDeT5Wxy/data-151159pg_graphql-1.5.4> waiting for server to start....2026-10-06 14:16:18.711 GMT [2087] LOG:  starting PostgreSQL 15.19 on aarch64-unknown-linux-gnu, compiled by gcc (GCC) 15.2.0, 64-bit1160pg_graphql-1.5.4> 2026-10-06 14:16:18.721 GMT [2087] LOG:  listening on Unix socket "/build/tmp.BMk4G4It7j/.s.PGSQL.5432"1161pg_graphql-1.5.4> 2026-10-06 14:16:18.732 GMT [2090] LOG:  database system was shut down at 2026-10-06 14:16:18 GMT1162pg_graphql-1.5.4> 2026-10-06 14:16:18.738 GMT [2087] LOG:  database system is ready to accept connections1163pg_graphql-1.5.4>  done1164pg_graphql-1.5.4> server started1165pg_graphql-1.5.4> createuser: error: connection to server at "localhost" (127.0.0.1), port 5432 failed: Connection refused1166pg_graphql-1.5.4> 	Is the server running on that host and accepting TCP/IP connections?1167pg_graphql-1.5.4> waiting for server to shut down....2026-10-06 14:16:18.793 GMT [2087] LOG:  received fast shutdown request1168pg_graphql-1.5.4> 2026-10-06 14:16:18.795 GMT [2087] LOG:  aborting any active transactions1169pg_graphql-1.5.4> 2026-10-06 14:16:18.798 GMT [2087] LOG:  background worker "logical replication launcher" (PID 2093) exited with exit code 11170pg_graphql-1.5.4> 2026-10-06 14:16:18.799 GMT [2088] LOG:  shutting down1171pg_graphql-1.5.4> 2026-10-06 14:16:18.801 GMT [2088] LOG:  checkpoint starting: shutdown immediate1172pg_graphql-1.5.4> 2026-10-06 14:16:18.815 GMT [2088] LOG:  checkpoint complete: wrote 3 buffers (0.0%); 0 WAL file(s) added, 0 removed, 0 recycled; write=0.004 s, sync=0.003 s, total=0.017 s; sync files=2, longest=0.002 s, average=0.002 s; distance=0 kB, estimate=0 kB1173pg_graphql-1.5.4> 2026-10-06 14:16:18.820 GMT [2087] LOG:  database system is shut down1174pg_graphql-1.5.4>  done1175pg_graphql-1.5.4> server stopped1176pg_graphql-1.5.4> warning: `/build/source/.cargo/config` is deprecated in favor of `config.toml`1177pg_graphql-1.5.4> note: if you need to support cargo 1.38 or earlier, you can symlink `config` to `config.toml`1178pg_graphql-1.5.4>    Validating /build/tmp.cjWqxHQIDX/15/bin/pg_config1179pg_graphql-1.5.4>  Initializing data directory at /build/tmp.cjWqxHQIDX/data-151180pg_graphql-1.5.4> warning: `/build/source/.cargo/config` is deprecated in favor of `config.toml`1181pg_graphql-1.5.4> note: if you need to support cargo 1.38 or earlier, you can symlink `config` to `config.toml`1182pg_graphql-1.5.4>        Using PgConfig("pg15") and `pg_config` from /build/tmp.cjWqxHQIDX/15/bin/pg_config1183pg_graphql-1.5.4>     Building extension with features pg151184pg_graphql-1.5.4>      Running command "/nix/store/kpxwf6dpminza6mhj8xddnaxx6fgnfy6-rust-default-1.85.1/bin/cargo" "build" "--release" "--features" "pg15" "--no-default-features" "--message-format=json-render-diagnostics" "--frozen" "-j" "2"1185pg_graphql-1.5.4> warning: `/build/source/.cargo/config` is deprecated in favor of `config.toml`1186pg_graphql-1.5.4> note: if you need to support cargo 1.38 or earlier, you can symlink `config` to `config.toml`1187pg_graphql-1.5.4> warning: unexpected `cfg` condition value: `pg11`1188pg_graphql-1.5.4>   --> src/lib.rs:18:11189pg_graphql-1.5.4>    |1190pg_graphql-1.5.4> 18 | pg_module_magic!();1191pg_graphql-1.5.4>    | ^^^^^^^^^^^^^^^^^^1192pg_graphql-1.5.4>    |1193pg_graphql-1.5.4>    = note: expected values for `feature` are: `default`, `pg14`, `pg15`, `pg16`, and `pg_test`1194pg_graphql-1.5.4>    = note: using a cfg inside a macro will use the cfgs from the destination crate and not the ones from the defining crate1195pg_graphql-1.5.4>    = help: try referring to `$crate::pg_magic_func` crate for guidance on how handle this unexpected cfg1196pg_graphql-1.5.4>    = help: the macro `$crate::pg_magic_func` may come from an old version of the `pgrx` crate, try updating your dependency with `cargo update -p pgrx`1197pg_graphql-1.5.4>    = note: see <https://doc.rust-lang.org/nightly/rustc/check-cfg/cargo-specifics.html> for more information about checking conditional configuration1198pg_graphql-1.5.4>    = note: `#[warn(unexpected_cfgs)]` on by default1199pg_graphql-1.5.4>    = note: this warning originates in the macro `$crate::pg_magic_func` which comes from the expansion of the macro `pg_module_magic` (in Nightly builds, run with -Z macro-backtrace for more info)1200pg_graphql-1.5.4> 1201pg_graphql-1.5.4> warning: unexpected `cfg` condition value: `pg12`1202pg_graphql-1.5.4>   --> src/lib.rs:18:11203pg_graphql-1.5.4>    |1204pg_graphql-1.5.4> 18 | pg_module_magic!();1205pg_graphql-1.5.4>    | ^^^^^^^^^^^^^^^^^^1206pg_graphql-1.5.4>    |1207pg_graphql-1.5.4>    = note: expected values for `feature` are: `default`, `pg14`, `pg15`, `pg16`, and `pg_test`1208pg_graphql-1.5.4>    = note: using a cfg inside a macro will use the cfgs from the destination crate and not the ones from the defining crate1209pg_graphql-1.5.4>    = help: try referring to `$crate::pg_magic_func` crate for guidance on how handle this unexpected cfg1210pg_graphql-1.5.4>    = help: the macro `$crate::pg_magic_func` may come from an old version of the `pgrx` crate, try updating your dependency with `cargo update -p pgrx`1211pg_graphql-1.5.4>    = note: see <https://doc.rust-lang.org/nightly/rustc/check-cfg/cargo-specifics.html> for more information about checking conditional configuration1212pg_graphql-1.5.4>    = note: this warning originates in the macro `$crate::pg_magic_func` which comes from the expansion of the macro `pg_module_magic` (in Nightly builds, run with -Z macro-backtrace for more info)1213pg_graphql-1.5.4> 1214pg_graphql-1.5.4> warning: unexpected `cfg` condition value: `pg13`1215pg_graphql-1.5.4>   --> src/lib.rs:18:11216pg_graphql-1.5.4>    |1217pg_graphql-1.5.4> 18 | pg_module_magic!();1218pg_graphql-1.5.4>    | ^^^^^^^^^^^^^^^^^^1219pg_graphql-1.5.4>    |1220pg_graphql-1.5.4>    = note: expected values for `feature` are: `default`, `pg14`, `pg15`, `pg16`, and `pg_test`1221pg_graphql-1.5.4>    = note: using a cfg inside a macro will use the cfgs from the destination crate and not the ones from the defining crate1222pg_graphql-1.5.4>    = help: try referring to `$crate::pg_magic_func` crate for guidance on how handle this unexpected cfg1223pg_graphql-1.5.4>    = help: the macro `$crate::pg_magic_func` may come from an old version of the `pgrx` crate, try updating your dependency with `cargo update -p pgrx`1224pg_graphql-1.5.4>    = note: see <https://doc.rust-lang.org/nightly/rustc/check-cfg/cargo-specifics.html> for more information about checking conditional configuration1225pg_graphql-1.5.4>    = note: this warning originates in the macro `$crate::pg_magic_func` which comes from the expansion of the macro `pg_module_magic` (in Nightly builds, run with -Z macro-backtrace for more info)1226pg_graphql-1.5.4> 1227pg_graphql-1.5.4> warning: field `alias` is never read1228pg_graphql-1.5.4>   --> src/builder.rs:15:91229pg_graphql-1.5.4>    |1230pg_graphql-1.5.4> 14 | pub struct InsertBuilder {1231pg_graphql-1.5.4>    |            ------------- field in this struct1232pg_graphql-1.5.4> 15 |     pub alias: String,1233pg_graphql-1.5.4>    |         ^^^^^1234pg_graphql-1.5.4>    |1235pg_graphql-1.5.4>    = note: `InsertBuilder` has derived impls for the traits `Debug` and `Clone`, but these are intentionally ignored during dead code analysis1236pg_graphql-1.5.4>    = note: `#[warn(dead_code)]` on by default1237pg_graphql-1.5.4> 1238pg_graphql-1.5.4> warning: field `alias` is never read1239pg_graphql-1.5.4>    --> src/builder.rs:338:91240pg_graphql-1.5.4>     |1241pg_graphql-1.5.4> 337 | pub struct UpdateBuilder {1242pg_graphql-1.5.4>     |            ------------- field in this struct1243pg_graphql-1.5.4> 338 |     pub alias: String,1244pg_graphql-1.5.4>     |         ^^^^^1245pg_graphql-1.5.4>     |1246pg_graphql-1.5.4>     = note: `UpdateBuilder` has derived impls for the traits `Debug` and `Clone`, but these are intentionally ignored during dead code analysis1247pg_graphql-1.5.4> 1248pg_graphql-1.5.4> warning: field `alias` is never read1249pg_graphql-1.5.4>    --> src/builder.rs:510:91250pg_graphql-1.5.4>     |1251pg_graphql-1.5.4> 509 | pub struct DeleteBuilder {1252pg_graphql-1.5.4>     |            ------------- field in this struct1253pg_graphql-1.5.4> 510 |     pub alias: String,1254pg_graphql-1.5.4>     |         ^^^^^1255pg_graphql-1.5.4>     |1256pg_graphql-1.5.4>     = note: `DeleteBuilder` has derived impls for the traits `Debug` and `Clone`, but these are intentionally ignored during dead code analysis1257pg_graphql-1.5.4> 1258pg_graphql-1.5.4> warning: field `alias` is never read1259pg_graphql-1.5.4>    --> src/builder.rs:612:91260pg_graphql-1.5.4>     |1261pg_graphql-1.5.4> 611 | pub struct FunctionCallBuilder {1262pg_graphql-1.5.4>     |            ------------------- field in this struct1263pg_graphql-1.5.4> 612 |     pub alias: String,1264pg_graphql-1.5.4>     |         ^^^^^1265pg_graphql-1.5.4> 1266pg_graphql-1.5.4> warning: field `schema` is never read1267pg_graphql-1.5.4>     --> src/builder.rs:1980:91268pg_graphql-1.5.4>      |1269pg_graphql-1.5.4> 1979 | pub struct __SchemaBuilder {1270pg_graphql-1.5.4>      |            --------------- field in this struct1271pg_graphql-1.5.4> 1980 |     pub schema: __Schema,1272pg_graphql-1.5.4>      |         ^^^^^^1273pg_graphql-1.5.4>      |1274pg_graphql-1.5.4>      = note: `__SchemaBuilder` has a derived impl for the trait `Clone`, but this is intentionally ignored during dead code analysis1275pg_graphql-1.5.4> 1276pg_graphql-1.5.4> warning: method `arg_map` is never used1277pg_graphql-1.5.4>    --> src/graphql.rs:349:81278pg_graphql-1.5.4>     |1279pg_graphql-1.5.4> 325 | pub trait ___Field {1280pg_graphql-1.5.4>     |           -------- method in this trait1281pg_graphql-1.5.4> ...1282pg_graphql-1.5.4> 349 |     fn arg_map(&self) -> HashMap<String, __InputValue> {1283pg_graphql-1.5.4>     |        ^^^^^^^1284pg_graphql-1.5.4> 1285pg_graphql-1.5.4> warning: `pg_graphql` (lib) generated 9 warnings1286pg_graphql-1.5.4>     Finished `release` profile [optimized] target(s) in 0.12s1287pg_graphql-1.5.4>   Installing extension1288pg_graphql-1.5.4>      Copying control file to /build/tmp.cjWqxHQIDX/15/share/postgresql/extension/pg_graphql.control1289pg_graphql-1.5.4>      Copying shared library to /build/tmp.cjWqxHQIDX/15/lib/pg_graphql.so1290pg_graphql-1.5.4>  Discovering SQL entities1291pg_graphql-1.5.4>   Discovered 5 SQL entities: 0 schemas (0 unique), 1 functions, 0 types, 0 enums, 4 sqls, 0 ords, 0 hashes, 0 aggregates, 0 triggers1292pg_graphql-1.5.4>      Writing SQL entities to /build/tmp.cjWqxHQIDX/15/share/postgresql/extension/pg_graphql--1.5.4.sql1293pg_graphql-1.5.4>     Finished installing pg_graphql1294pg_graphql-1.5.4> ++ mktemp -d1295pg_graphql-1.5.4> + TMPDIR=/build/tmp.YskaIuHGRI1296pg_graphql-1.5.4> + export PGDATA=/build/tmp.YskaIuHGRI1297pg_graphql-1.5.4> + PGDATA=/build/tmp.YskaIuHGRI1298pg_graphql-1.5.4> + export PGHOST=/build/tmp.YskaIuHGRI1299pg_graphql-1.5.4> + PGHOST=/build/tmp.YskaIuHGRI1300pg_graphql-1.5.4> + export PGUSER=postgres1301pg_graphql-1.5.4> + PGUSER=postgres1302pg_graphql-1.5.4> + export PGDATABASE=postgres1303pg_graphql-1.5.4> + PGDATABASE=postgres1304pg_graphql-1.5.4> + export PGTZ=UTC1305pg_graphql-1.5.4> + PGTZ=UTC1306pg_graphql-1.5.4> + export PG_COLOR=auto1307pg_graphql-1.5.4> + PG_COLOR=auto1308pg_graphql-1.5.4> + trap 'pg_ctl stop -m i' sigint sigterm exit1309pg_graphql-1.5.4> + rm -rf /build/tmp.YskaIuHGRI1310pg_graphql-1.5.4> + initdb --no-locale --encoding=UTF8 --nosync -U postgres1311pg_graphql-1.5.4> The files belonging to this database system will be owned by user "nixbld".1312pg_graphql-1.5.4> This user must also own the server process.1313pg_graphql-1.5.4> 1314pg_graphql-1.5.4> The database cluster will be initialized with locale "C".1315pg_graphql-1.5.4> The default text search configuration will be set to "english".1316pg_graphql-1.5.4> 1317pg_graphql-1.5.4> Data page checksums are disabled.1318pg_graphql-1.5.4> 1319pg_graphql-1.5.4> creating directory /build/tmp.YskaIuHGRI ... ok1320pg_graphql-1.5.4> creating subdirectories ... ok1321pg_graphql-1.5.4> selecting dynamic shared memory implementation ... posix1322pg_graphql-1.5.4> selecting default max_connections ... 1001323pg_graphql-1.5.4> selecting default shared_buffers ... 128MB1324pg_graphql-1.5.4> selecting default time zone ... UTC1325pg_graphql-1.5.4> creating configuration files ... ok1326pg_graphql-1.5.4> running bootstrap script ... ok1327pg_graphql-1.5.4> performing post-bootstrap initialization ... ok1328pg_graphql-1.5.4> 1329pg_graphql-1.5.4> Sync to disk skipped.1330pg_graphql-1.5.4> The data directory might become corrupt if the operating system crashes.1331pg_graphql-1.5.4> 1332pg_graphql-1.5.4> initdb: warning: enabling "trust" authentication for local connections1333pg_graphql-1.5.4> initdb: hint: You can change this by editing pg_hba.conf or using the option -A, or --auth-local and --auth-host, the next time you run initdb.1334pg_graphql-1.5.4> 1335pg_graphql-1.5.4> Success. You can now start the database server using:1336pg_graphql-1.5.4> 1337pg_graphql-1.5.4>     /build/tmp.cjWqxHQIDX/15/bin/pg_ctl -D /build/tmp.YskaIuHGRI -l logfile start1338pg_graphql-1.5.4> 1339pg_graphql-1.5.4> + pg_ctl start -o '-F -c listen_addresses="" -c log_min_messages=WARNING -k /build/tmp.YskaIuHGRI'1340pg_graphql-1.5.4> waiting for server to start....2026-10-06 14:16:33.608 UTC [2178] LOG:  starting PostgreSQL 15.19 on aarch64-unknown-linux-gnu, compiled by gcc (GCC) 15.2.0, 64-bit1341pg_graphql-1.5.4> 2026-10-06 14:16:33.608 UTC [2178] LOG:  listening on Unix socket "/build/tmp.YskaIuHGRI/.s.PGSQL.5432"1342pg_graphql-1.5.4> 2026-10-06 14:16:33.610 UTC [2181] LOG:  database system was shut down at 2026-10-06 14:16:33 UTC1343pg_graphql-1.5.4> 2026-10-06 14:16:33.614 UTC [2178] LOG:  database system is ready to accept connections1344pg_graphql-1.5.4>  done1345pg_graphql-1.5.4> server started1346pg_graphql-1.5.4> + createdb contrib_regression1347pg_graphql-1.5.4> + TESTDIR=test1348pg_graphql-1.5.4> +++ pg_config --pgxs1349pg_graphql-1.5.4> ++ dirname /nix/store/48l45fvi99n90x6p9i4cs1lmzby6cb73-postgresql-15.19/lib/pgxs/src/makefiles/pgxs.mk1350pg_graphql-1.5.4> + PGXS=/nix/store/48l45fvi99n90x6p9i4cs1lmzby6cb73-postgresql-15.19/lib/pgxs/src/makefiles1351pg_graphql-1.5.4> + REGRESS=/nix/store/48l45fvi99n90x6p9i4cs1lmzby6cb73-postgresql-15.19/lib/pgxs/src/makefiles/../test/regress/pg_regress1352pg_graphql-1.5.4> + '[' 0 -ne 0 ']'1353pg_graphql-1.5.4> ++ ls test/sql1354pg_graphql-1.5.4> ++ sed -e 's/\..*$//'1355pg_graphql-1.5.4> ++ sort1356pg_graphql-1.5.4> + TESTS=$'aliases\nallow_camel_names\narray_args_and_return_types\nbigint_is_string\nbuiltin_directives\ncomment_directive\ncomment_directive_description\ncompound_filters\nempty_mutations\nenum_mappings\nextend_type_with_function\nextend_type_with_function_relation\nextend_type_with_generated_column\nfilter_by_node_id\nfragment_on_mutation\nfragment_on_query\nfunction_calls\nfunction_calls_default_args\nfunction_calls_unsupported\nfunction_return_row_is_selectable\nfunction_return_view_has_pkey\ninflection_fields\ninflection_function\ninflection_relationships\ninflection_types\nissue_163\nissue_170\nissue_225\nissue_237_field_merging\nissue_237_field_merging_mismatched\nissue_300\nissue_306\nissue_312\nissue_334_ambiguous_function\nissue_337\nissue_339_function_return_json\nissue_339_function_return_table\nissue_353_too_many_fields\nissue_370_citext_as_string\nissue_373\nissue_377_enum_search_path\nissue_444\nissue_463\nissue_511\nissue_fragment_spread_cycles\njson_is_stringified\nmax_page_size\nmax_rows_directive\nmulti_column_primary_key\nmultiple_mutations\nmultiple_queries\nmutation_delete\nmutation_delete_variable\nmutation_insert\nmutation_update\nnull_argument\nomit_exotic_types\nomit_weird_names\noperation_name\noverride_enum_name\noverride_field_name\noverride_func_field_name\noverride_relationship_field_name\noverride_type_name\npage_info\npermissions_connection_column\npermissions_functions\npermissions_node_column\npermissions_table_level\npermissions_types\nprimary_key_is_required\nrelationship_one_to_one\nresolve___schema\nresolve___type\nresolve___typename\nresolve_array_type\nresolve_connection_filter\nresolve_connection_named\nresolve_connection_order_by\nresolve_connection_pagination_args\nresolve_connection_to_conn\nresolve_connection_to_node\nresolve_error_connection_edge_no_field\nresolve_error_connection_edge_node_no_field\nresolve_error_connection_no_field\nresolve_error_from_parser\nresolve_error_mutation_no_field\nresolve_error_node_no_field\nresolve_error_query_no_field\nresolve_fragment\nresolve_graphiql_schema\nresolve_one\nroundtrip_types\nrow_level_security\nsqli_connection\nstring_filters\ntest_error_anon_and_named_operations\ntest_error_invalid_offset\ntest_error_multiple_anon_operations\ntest_error_mutation_transpilation\ntest_error_operation_name_not_found\ntest_error_operation_names_not_unique\ntest_error_parsing\ntest_error_query_transpilation\ntest_error_subscription\ntest_query__type\ntotal_count\ntype_bigfloat\ntype_modifier_max_length\ntype_opaque\nvariable_default\nviews_integration'1357pg_graphql-1.5.4> + psql -v ON_ERROR_STOP=1 -f test/fixtures.sql -d contrib_regression1358pg_graphql-1.5.4> psql:test/fixtures.sql:1: NOTICE:  extension "pg_graphql" does not exist, skipping1359pg_graphql-1.5.4> DROP EXTENSION1360pg_graphql-1.5.4> CREATE EXTENSION1361pg_graphql-1.5.4> COMMENT1362pg_graphql-1.5.4> CREATE FUNCTION1363pg_graphql-1.5.4> + /nix/store/48l45fvi99n90x6p9i4cs1lmzby6cb73-postgresql-15.19/lib/pgxs/src/makefiles/../test/regress/pg_regress --use-existing --dbname=contrib_regression --inputdir=test aliases allow_camel_names array_args_and_return_types bigint_is_string builtin_directives comment_directive comment_directive_description compound_filters empty_mutations enum_mappings extend_type_with_function extend_type_with_function_relation extend_type_with_generated_column filter_by_node_id fragment_on_mutation fragment_on_query function_calls function_calls_default_args function_calls_unsupported function_return_row_is_selectable function_return_view_has_pkey inflection_fields inflection_function inflection_relationships inflection_types issue_163 issue_170 issue_225 issue_237_field_merging issue_237_field_merging_mismatched issue_300 issue_306 issue_312 issue_334_ambiguous_function issue_337 issue_339_function_return_json issue_339_function_return_table issue_353_too_many_fields issue_370_citext_as_string issue_373 issue_377_enum_search_path issue_444 issue_463 issue_511 issue_fragment_spread_cycles json_is_stringified max_page_size max_rows_directive multi_column_primary_key multiple_mutations multiple_queries mutation_delete mutation_delete_variable mutation_insert mutation_update null_argument omit_exotic_types omit_weird_names operation_name override_enum_name override_field_name override_func_field_name override_relationship_field_name override_type_name page_info permissions_connection_column permissions_functions permissions_node_column permissions_table_level permissions_types primary_key_is_required relationship_one_to_one resolve___schema resolve___type resolve___typename resolve_array_type resolve_connection_filter resolve_connection_named resolve_connection_order_by resolve_connection_pagination_args resolve_connection_to_conn resolve_connection_to_node resolve_error_connection_edge_no_field resolve_error_connection_edge_node_no_field resolve_error_connection_no_field resolve_error_from_parser resolve_error_mutation_no_field resolve_error_node_no_field resolve_error_query_no_field resolve_fragment resolve_graphiql_schema resolve_one roundtrip_types row_level_security sqli_connection string_filters test_error_anon_and_named_operations test_error_invalid_offset test_error_multiple_anon_operations test_error_mutation_transpilation test_error_operation_name_not_found test_error_operation_names_not_unique test_error_parsing test_error_query_transpilation test_error_subscription test_query__type total_count type_bigfloat type_modifier_max_length type_opaque variable_default views_integration1364pg_graphql-1.5.4> (using postmaster on /build/tmp.YskaIuHGRI, default port)1365pg_graphql-1.5.4> ============== running regression test queries        ==============1366pg_graphql-1.5.4> test aliases                      ... ok           58 ms1367pg_graphql-1.5.4> test allow_camel_names            ... ok           57 ms1368pg_graphql-1.5.4> test array_args_and_return_types  ... ok         1515 ms1369pg_graphql-1.5.4> test bigint_is_string             ... ok           54 ms1370pg_graphql-1.5.4> test builtin_directives           ... ok           62 ms1371pg_graphql-1.5.4> test comment_directive            ... ok            9 ms1372pg_graphql-1.5.4> test comment_directive_description ... ok           49 ms1373pg_graphql-1.5.4> test compound_filters             ... ok          247 ms1374pg_graphql-1.5.4> test empty_mutations              ... ok           53 ms1375pg_graphql-1.5.4> test enum_mappings                ... ok           56 ms1376pg_graphql-1.5.4> test extend_type_with_function    ... ok           53 ms1377pg_graphql-1.5.4> test extend_type_with_function_relation ... ok          149 ms1378pg_graphql-1.5.4> test extend_type_with_generated_column ... ok           50 ms1379pg_graphql-1.5.4> test filter_by_node_id            ... ok           55 ms1380pg_graphql-1.5.4> test fragment_on_mutation         ... ok           48 ms1381pg_graphql-1.5.4> test fragment_on_query            ... ok           49 ms1382pg_graphql-1.5.4> test function_calls               ... ok         1293 ms1383pg_graphql-1.5.4> test function_calls_default_args  ... ok          101 ms1384pg_graphql-1.5.4> test function_calls_unsupported   ... ok          294 ms1385pg_graphql-1.5.4> test function_return_row_is_selectable ... ok           79 ms1386pg_graphql-1.5.4> test function_return_view_has_pkey ... ok           75 ms1387pg_graphql-1.5.4> test inflection_fields            ... ok          125 ms1388pg_graphql-1.5.4> test inflection_function          ... ok          125 ms1389pg_graphql-1.5.4> test inflection_relationships     ... ok          184 ms1390pg_graphql-1.5.4> test inflection_types             ... ok          127 ms1391pg_graphql-1.5.4> test issue_163                    ... ok           48 ms1392pg_graphql-1.5.4> test issue_170                    ... ok           49 ms1393pg_graphql-1.5.4> test issue_225                    ... ok           52 ms1394pg_graphql-1.5.4> test issue_237_field_merging      ... ok           91 ms1395pg_graphql-1.5.4> test issue_237_field_merging_mismatched ... ok           84 ms1396pg_graphql-1.5.4> test issue_300                    ... ok           51 ms1397pg_graphql-1.5.4> test issue_306                    ... ok           55 ms1398pg_graphql-1.5.4> test issue_312                    ... ok           50 ms1399pg_graphql-1.5.4> test issue_334_ambiguous_function ... ok           51 ms1400pg_graphql-1.5.4> test issue_337                    ... ok           85 ms1401pg_graphql-1.5.4> test issue_339_function_return_json ... ok           49 ms1402pg_graphql-1.5.4> test issue_339_function_return_table ... ok           48 ms1403pg_graphql-1.5.4> test issue_353_too_many_fields    ... ok           60 ms1404pg_graphql-1.5.4> test issue_370_citext_as_string   ... ok           65 ms1405pg_graphql-1.5.4> test issue_373                    ... ok           52 ms1406pg_graphql-1.5.4> test issue_377_enum_search_path   ... ok           76 ms1407pg_graphql-1.5.4> test issue_444                    ... ok           44 ms1408pg_graphql-1.5.4> test issue_463                    ... ok           51 ms1409pg_graphql-1.5.4> test issue_511                    ... ok           56 ms1410pg_graphql-1.5.4> test issue_fragment_spread_cycles ... ok          201 ms1411pg_graphql-1.5.4> test json_is_stringified          ... ok           53 ms1412pg_graphql-1.5.4> test max_page_size                ... ok           65 ms1413pg_graphql-1.5.4> test max_rows_directive           ... ok          103 ms1414pg_graphql-1.5.4> test multi_column_primary_key     ... ok           60 ms1415pg_graphql-1.5.4> test multiple_mutations           ... ok           51 ms1416pg_graphql-1.5.4> test multiple_queries             ... ok           51 ms1417pg_graphql-1.5.4> test mutation_delete              ... ok           61 ms1418pg_graphql-1.5.4> test mutation_delete_variable     ... ok           51 ms1419pg_graphql-1.5.4> test mutation_insert              ... ok           68 ms1420pg_graphql-1.5.4> test mutation_update              ... ok           73 ms1421pg_graphql-1.5.4> test null_argument                ... ok           54 ms1422pg_graphql-1.5.4> test omit_exotic_types            ... ok           61 ms1423pg_graphql-1.5.4> test omit_weird_names             ... ok           75 ms1424pg_graphql-1.5.4> test operation_name               ... ok           51 ms1425pg_graphql-1.5.4> test override_enum_name           ... ok           45 ms1426pg_graphql-1.5.4> test override_field_name          ... ok           48 ms1427pg_graphql-1.5.4> test override_func_field_name     ... ok           50 ms1428pg_graphql-1.5.4> test override_relationship_field_name ... ok           52 ms1429pg_graphql-1.5.4> test override_type_name           ... ok           49 ms1430pg_graphql-1.5.4> test page_info                    ... ok           68 ms1431pg_graphql-1.5.4> test permissions_connection_column ... ok           79 ms1432pg_graphql-1.5.4> test permissions_functions        ... ok           74 ms1433pg_graphql-1.5.4> test permissions_node_column      ... ok           82 ms1434pg_graphql-1.5.4> test permissions_table_level      ... ok          159 ms1435pg_graphql-1.5.4> test permissions_types            ... ok           98 ms1436pg_graphql-1.5.4> test primary_key_is_required      ... ok           75 ms1437pg_graphql-1.5.4> test relationship_one_to_one      ... ok           54 ms1438pg_graphql-1.5.4> test resolve___schema             ... ok           59 ms1439pg_graphql-1.5.4> test resolve___type               ... ok           49 ms1440pg_graphql-1.5.4> test resolve___typename           ... ok           52 ms1441pg_graphql-1.5.4> test resolve_array_type           ... ok           53 ms1442pg_graphql-1.5.4> test resolve_connection_filter    ... ok           98 ms1443pg_graphql-1.5.4> test resolve_connection_named     ... ok           49 ms1444pg_graphql-1.5.4> test resolve_connection_order_by  ... ok           77 ms1445pg_graphql-1.5.4> test resolve_connection_pagination_args ... ok           96 ms1446pg_graphql-1.5.4> test resolve_connection_to_conn   ... ok           54 ms1447pg_graphql-1.5.4> test resolve_connection_to_node   ... ok           54 ms1448pg_graphql-1.5.4> test resolve_error_connection_edge_no_field ... ok           47 ms1449pg_graphql-1.5.4> test resolve_error_connection_edge_node_no_field ... ok           49 ms1450pg_graphql-1.5.4> test resolve_error_connection_no_field ... ok           48 ms1451pg_graphql-1.5.4> test resolve_error_from_parser    ... ok           11 ms1452pg_graphql-1.5.4> test resolve_error_mutation_no_field ... ok           45 ms1453pg_graphql-1.5.4> test resolve_error_node_no_field  ... ok           49 ms1454pg_graphql-1.5.4> test resolve_error_query_no_field ... ok           44 ms1455pg_graphql-1.5.4> test resolve_fragment             ... ok           50 ms1456pg_graphql-1.5.4> test resolve_graphiql_schema      ... ok          108 ms1457pg_graphql-1.5.4> test resolve_one                  ... ok           89 ms1458pg_graphql-1.5.4> test roundtrip_types              ... ok           63 ms1459pg_graphql-1.5.4> test row_level_security           ... ok           51 ms1460pg_graphql-1.5.4> test sqli_connection              ... ok           59 ms1461pg_graphql-1.5.4> test string_filters               ... ok           57 ms1462pg_graphql-1.5.4> test test_error_anon_and_named_operations ... ok           42 ms1463pg_graphql-1.5.4> test test_error_invalid_offset    ... ok           74 ms1464pg_graphql-1.5.4> test test_error_multiple_anon_operations ... ok           44 ms1465pg_graphql-1.5.4> test test_error_mutation_transpilation ... ok           48 ms1466pg_graphql-1.5.4> test test_error_operation_name_not_found ... ok           43 ms1467pg_graphql-1.5.4> test test_error_operation_names_not_unique ... ok           43 ms1468pg_graphql-1.5.4> test test_error_parsing           ... ok           11 ms1469pg_graphql-1.5.4> test test_error_query_transpilation ... ok           51 ms1470pg_graphql-1.5.4> test test_error_subscription      ... ok           45 ms1471pg_graphql-1.5.4> test test_query__type             ... ok           43 ms1472pg_graphql-1.5.4> test total_count                  ... ok           76 ms1473pg_graphql-1.5.4> test type_bigfloat                ... ok           53 ms1474pg_graphql-1.5.4> test type_modifier_max_length     ... ok           53 ms1475pg_graphql-1.5.4> test type_opaque                  ... ok           52 ms1476pg_graphql-1.5.4> test variable_default             ... ok           51 ms1477pg_graphql-1.5.4> test views_integration            ... ok          167 ms1478pg_graphql-1.5.4> 1479pg_graphql-1.5.4> =======================1480pg_graphql-1.5.4>  All 112 tests passed. 1481pg_graphql-1.5.4> =======================1482pg_graphql-1.5.4> 1483pg_graphql-1.5.4> + pg_ctl stop -m i1484pg_graphql-1.5.4> waiting for server to shut down....2026-10-06 14:16:44.369 UTC [2178] LOG:  received immediate shutdown request1485pg_graphql-1.5.4> 2026-10-06 14:16:44.376 UTC [2178] LOG:  database system is shut down1486pg_graphql-1.5.4>  done1487pg_graphql-1.5.4> server stopped1488pg_graphql-1.5.4> Running phase: installPhase1489pg_graphql-1.5.4> Executing buildPgrxExtension install1490pg_graphql-1.5.4> Running phase: fixupPhase1491pg_graphql-1.5.4> shrinking RPATHs of ELF executables and libraries in /nix/store/jg9mlzayb3xhw8ivj40fkcnbafxaf4v4-pg_graphql-1.5.41492pg_graphql-1.5.4> shrinking /nix/store/jg9mlzayb3xhw8ivj40fkcnbafxaf4v4-pg_graphql-1.5.4/lib/pg_graphql-1.5.4.so1493pg_graphql-1.5.4> checking for references to /build/ in /nix/store/jg9mlzayb3xhw8ivj40fkcnbafxaf4v4-pg_graphql-1.5.4...1494pg_graphql-1.5.4> patching script interpreter paths in /nix/store/jg9mlzayb3xhw8ivj40fkcnbafxaf4v4-pg_graphql-1.5.41495pg_graphql-1.5.4> stripping (with command strip and flags -S -p) in  /nix/store/jg9mlzayb3xhw8ivj40fkcnbafxaf4v4-pg_graphql-1.5.4/lib1496pg_graphql-1.5.4> stripping (with command strip and flags -s -p) in  /nix/store/jg9mlzayb3xhw8ivj40fkcnbafxaf4v4-pg_graphql-1.5.4/lib1497building '/nix/store/x1kpz6n29pqn2xm06lprn5kwpr0pjhhx-pg_hashids.drv' on 'ssh-ng://nixbot-remote-build@78.232.36.247'1498building '/nix/store/x1kpz6n29pqn2xm06lprn5kwpr0pjhhx-pg_hashids.drv'1499pg_hashids> created 14 symlinks in user environment1500pg_hashids> +++++ ls -A /nix/store/a2rqwyxdnps2bcn6g5mf7284hrvbv7sr-pg_hashids/lib/pg_hashids-1.2.1.so /nix/store/a2rqwyxdnps2bcn6g5mf7284hrvbv7sr-pg_hashids/lib/pg_hashids-1.3.0-cd0e1b31d52b394a0df64079406a14a4f7387cd6.so /nix/store/a2rqwyxdnps2bcn6g5mf7284hrvbv7sr-pg_hashids/lib/pg_hashids.so1501pg_hashids> +++++ wc -l1502pg_hashids> ++++ test 3 = 31503building '/nix/store/0n0iaya9csx9by2pimrx1yglzw8dp4zs-pg_net-0.13.0.drv' on 'ssh-ng://nixbot-remote-build@78.232.36.247'1504building '/nix/store/0n0iaya9csx9by2pimrx1yglzw8dp4zs-pg_net-0.13.0.drv'1505pg_net-0.13.0> Running phase: unpackPhase1506pg_net-0.13.0> unpacking source archive /nix/store/bxdzbzjn4yi7ch55dlcgzk6npzx2p4jz-source1507pg_net-0.13.0> source root is source1508pg_net-0.13.0> Running phase: patchPhase1509pg_net-0.13.0> Running phase: updateAutotoolsGnuConfigScriptsPhase1510pg_net-0.13.0> Running phase: configurePhase1511pg_net-0.13.0> no configure script, doing nothing1512pg_net-0.13.0> Running phase: buildPhase1513pg_net-0.13.0> gcc -Wall -Wmissing-prototypes -Wpointer-arith -Wdeclaration-after-statement -Werror=vla -Wendif-labels -Wmissing-format-attribute -Wimplicit-fallthrough=3 -Wcast-function-type -Wformat-security -fno-strict-aliasing -fwrapv -fexcess-precision=standard -Wno-deprecated-non-prototype -Wno-format-truncation -Wno-stringop-truncation -g -O2 -std=gnu17 -std=c11 -Werror -Wno-declaration-after-statement -fPIC  -DEXTVERSION=\"0.13.0\" -I. -I./ -I/nix/store/48l45fvi99n90x6p9i4cs1lmzby6cb73-postgresql-15.19/include/server -I/nix/store/48l45fvi99n90x6p9i4cs1lmzby6cb73-postgresql-15.19/include/internal -D_GNU_SOURCE  -I/nix/store/p17klc3qq4nl9ihfwqfpi8cnqvcf92xz-libxml2-2.15.1-dev/include/libxml2 -I/nix/store/mglbi4dy4kpx7v1dcgf6iincp5x38hsc-lz4-1.10.0-dev/include -I/nix/store/g41q9md9rdcr3lkydi6f8zd6fza3h1q4-zstd-1.5.7-dev/include -I/nix/store/n2vnr7ycfk6midbzxcwd28qj3bgb50cz-icu4c-75.1-dev/include  -c -o src/worker.o src/worker.c1514pg_net-0.13.0> gcc -Wall -Wmissing-prototypes -Wpointer-arith -Wdeclaration-after-statement -Werror=vla -Wendif-labels -Wmissing-format-attribute -Wimplicit-fallthrough=3 -Wcast-function-type -Wformat-security -fno-strict-aliasing -fwrapv -fexcess-precision=standard -Wno-deprecated-non-prototype -Wno-format-truncation -Wno-stringop-truncation -g -O2 -std=gnu17 -std=c11 -Werror -Wno-declaration-after-statement -fPIC  -DEXTVERSION=\"0.13.0\" -I. -I./ -I/nix/store/48l45fvi99n90x6p9i4cs1lmzby6cb73-postgresql-15.19/include/server -I/nix/store/48l45fvi99n90x6p9i4cs1lmzby6cb73-postgresql-15.19/include/internal -D_GNU_SOURCE  -I/nix/store/p17klc3qq4nl9ihfwqfpi8cnqvcf92xz-libxml2-2.15.1-dev/include/libxml2 -I/nix/store/mglbi4dy4kpx7v1dcgf6iincp5x38hsc-lz4-1.10.0-dev/include -I/nix/store/g41q9md9rdcr3lkydi6f8zd6fza3h1q4-zstd-1.5.7-dev/include -I/nix/store/n2vnr7ycfk6midbzxcwd28qj3bgb50cz-icu4c-75.1-dev/include  -c -o src/util.o src/util.c1515pg_net-0.13.0> gcc -Wall -Wmissing-prototypes -Wpointer-arith -Wdeclaration-after-statement -Werror=vla -Wendif-labels -Wmissing-format-attribute -Wimplicit-fallthrough=3 -Wcast-function-type -Wformat-security -fno-strict-aliasing -fwrapv -fexcess-precision=standard -Wno-deprecated-non-prototype -Wno-format-truncation -Wno-stringop-truncation -g -O2 -std=gnu17 -std=c11 -Werror -Wno-declaration-after-statement -fPIC  -DEXTVERSION=\"0.13.0\" -I. -I./ -I/nix/store/48l45fvi99n90x6p9i4cs1lmzby6cb73-postgresql-15.19/include/server -I/nix/store/48l45fvi99n90x6p9i4cs1lmzby6cb73-postgresql-15.19/include/internal -D_GNU_SOURCE  -I/nix/store/p17klc3qq4nl9ihfwqfpi8cnqvcf92xz-libxml2-2.15.1-dev/include/libxml2 -I/nix/store/mglbi4dy4kpx7v1dcgf6iincp5x38hsc-lz4-1.10.0-dev/include -I/nix/store/g41q9md9rdcr3lkydi6f8zd6fza3h1q4-zstd-1.5.7-dev/include -I/nix/store/n2vnr7ycfk6midbzxcwd28qj3bgb50cz-icu4c-75.1-dev/include  -c -o src/core.o src/core.c1516pg_net-0.13.0> In file included from src/core.c:23:1517pg_net-0.13.0> In function 'init_curl_handle',1518pg_net-0.13.0>     inlined from 'consume_request_queue' at src/core.c:273:5:1519pg_net-0.13.0> src/util.h:6:11: warning: call to 'Wcurl_easy_setopt_err_long' declared with attribute warning: curl_easy_setopt expects a long argument [-Wattribute-warning]1520pg_net-0.13.0>     6 |       if (curl_easy_setopt(hdl, opt, prm) != CURLE_OK) \1521pg_net-0.13.0>       |           ^~~~~~~~~~~~~~~~1522pg_net-0.13.0> src/core.c:94:7: note: in expansion of macro 'CURL_EZ_SETOPT'1523pg_net-0.13.0>    94 |       CURL_EZ_SETOPT(curl_ez_handle, CURLOPT_POST, 1);1524pg_net-0.13.0>       |       ^~~~~~~~~~~~~~1525pg_net-0.13.0> src/util.h:6:11: warning: call to 'Wcurl_easy_setopt_err_long' declared with attribute warning: curl_easy_setopt expects a long argument [-Wattribute-warning]1526pg_net-0.13.0>     6 |       if (curl_easy_setopt(hdl, opt, prm) != CURLE_OK) \1527pg_net-0.13.0>       |           ^~~~~~~~~~~~~~~~1528pg_net-0.13.0> src/core.c:95:7: note: in expansion of macro 'CURL_EZ_SETOPT'1529pg_net-0.13.0>    95 |       CURL_EZ_SETOPT(curl_ez_handle, CURLOPT_POSTFIELDSIZE, 0);1530pg_net-0.13.0>       |       ^~~~~~~~~~~~~~1531pg_net-0.13.0> src/util.h:6:11: warning: call to 'Wcurl_easy_setopt_err_long' declared with attribute warning: curl_easy_setopt expects a long argument [-Wattribute-warning]1532pg_net-0.13.0>     6 |       if (curl_easy_setopt(hdl, opt, prm) != CURLE_OK) \1533pg_net-0.13.0>       |           ^~~~~~~~~~~~~~~~1534pg_net-0.13.0> src/core.c:108:3: note: in expansion of macro 'CURL_EZ_SETOPT'1535pg_net-0.13.0>   108 |   CURL_EZ_SETOPT(curl_ez_handle, CURLOPT_TIMEOUT_MS, timeout_milliseconds);1536pg_net-0.13.0>       |   ^~~~~~~~~~~~~~1537pg_net-0.13.0> src/util.h:6:11: warning: call to 'Wcurl_easy_setopt_err_long' declared with attribute warning: curl_easy_setopt expects a long argument [-Wattribute-warning]1538pg_net-0.13.0>     6 |       if (curl_easy_setopt(hdl, opt, prm) != CURLE_OK) \1539pg_net-0.13.0>       |           ^~~~~~~~~~~~~~~~1540pg_net-0.13.0> src/core.c:110:3: note: in expansion of macro 'CURL_EZ_SETOPT'1541pg_net-0.13.0>   110 |   CURL_EZ_SETOPT(curl_ez_handle, CURLOPT_FOLLOWLOCATION, true);1542pg_net-0.13.0>       |   ^~~~~~~~~~~~~~1543pg_net-0.13.0> gcc -Wall -Wmissing-prototypes -Wpointer-arith -Wdeclaration-after-statement -Werror=vla -Wendif-labels -Wmissing-format-attribute -Wimplicit-fallthrough=3 -Wcast-function-type -Wformat-security -fno-strict-aliasing -fwrapv -fexcess-precision=standard -Wno-deprecated-non-prototype -Wno-format-truncation -Wno-stringop-truncation -g -O2 -std=gnu17 -std=c11 -Werror -Wno-declaration-after-statement -fPIC  -DEXTVERSION=\"0.13.0\" -I. -I./ -I/nix/store/48l45fvi99n90x6p9i4cs1lmzby6cb73-postgresql-15.19/include/server -I/nix/store/48l45fvi99n90x6p9i4cs1lmzby6cb73-postgresql-15.19/include/internal -D_GNU_SOURCE  -I/nix/store/p17klc3qq4nl9ihfwqfpi8cnqvcf92xz-libxml2-2.15.1-dev/include/libxml2 -I/nix/store/mglbi4dy4kpx7v1dcgf6iincp5x38hsc-lz4-1.10.0-dev/include -I/nix/store/g41q9md9rdcr3lkydi6f8zd6fza3h1q4-zstd-1.5.7-dev/include -I/nix/store/n2vnr7ycfk6midbzxcwd28qj3bgb50cz-icu4c-75.1-dev/include  -c -o src/event.o src/event.c1544pg_net-0.13.0> In file included from /nix/store/jviasb44hibgh09829gbmbssbz2jjnhz-curl-8.17.0-dev/include/curl/curl.h:3333,1545pg_net-0.13.0>                  from /nix/store/jviasb44hibgh09829gbmbssbz2jjnhz-curl-8.17.0-dev/include/curl/multi.h:51,1546pg_net-0.13.0>                  from src/event.h:4,1547pg_net-0.13.0>                  from src/event.c:6:1548pg_net-0.13.0> /nix/store/jviasb44hibgh09829gbmbssbz2jjnhz-curl-8.17.0-dev/include/curl/multi.h:429:23: error: expected identifier or '(' before '__extension__'1549pg_net-0.13.0>   429 | CURL_EXTERN CURLMcode curl_multi_setopt(CURLM *multi_handle,1550pg_net-0.13.0>       |                       ^~~~~~~~~~~~~~~~~1551pg_net-0.13.0> /nix/store/jviasb44hibgh09829gbmbssbz2jjnhz-curl-8.17.0-dev/include/curl/multi.h:429:23: error: expected identifier or '(' before ')' token1552pg_net-0.13.0>   429 | CURL_EXTERN CURLMcode curl_multi_setopt(CURLM *multi_handle,1553pg_net-0.13.0>       |                       ^~~~~~~~~~~~~~~~~1554pg_net-0.13.0> make: *** [<builtin>: src/event.o] Error 11555error: build of '/nix/store/0n0iaya9csx9by2pimrx1yglzw8dp4zs-pg_net-0.13.0.drv' on 'ssh-ng://nixbot-remote-build@78.232.36.247' failed: Cannot build '/nix/store/0n0iaya9csx9by2pimrx1yglzw8dp4zs-pg_net-0.13.0.drv'.1556       Reason: builder failed with exit code 2.1557       Output paths:1558         /nix/store/14dkr1mhbrh869r2k75r03ngw6q7c4ma-pg_net-0.13.01559       Last 25 log lines:1560       >       |       ^~~~~~~~~~~~~~1561       > src/util.h:6:11: warning: call to 'Wcurl_easy_setopt_err_long' declared with attribute warning: curl_easy_setopt expects a long argument [-Wattribute-warning]1562       >     6 |       if (curl_easy_setopt(hdl, opt, prm) != CURLE_OK) \1563       >       |           ^~~~~~~~~~~~~~~~1564       > src/core.c:108:3: note: in expansion of macro 'CURL_EZ_SETOPT'1565       >   108 |   CURL_EZ_SETOPT(curl_ez_handle, CURLOPT_TIMEOUT_MS, timeout_milliseconds);1566       >       |   ^~~~~~~~~~~~~~1567       > src/util.h:6:11: warning: call to 'Wcurl_easy_setopt_err_long' declared with attribute warning: curl_easy_setopt expects a long argument [-Wattribute-warning]1568       >     6 |       if (curl_easy_setopt(hdl, opt, prm) != CURLE_OK) \1569       >       |           ^~~~~~~~~~~~~~~~1570       > src/core.c:110:3: note: in expansion of macro 'CURL_EZ_SETOPT'1571       >   110 |   CURL_EZ_SETOPT(curl_ez_handle, CURLOPT_FOLLOWLOCATION, true);1572       >       |   ^~~~~~~~~~~~~~1573       > gcc -Wall -Wmissing-prototypes -Wpointer-arith -Wdeclaration-after-statement -Werror=vla -Wendif-labels -Wmissing-format-attribute -Wimplicit-fallthrough=3 -Wcast-function-type -Wformat-security -fno-strict-aliasing -fwrapv -fexcess-precision=standard -Wno-deprecated-non-prototype -Wno-format-truncation -Wno-stringop-truncation -g -O2 -std=gnu17 -std=c11 -Werror -Wno-declaration-after-statement -fPIC  -DEXTVERSION=\"0.13.0\" -I. -I./ -I/nix/store/48l45fvi99n90x6p9i4cs1lmzby6cb73-postgresql-15.19/include/server -I/nix/store/48l45fvi99n90x6p9i4cs1lmzby6cb73-postgresql-15.19/include/internal -D_GNU_SOURCE  -I/nix/store/p17klc3qq4nl9ihfwqfpi8cnqvcf92xz-libxml2-2.15.1-dev/include/libxml2 -I/nix/store/mglbi4dy4kpx7v1dcgf6iincp5x38hsc-lz4-1.10.0-dev/include -I/nix/store/g41q9md9rdcr3lkydi6f8zd6fza3h1q4-zstd-1.5.7-dev/include -I/nix/store/n2vnr7ycfk6midbzxcwd28qj3bgb50cz-icu4c-75.1-dev/include  -c -o src/event.o src/event.c1574       > In file included from /nix/store/jviasb44hibgh09829gbmbssbz2jjnhz-curl-8.17.0-dev/include/curl/curl.h:3333,1575       >                  from /nix/store/jviasb44hibgh09829gbmbssbz2jjnhz-curl-8.17.0-dev/include/curl/multi.h:51,1576       >                  from src/event.h:4,1577       >                  from src/event.c:6:1578       > /nix/store/jviasb44hibgh09829gbmbssbz2jjnhz-curl-8.17.0-dev/include/curl/multi.h:429:23: error: expected identifier or '(' before '__extension__'1579       >   429 | CURL_EXTERN CURLMcode curl_multi_setopt(CURLM *multi_handle,1580       >       |                       ^~~~~~~~~~~~~~~~~1581       > /nix/store/jviasb44hibgh09829gbmbssbz2jjnhz-curl-8.17.0-dev/include/curl/multi.h:429:23: error: expected identifier or '(' before ')' token1582       >   429 | CURL_EXTERN CURLMcode curl_multi_setopt(CURLM *multi_handle,1583       >       |                       ^~~~~~~~~~~~~~~~~1584       > make: *** [<builtin>: src/event.o] Error 11585       For full logs, run:1586         nix log /nix/store/0n0iaya9csx9by2pimrx1yglzw8dp4zs-pg_net-0.13.0.drv1587error: Cannot build '/nix/store/0n0iaya9csx9by2pimrx1yglzw8dp4zs-pg_net-0.13.0.drv'.1588       Reason: builder failed with exit code 1.1589       Output paths:1590         /nix/store/14dkr1mhbrh869r2k75r03ngw6q7c4ma-pg_net-0.13.01591building '/nix/store/g6nfp5n056kw2jvfzldzxrrrxfpfcka0-pg_net-0.13.0.drv' on 'ssh-ng://nixbot-remote-build@78.232.36.247'1592building '/nix/store/g6nfp5n056kw2jvfzldzxrrrxfpfcka0-pg_net-0.13.0.drv'1593pg_net-0.13.0> Running phase: unpackPhase1594pg_net-0.13.0> unpacking source archive /nix/store/bxdzbzjn4yi7ch55dlcgzk6npzx2p4jz-source1595pg_net-0.13.0> source root is source1596pg_net-0.13.0> Running phase: patchPhase1597pg_net-0.13.0> Running phase: updateAutotoolsGnuConfigScriptsPhase1598pg_net-0.13.0> Running phase: configurePhase1599pg_net-0.13.0> no configure script, doing nothing1600pg_net-0.13.0> Running phase: buildPhase1601pg_net-0.13.0> gcc -Wall -Wmissing-prototypes -Wpointer-arith -Wdeclaration-after-statement -Werror=vla -Wendif-labels -Wmissing-format-attribute -Wimplicit-fallthrough=3 -Wcast-function-type -Wshadow=compatible-local -Wformat-security -fno-strict-aliasing -fwrapv -fexcess-precision=standard -Wno-format-truncation -Wno-stringop-truncation -g -O2 -std=c11 -Werror -Wno-declaration-after-statement -fPIC -fvisibility=hidden  -DEXTVERSION=\"0.13.0\" -I. -I./ -I/nix/store/9q4p23a2y63xn8safzzn6lbn07bnkshs-postgresql-17.11/include/server -I/nix/store/9q4p23a2y63xn8safzzn6lbn07bnkshs-postgresql-17.11/include/internal -D_GNU_SOURCE  -I/nix/store/p17klc3qq4nl9ihfwqfpi8cnqvcf92xz-libxml2-2.15.1-dev/include/libxml2 -I/nix/store/mglbi4dy4kpx7v1dcgf6iincp5x38hsc-lz4-1.10.0-dev/include -I/nix/store/g41q9md9rdcr3lkydi6f8zd6fza3h1q4-zstd-1.5.7-dev/include -I/nix/store/n2vnr7ycfk6midbzxcwd28qj3bgb50cz-icu4c-75.1-dev/include  -c -o src/worker.o src/worker.c1602pg_net-0.13.0> gcc -Wall -Wmissing-prototypes -Wpointer-arith -Wdeclaration-after-statement -Werror=vla -Wendif-labels -Wmissing-format-attribute -Wimplicit-fallthrough=3 -Wcast-function-type -Wshadow=compatible-local -Wformat-security -fno-strict-aliasing -fwrapv -fexcess-precision=standard -Wno-format-truncation -Wno-stringop-truncation -g -O2 -std=c11 -Werror -Wno-declaration-after-statement -fPIC -fvisibility=hidden  -DEXTVERSION=\"0.13.0\" -I. -I./ -I/nix/store/9q4p23a2y63xn8safzzn6lbn07bnkshs-postgresql-17.11/include/server -I/nix/store/9q4p23a2y63xn8safzzn6lbn07bnkshs-postgresql-17.11/include/internal -D_GNU_SOURCE  -I/nix/store/p17klc3qq4nl9ihfwqfpi8cnqvcf92xz-libxml2-2.15.1-dev/include/libxml2 -I/nix/store/mglbi4dy4kpx7v1dcgf6iincp5x38hsc-lz4-1.10.0-dev/include -I/nix/store/g41q9md9rdcr3lkydi6f8zd6fza3h1q4-zstd-1.5.7-dev/include -I/nix/store/n2vnr7ycfk6midbzxcwd28qj3bgb50cz-icu4c-75.1-dev/include  -c -o src/util.o src/util.c1603pg_net-0.13.0> gcc -Wall -Wmissing-prototypes -Wpointer-arith -Wdeclaration-after-statement -Werror=vla -Wendif-labels -Wmissing-format-attribute -Wimplicit-fallthrough=3 -Wcast-function-type -Wshadow=compatible-local -Wformat-security -fno-strict-aliasing -fwrapv -fexcess-precision=standard -Wno-format-truncation -Wno-stringop-truncation -g -O2 -std=c11 -Werror -Wno-declaration-after-statement -fPIC -fvisibility=hidden  -DEXTVERSION=\"0.13.0\" -I. -I./ -I/nix/store/9q4p23a2y63xn8safzzn6lbn07bnkshs-postgresql-17.11/include/server -I/nix/store/9q4p23a2y63xn8safzzn6lbn07bnkshs-postgresql-17.11/include/internal -D_GNU_SOURCE  -I/nix/store/p17klc3qq4nl9ihfwqfpi8cnqvcf92xz-libxml2-2.15.1-dev/include/libxml2 -I/nix/store/mglbi4dy4kpx7v1dcgf6iincp5x38hsc-lz4-1.10.0-dev/include -I/nix/store/g41q9md9rdcr3lkydi6f8zd6fza3h1q4-zstd-1.5.7-dev/include -I/nix/store/n2vnr7ycfk6midbzxcwd28qj3bgb50cz-icu4c-75.1-dev/include  -c -o src/core.o src/core.c1604pg_net-0.13.0> In file included from src/core.c:23:1605pg_net-0.13.0> In function 'init_curl_handle',1606pg_net-0.13.0>     inlined from 'consume_request_queue' at src/core.c:273:5:1607pg_net-0.13.0> src/util.h:6:11: warning: call to 'Wcurl_easy_setopt_err_long' declared with attribute warning: curl_easy_setopt expects a long argument [-Wattribute-warning]1608pg_net-0.13.0>     6 |       if (curl_easy_setopt(hdl, opt, prm) != CURLE_OK) \1609pg_net-0.13.0>       |           ^~~~~~~~~~~~~~~~1610pg_net-0.13.0> src/core.c:94:7: note: in expansion of macro 'CURL_EZ_SETOPT'1611pg_net-0.13.0>    94 |       CURL_EZ_SETOPT(curl_ez_handle, CURLOPT_POST, 1);1612pg_net-0.13.0>       |       ^~~~~~~~~~~~~~1613pg_net-0.13.0> src/util.h:6:11: warning: call to 'Wcurl_easy_setopt_err_long' declared with attribute warning: curl_easy_setopt expects a long argument [-Wattribute-warning]1614pg_net-0.13.0>     6 |       if (curl_easy_setopt(hdl, opt, prm) != CURLE_OK) \1615pg_net-0.13.0>       |           ^~~~~~~~~~~~~~~~1616pg_net-0.13.0> src/core.c:95:7: note: in expansion of macro 'CURL_EZ_SETOPT'1617pg_net-0.13.0>    95 |       CURL_EZ_SETOPT(curl_ez_handle, CURLOPT_POSTFIELDSIZE, 0);1618pg_net-0.13.0>       |       ^~~~~~~~~~~~~~1619pg_net-0.13.0> src/util.h:6:11: warning: call to 'Wcurl_easy_setopt_err_long' declared with attribute warning: curl_easy_setopt expects a long argument [-Wattribute-warning]1620pg_net-0.13.0>     6 |       if (curl_easy_setopt(hdl, opt, prm) != CURLE_OK) \1621pg_net-0.13.0>       |           ^~~~~~~~~~~~~~~~1622pg_net-0.13.0> src/core.c:108:3: note: in expansion of macro 'CURL_EZ_SETOPT'1623pg_net-0.13.0>   108 |   CURL_EZ_SETOPT(curl_ez_handle, CURLOPT_TIMEOUT_MS, timeout_milliseconds);1624pg_net-0.13.0>       |   ^~~~~~~~~~~~~~1625pg_net-0.13.0> src/util.h:6:11: warning: call to 'Wcurl_easy_setopt_err_long' declared with attribute warning: curl_easy_setopt expects a long argument [-Wattribute-warning]1626pg_net-0.13.0>     6 |       if (curl_easy_setopt(hdl, opt, prm) != CURLE_OK) \1627pg_net-0.13.0>       |           ^~~~~~~~~~~~~~~~1628pg_net-0.13.0> src/core.c:110:3: note: in expansion of macro 'CURL_EZ_SETOPT'1629pg_net-0.13.0>   110 |   CURL_EZ_SETOPT(curl_ez_handle, CURLOPT_FOLLOWLOCATION, true);1630pg_net-0.13.0>       |   ^~~~~~~~~~~~~~1631pg_net-0.13.0> gcc -Wall -Wmissing-prototypes -Wpointer-arith -Wdeclaration-after-statement -Werror=vla -Wendif-labels -Wmissing-format-attribute -Wimplicit-fallthrough=3 -Wcast-function-type -Wshadow=compatible-local -Wformat-security -fno-strict-aliasing -fwrapv -fexcess-precision=standard -Wno-format-truncation -Wno-stringop-truncation -g -O2 -std=c11 -Werror -Wno-declaration-after-statement -fPIC -fvisibility=hidden  -DEXTVERSION=\"0.13.0\" -I. -I./ -I/nix/store/9q4p23a2y63xn8safzzn6lbn07bnkshs-postgresql-17.11/include/server -I/nix/store/9q4p23a2y63xn8safzzn6lbn07bnkshs-postgresql-17.11/include/internal -D_GNU_SOURCE  -I/nix/store/p17klc3qq4nl9ihfwqfpi8cnqvcf92xz-libxml2-2.15.1-dev/include/libxml2 -I/nix/store/mglbi4dy4kpx7v1dcgf6iincp5x38hsc-lz4-1.10.0-dev/include -I/nix/store/g41q9md9rdcr3lkydi6f8zd6fza3h1q4-zstd-1.5.7-dev/include -I/nix/store/n2vnr7ycfk6midbzxcwd28qj3bgb50cz-icu4c-75.1-dev/include  -c -o src/event.o src/event.c1632pg_net-0.13.0> In file included from /nix/store/jviasb44hibgh09829gbmbssbz2jjnhz-curl-8.17.0-dev/include/curl/curl.h:3333,1633pg_net-0.13.0>                  from /nix/store/jviasb44hibgh09829gbmbssbz2jjnhz-curl-8.17.0-dev/include/curl/multi.h:51,1634pg_net-0.13.0>                  from src/event.h:4,1635pg_net-0.13.0>                  from src/event.c:6:1636pg_net-0.13.0> /nix/store/jviasb44hibgh09829gbmbssbz2jjnhz-curl-8.17.0-dev/include/curl/multi.h:429:23: error: expected identifier or '(' before '__extension__'1637pg_net-0.13.0>   429 | CURL_EXTERN CURLMcode curl_multi_setopt(CURLM *multi_handle,1638pg_net-0.13.0>       |                       ^~~~~~~~~~~~~~~~~1639pg_net-0.13.0> /nix/store/jviasb44hibgh09829gbmbssbz2jjnhz-curl-8.17.0-dev/include/curl/multi.h:429:23: error: expected identifier or '(' before ')' token1640pg_net-0.13.0>   429 | CURL_EXTERN CURLMcode curl_multi_setopt(CURLM *multi_handle,1641pg_net-0.13.0>       |                       ^~~~~~~~~~~~~~~~~1642pg_net-0.13.0> make: *** [<builtin>: src/event.o] Error 11643error: build of '/nix/store/g6nfp5n056kw2jvfzldzxrrrxfpfcka0-pg_net-0.13.0.drv' on 'ssh-ng://nixbot-remote-build@78.232.36.247' failed: Cannot build '/nix/store/g6nfp5n056kw2jvfzldzxrrrxfpfcka0-pg_net-0.13.0.drv'.1644       Reason: builder failed with exit code 2.1645       Output paths:1646         /nix/store/0z6qc5i8vhckm5s9j7br24f5kfxsgds5-pg_net-0.13.01647       Last 25 log lines:1648       >       |       ^~~~~~~~~~~~~~1649       > src/util.h:6:11: warning: call to 'Wcurl_easy_setopt_err_long' declared with attribute warning: curl_easy_setopt expects a long argument [-Wattribute-warning]1650       >     6 |       if (curl_easy_setopt(hdl, opt, prm) != CURLE_OK) \1651       >       |           ^~~~~~~~~~~~~~~~1652       > src/core.c:108:3: note: in expansion of macro 'CURL_EZ_SETOPT'1653       >   108 |   CURL_EZ_SETOPT(curl_ez_handle, CURLOPT_TIMEOUT_MS, timeout_milliseconds);1654       >       |   ^~~~~~~~~~~~~~1655       > src/util.h:6:11: warning: call to 'Wcurl_easy_setopt_err_long' declared with attribute warning: curl_easy_setopt expects a long argument [-Wattribute-warning]1656       >     6 |       if (curl_easy_setopt(hdl, opt, prm) != CURLE_OK) \1657       >       |           ^~~~~~~~~~~~~~~~1658       > src/core.c:110:3: note: in expansion of macro 'CURL_EZ_SETOPT'1659       >   110 |   CURL_EZ_SETOPT(curl_ez_handle, CURLOPT_FOLLOWLOCATION, true);1660       >       |   ^~~~~~~~~~~~~~1661       > gcc -Wall -Wmissing-prototypes -Wpointer-arith -Wdeclaration-after-statement -Werror=vla -Wendif-labels -Wmissing-format-attribute -Wimplicit-fallthrough=3 -Wcast-function-type -Wshadow=compatible-local -Wformat-security -fno-strict-aliasing -fwrapv -fexcess-precision=standard -Wno-format-truncation -Wno-stringop-truncation -g -O2 -std=c11 -Werror -Wno-declaration-after-statement -fPIC -fvisibility=hidden  -DEXTVERSION=\"0.13.0\" -I. -I./ -I/nix/store/9q4p23a2y63xn8safzzn6lbn07bnkshs-postgresql-17.11/include/server -I/nix/store/9q4p23a2y63xn8safzzn6lbn07bnkshs-postgresql-17.11/include/internal -D_GNU_SOURCE  -I/nix/store/p17klc3qq4nl9ihfwqfpi8cnqvcf92xz-libxml2-2.15.1-dev/include/libxml2 -I/nix/store/mglbi4dy4kpx7v1dcgf6iincp5x38hsc-lz4-1.10.0-dev/include -I/nix/store/g41q9md9rdcr3lkydi6f8zd6fza3h1q4-zstd-1.5.7-dev/include -I/nix/store/n2vnr7ycfk6midbzxcwd28qj3bgb50cz-icu4c-75.1-dev/include  -c -o src/event.o src/event.c1662       > In file included from /nix/store/jviasb44hibgh09829gbmbssbz2jjnhz-curl-8.17.0-dev/include/curl/curl.h:3333,1663       >                  from /nix/store/jviasb44hibgh09829gbmbssbz2jjnhz-curl-8.17.0-dev/include/curl/multi.h:51,1664       >                  from src/event.h:4,1665       >                  from src/event.c:6:1666       > /nix/store/jviasb44hibgh09829gbmbssbz2jjnhz-curl-8.17.0-dev/include/curl/multi.h:429:23: error: expected identifier or '(' before '__extension__'1667       >   429 | CURL_EXTERN CURLMcode curl_multi_setopt(CURLM *multi_handle,1668       >       |                       ^~~~~~~~~~~~~~~~~1669       > /nix/store/jviasb44hibgh09829gbmbssbz2jjnhz-curl-8.17.0-dev/include/curl/multi.h:429:23: error: expected identifier or '(' before ')' token1670       >   429 | CURL_EXTERN CURLMcode curl_multi_setopt(CURLM *multi_handle,1671       >       |                       ^~~~~~~~~~~~~~~~~1672       > make: *** [<builtin>: src/event.o] Error 11673       For full logs, run:1674         nix log /nix/store/g6nfp5n056kw2jvfzldzxrrrxfpfcka0-pg_net-0.13.0.drv1675error: Cannot build '/nix/store/g6nfp5n056kw2jvfzldzxrrrxfpfcka0-pg_net-0.13.0.drv'.1676       Reason: builder failed with exit code 1.1677       Output paths:1678         /nix/store/0z6qc5i8vhckm5s9j7br24f5kfxsgds5-pg_net-0.13.01679building '/nix/store/lbqp8bfrqa2xm82ma6wyq1gijyajh6kh-pg_net-0.13.0.drv' on 'ssh-ng://nixbot-remote-build@78.232.36.247'1680building '/nix/store/lbqp8bfrqa2xm82ma6wyq1gijyajh6kh-pg_net-0.13.0.drv'1681pg_net-0.13.0> Running phase: unpackPhase1682pg_net-0.13.0> unpacking source archive /nix/store/bxdzbzjn4yi7ch55dlcgzk6npzx2p4jz-source1683pg_net-0.13.0> source root is source1684pg_net-0.13.0> Running phase: patchPhase1685pg_net-0.13.0> Running phase: updateAutotoolsGnuConfigScriptsPhase1686pg_net-0.13.0> Running phase: configurePhase1687pg_net-0.13.0> no configure script, doing nothing1688pg_net-0.13.0> Running phase: buildPhase1689pg_net-0.13.0> gcc -Wall -Wmissing-prototypes -Wpointer-arith -Wdeclaration-after-statement -Werror=vla -Wendif-labels -Wmissing-format-attribute -Wimplicit-fallthrough=3 -Wcast-function-type -Wshadow=compatible-local -Wformat-security -fno-strict-aliasing -fwrapv -fexcess-precision=standard -Wno-format-truncation -Wno-stringop-truncation -moutline-atomics -g -O2 -std=c11 -Werror -Wno-declaration-after-statement -fPIC -fvisibility=hidden  -DEXTVERSION=\"0.13.0\" -I. -I./ -I/nix/store/wq2kfr0rkb0hdmf1iwi3mi8pxycakzmq-postgresql-17_22/include/server -I/nix/store/wq2kfr0rkb0hdmf1iwi3mi8pxycakzmq-postgresql-17_22/include/internal -D_GNU_SOURCE  -I/nix/store/p17klc3qq4nl9ihfwqfpi8cnqvcf92xz-libxml2-2.15.1-dev/include/libxml2 -I/nix/store/mglbi4dy4kpx7v1dcgf6iincp5x38hsc-lz4-1.10.0-dev/include -I/nix/store/g41q9md9rdcr3lkydi6f8zd6fza3h1q4-zstd-1.5.7-dev/include -I/nix/store/n2vnr7ycfk6midbzxcwd28qj3bgb50cz-icu4c-75.1-dev/include  -c -o src/worker.o src/worker.c1690pg_net-0.13.0> gcc -Wall -Wmissing-prototypes -Wpointer-arith -Wdeclaration-after-statement -Werror=vla -Wendif-labels -Wmissing-format-attribute -Wimplicit-fallthrough=3 -Wcast-function-type -Wshadow=compatible-local -Wformat-security -fno-strict-aliasing -fwrapv -fexcess-precision=standard -Wno-format-truncation -Wno-stringop-truncation -moutline-atomics -g -O2 -std=c11 -Werror -Wno-declaration-after-statement -fPIC -fvisibility=hidden  -DEXTVERSION=\"0.13.0\" -I. -I./ -I/nix/store/wq2kfr0rkb0hdmf1iwi3mi8pxycakzmq-postgresql-17_22/include/server -I/nix/store/wq2kfr0rkb0hdmf1iwi3mi8pxycakzmq-postgresql-17_22/include/internal -D_GNU_SOURCE  -I/nix/store/p17klc3qq4nl9ihfwqfpi8cnqvcf92xz-libxml2-2.15.1-dev/include/libxml2 -I/nix/store/mglbi4dy4kpx7v1dcgf6iincp5x38hsc-lz4-1.10.0-dev/include -I/nix/store/g41q9md9rdcr3lkydi6f8zd6fza3h1q4-zstd-1.5.7-dev/include -I/nix/store/n2vnr7ycfk6midbzxcwd28qj3bgb50cz-icu4c-75.1-dev/include  -c -o src/util.o src/util.c1691pg_net-0.13.0> gcc -Wall -Wmissing-prototypes -Wpointer-arith -Wdeclaration-after-statement -Werror=vla -Wendif-labels -Wmissing-format-attribute -Wimplicit-fallthrough=3 -Wcast-function-type -Wshadow=compatible-local -Wformat-security -fno-strict-aliasing -fwrapv -fexcess-precision=standard -Wno-format-truncation -Wno-stringop-truncation -moutline-atomics -g -O2 -std=c11 -Werror -Wno-declaration-after-statement -fPIC -fvisibility=hidden  -DEXTVERSION=\"0.13.0\" -I. -I./ -I/nix/store/wq2kfr0rkb0hdmf1iwi3mi8pxycakzmq-postgresql-17_22/include/server -I/nix/store/wq2kfr0rkb0hdmf1iwi3mi8pxycakzmq-postgresql-17_22/include/internal -D_GNU_SOURCE  -I/nix/store/p17klc3qq4nl9ihfwqfpi8cnqvcf92xz-libxml2-2.15.1-dev/include/libxml2 -I/nix/store/mglbi4dy4kpx7v1dcgf6iincp5x38hsc-lz4-1.10.0-dev/include -I/nix/store/g41q9md9rdcr3lkydi6f8zd6fza3h1q4-zstd-1.5.7-dev/include -I/nix/store/n2vnr7ycfk6midbzxcwd28qj3bgb50cz-icu4c-75.1-dev/include  -c -o src/core.o src/core.c1692pg_net-0.13.0> In file included from src/core.c:23:1693pg_net-0.13.0> In function 'init_curl_handle',1694pg_net-0.13.0>     inlined from 'consume_request_queue' at src/core.c:273:5:1695pg_net-0.13.0> src/util.h:6:11: warning: call to 'Wcurl_easy_setopt_err_long' declared with attribute warning: curl_easy_setopt expects a long argument [-Wattribute-warning]1696pg_net-0.13.0>     6 |       if (curl_easy_setopt(hdl, opt, prm) != CURLE_OK) \1697pg_net-0.13.0>       |           ^~~~~~~~~~~~~~~~1698pg_net-0.13.0> src/core.c:94:7: note: in expansion of macro 'CURL_EZ_SETOPT'1699pg_net-0.13.0>    94 |       CURL_EZ_SETOPT(curl_ez_handle, CURLOPT_POST, 1);1700pg_net-0.13.0>       |       ^~~~~~~~~~~~~~1701pg_net-0.13.0> src/util.h:6:11: warning: call to 'Wcurl_easy_setopt_err_long' declared with attribute warning: curl_easy_setopt expects a long argument [-Wattribute-warning]1702pg_net-0.13.0>     6 |       if (curl_easy_setopt(hdl, opt, prm) != CURLE_OK) \1703pg_net-0.13.0>       |           ^~~~~~~~~~~~~~~~1704pg_net-0.13.0> src/core.c:95:7: note: in expansion of macro 'CURL_EZ_SETOPT'1705pg_net-0.13.0>    95 |       CURL_EZ_SETOPT(curl_ez_handle, CURLOPT_POSTFIELDSIZE, 0);1706pg_net-0.13.0>       |       ^~~~~~~~~~~~~~1707pg_net-0.13.0> src/util.h:6:11: warning: call to 'Wcurl_easy_setopt_err_long' declared with attribute warning: curl_easy_setopt expects a long argument [-Wattribute-warning]1708pg_net-0.13.0>     6 |       if (curl_easy_setopt(hdl, opt, prm) != CURLE_OK) \1709pg_net-0.13.0>       |           ^~~~~~~~~~~~~~~~1710pg_net-0.13.0> src/core.c:108:3: note: in expansion of macro 'CURL_EZ_SETOPT'1711pg_net-0.13.0>   108 |   CURL_EZ_SETOPT(curl_ez_handle, CURLOPT_TIMEOUT_MS, timeout_milliseconds);1712pg_net-0.13.0>       |   ^~~~~~~~~~~~~~1713pg_net-0.13.0> src/util.h:6:11: warning: call to 'Wcurl_easy_setopt_err_long' declared with attribute warning: curl_easy_setopt expects a long argument [-Wattribute-warning]1714pg_net-0.13.0>     6 |       if (curl_easy_setopt(hdl, opt, prm) != CURLE_OK) \1715pg_net-0.13.0>       |           ^~~~~~~~~~~~~~~~1716pg_net-0.13.0> src/core.c:110:3: note: in expansion of macro 'CURL_EZ_SETOPT'1717pg_net-0.13.0>   110 |   CURL_EZ_SETOPT(curl_ez_handle, CURLOPT_FOLLOWLOCATION, true);1718pg_net-0.13.0>       |   ^~~~~~~~~~~~~~1719pg_net-0.13.0> gcc -Wall -Wmissing-prototypes -Wpointer-arith -Wdeclaration-after-statement -Werror=vla -Wendif-labels -Wmissing-format-attribute -Wimplicit-fallthrough=3 -Wcast-function-type -Wshadow=compatible-local -Wformat-security -fno-strict-aliasing -fwrapv -fexcess-precision=standard -Wno-format-truncation -Wno-stringop-truncation -moutline-atomics -g -O2 -std=c11 -Werror -Wno-declaration-after-statement -fPIC -fvisibility=hidden  -DEXTVERSION=\"0.13.0\" -I. -I./ -I/nix/store/wq2kfr0rkb0hdmf1iwi3mi8pxycakzmq-postgresql-17_22/include/server -I/nix/store/wq2kfr0rkb0hdmf1iwi3mi8pxycakzmq-postgresql-17_22/include/internal -D_GNU_SOURCE  -I/nix/store/p17klc3qq4nl9ihfwqfpi8cnqvcf92xz-libxml2-2.15.1-dev/include/libxml2 -I/nix/store/mglbi4dy4kpx7v1dcgf6iincp5x38hsc-lz4-1.10.0-dev/include -I/nix/store/g41q9md9rdcr3lkydi6f8zd6fza3h1q4-zstd-1.5.7-dev/include -I/nix/store/n2vnr7ycfk6midbzxcwd28qj3bgb50cz-icu4c-75.1-dev/include  -c -o src/event.o src/event.c1720pg_net-0.13.0> In file included from /nix/store/jviasb44hibgh09829gbmbssbz2jjnhz-curl-8.17.0-dev/include/curl/curl.h:3333,1721pg_net-0.13.0>                  from /nix/store/jviasb44hibgh09829gbmbssbz2jjnhz-curl-8.17.0-dev/include/curl/multi.h:51,1722pg_net-0.13.0>                  from src/event.h:4,1723pg_net-0.13.0>                  from src/event.c:6:1724pg_net-0.13.0> /nix/store/jviasb44hibgh09829gbmbssbz2jjnhz-curl-8.17.0-dev/include/curl/multi.h:429:23: error: expected identifier or '(' before '__extension__'1725pg_net-0.13.0>   429 | CURL_EXTERN CURLMcode curl_multi_setopt(CURLM *multi_handle,1726pg_net-0.13.0>       |                       ^~~~~~~~~~~~~~~~~1727pg_net-0.13.0> /nix/store/jviasb44hibgh09829gbmbssbz2jjnhz-curl-8.17.0-dev/include/curl/multi.h:429:23: error: expected identifier or '(' before ')' token1728pg_net-0.13.0>   429 | CURL_EXTERN CURLMcode curl_multi_setopt(CURLM *multi_handle,1729pg_net-0.13.0>       |                       ^~~~~~~~~~~~~~~~~1730pg_net-0.13.0> make: *** [<builtin>: src/event.o] Error 11731error: build of '/nix/store/lbqp8bfrqa2xm82ma6wyq1gijyajh6kh-pg_net-0.13.0.drv' on 'ssh-ng://nixbot-remote-build@78.232.36.247' failed: Cannot build '/nix/store/lbqp8bfrqa2xm82ma6wyq1gijyajh6kh-pg_net-0.13.0.drv'.1732       Reason: builder failed with exit code 2.1733       Output paths:1734         /nix/store/517wbr5c7xb4fvch9kn0zim5j3hnjzpa-pg_net-0.13.01735       Last 25 log lines:1736       >       |       ^~~~~~~~~~~~~~1737       > src/util.h:6:11: warning: call to 'Wcurl_easy_setopt_err_long' declared with attribute warning: curl_easy_setopt expects a long argument [-Wattribute-warning]1738       >     6 |       if (curl_easy_setopt(hdl, opt, prm) != CURLE_OK) \1739       >       |           ^~~~~~~~~~~~~~~~1740       > src/core.c:108:3: note: in expansion of macro 'CURL_EZ_SETOPT'1741       >   108 |   CURL_EZ_SETOPT(curl_ez_handle, CURLOPT_TIMEOUT_MS, timeout_milliseconds);1742       >       |   ^~~~~~~~~~~~~~1743       > src/util.h:6:11: warning: call to 'Wcurl_easy_setopt_err_long' declared with attribute warning: curl_easy_setopt expects a long argument [-Wattribute-warning]1744       >     6 |       if (curl_easy_setopt(hdl, opt, prm) != CURLE_OK) \1745       >       |           ^~~~~~~~~~~~~~~~1746       > src/core.c:110:3: note: in expansion of macro 'CURL_EZ_SETOPT'1747       >   110 |   CURL_EZ_SETOPT(curl_ez_handle, CURLOPT_FOLLOWLOCATION, true);1748       >       |   ^~~~~~~~~~~~~~1749       > gcc -Wall -Wmissing-prototypes -Wpointer-arith -Wdeclaration-after-statement -Werror=vla -Wendif-labels -Wmissing-format-attribute -Wimplicit-fallthrough=3 -Wcast-function-type -Wshadow=compatible-local -Wformat-security -fno-strict-aliasing -fwrapv -fexcess-precision=standard -Wno-format-truncation -Wno-stringop-truncation -moutline-atomics -g -O2 -std=c11 -Werror -Wno-declaration-after-statement -fPIC -fvisibility=hidden  -DEXTVERSION=\"0.13.0\" -I. -I./ -I/nix/store/wq2kfr0rkb0hdmf1iwi3mi8pxycakzmq-postgresql-17_22/include/server -I/nix/store/wq2kfr0rkb0hdmf1iwi3mi8pxycakzmq-postgresql-17_22/include/internal -D_GNU_SOURCE  -I/nix/store/p17klc3qq4nl9ihfwqfpi8cnqvcf92xz-libxml2-2.15.1-dev/include/libxml2 -I/nix/store/mglbi4dy4kpx7v1dcgf6iincp5x38hsc-lz4-1.10.0-dev/include -I/nix/store/g41q9md9rdcr3lkydi6f8zd6fza3h1q4-zstd-1.5.7-dev/include -I/nix/store/n2vnr7ycfk6midbzxcwd28qj3bgb50cz-icu4c-75.1-dev/include  -c -o src/event.o src/event.c1750       > In file included from /nix/store/jviasb44hibgh09829gbmbssbz2jjnhz-curl-8.17.0-dev/include/curl/curl.h:3333,1751       >                  from /nix/store/jviasb44hibgh09829gbmbssbz2jjnhz-curl-8.17.0-dev/include/curl/multi.h:51,1752       >                  from src/event.h:4,1753       >                  from src/event.c:6:1754       > /nix/store/jviasb44hibgh09829gbmbssbz2jjnhz-curl-8.17.0-dev/include/curl/multi.h:429:23: error: expected identifier or '(' before '__extension__'1755       >   429 | CURL_EXTERN CURLMcode curl_multi_setopt(CURLM *multi_handle,1756       >       |                       ^~~~~~~~~~~~~~~~~1757       > /nix/store/jviasb44hibgh09829gbmbssbz2jjnhz-curl-8.17.0-dev/include/curl/multi.h:429:23: error: expected identifier or '(' before ')' token1758       >   429 | CURL_EXTERN CURLMcode curl_multi_setopt(CURLM *multi_handle,1759       >       |                       ^~~~~~~~~~~~~~~~~1760       > make: *** [<builtin>: src/event.o] Error 11761       For full logs, run:1762         nix log /nix/store/lbqp8bfrqa2xm82ma6wyq1gijyajh6kh-pg_net-0.13.0.drv1763error: Cannot build '/nix/store/lbqp8bfrqa2xm82ma6wyq1gijyajh6kh-pg_net-0.13.0.drv'.1764       Reason: builder failed with exit code 1.1765       Output paths:1766         /nix/store/517wbr5c7xb4fvch9kn0zim5j3hnjzpa-pg_net-0.13.01767building '/nix/store/rdglczxf0sk4hhwsppqw13zl43vf5wr0-pg_net-0.14.0.drv' on 'ssh-ng://nixbot-remote-build@78.232.36.247'1768building '/nix/store/rdglczxf0sk4hhwsppqw13zl43vf5wr0-pg_net-0.14.0.drv'1769pg_net-0.14.0> Running phase: unpackPhase1770pg_net-0.14.0> unpacking source archive /nix/store/cijlkfxy6vfh6pbq2nd4v8pc51nxn75y-source1771pg_net-0.14.0> source root is source1772pg_net-0.14.0> Running phase: patchPhase1773pg_net-0.14.0> Running phase: updateAutotoolsGnuConfigScriptsPhase1774pg_net-0.14.0> Running phase: configurePhase1775pg_net-0.14.0> no configure script, doing nothing1776pg_net-0.14.0> Running phase: buildPhase1777pg_net-0.14.0> gcc -Wall -Wmissing-prototypes -Wpointer-arith -Wdeclaration-after-statement -Werror=vla -Wendif-labels -Wmissing-format-attribute -Wimplicit-fallthrough=3 -Wcast-function-type -Wshadow=compatible-local -Wformat-security -fno-strict-aliasing -fwrapv -fexcess-precision=standard -Wno-format-truncation -Wno-stringop-truncation -moutline-atomics -g -O2 -std=c11 -Werror -Wno-declaration-after-statement -fPIC -fvisibility=hidden  -DEXTVERSION=\"0.14.0\" -I. -I./ -I/nix/store/wq2kfr0rkb0hdmf1iwi3mi8pxycakzmq-postgresql-17_22/include/server -I/nix/store/wq2kfr0rkb0hdmf1iwi3mi8pxycakzmq-postgresql-17_22/include/internal -D_GNU_SOURCE  -I/nix/store/p17klc3qq4nl9ihfwqfpi8cnqvcf92xz-libxml2-2.15.1-dev/include/libxml2 -I/nix/store/mglbi4dy4kpx7v1dcgf6iincp5x38hsc-lz4-1.10.0-dev/include -I/nix/store/g41q9md9rdcr3lkydi6f8zd6fza3h1q4-zstd-1.5.7-dev/include -I/nix/store/n2vnr7ycfk6midbzxcwd28qj3bgb50cz-icu4c-75.1-dev/include  -c -o src/core.o src/core.c1778pg_net-0.14.0> In file included from src/core.c:23:1779pg_net-0.14.0> In function 'init_curl_handle',1780pg_net-0.14.0>     inlined from 'consume_request_queue' at src/core.c:306:5:1781pg_net-0.14.0> src/errors.h:6:11: warning: call to 'Wcurl_easy_setopt_err_long' declared with attribute warning: curl_easy_setopt expects a long argument [-Wattribute-warning]1782pg_net-0.14.0>     6 |       if (curl_easy_setopt(hdl, opt, prm) != CURLE_OK) \1783pg_net-0.14.0>       |           ^~~~~~~~~~~~~~~~1784pg_net-0.14.0> src/core.c:120:7: note: in expansion of macro 'EREPORT_CURL_SETOPT'1785pg_net-0.14.0>   120 |       EREPORT_CURL_SETOPT(curl_ez_handle, CURLOPT_POST, 1);1786pg_net-0.14.0>       |       ^~~~~~~~~~~~~~~~~~~1787pg_net-0.14.0> src/errors.h:6:11: warning: call to 'Wcurl_easy_setopt_err_long' declared with attribute warning: curl_easy_setopt expects a long argument [-Wattribute-warning]1788pg_net-0.14.0>     6 |       if (curl_easy_setopt(hdl, opt, prm) != CURLE_OK) \1789pg_net-0.14.0>       |           ^~~~~~~~~~~~~~~~1790pg_net-0.14.0> src/core.c:121:7: note: in expansion of macro 'EREPORT_CURL_SETOPT'1791pg_net-0.14.0>   121 |       EREPORT_CURL_SETOPT(curl_ez_handle, CURLOPT_POSTFIELDSIZE, 0);1792pg_net-0.14.0>       |       ^~~~~~~~~~~~~~~~~~~1793pg_net-0.14.0> src/errors.h:6:11: warning: call to 'Wcurl_easy_setopt_err_long' declared with attribute warning: curl_easy_setopt expects a long argument [-Wattribute-warning]1794pg_net-0.14.0>     6 |       if (curl_easy_setopt(hdl, opt, prm) != CURLE_OK) \1795pg_net-0.14.0>       |           ^~~~~~~~~~~~~~~~1796pg_net-0.14.0> src/core.c:134:3: note: in expansion of macro 'EREPORT_CURL_SETOPT'1797pg_net-0.14.0>   134 |   EREPORT_CURL_SETOPT(curl_ez_handle, CURLOPT_TIMEOUT_MS, cdata->timeout_milliseconds);1798pg_net-0.14.0>       |   ^~~~~~~~~~~~~~~~~~~1799pg_net-0.14.0> src/errors.h:6:11: warning: call to 'Wcurl_easy_setopt_err_long' declared with attribute warning: curl_easy_setopt expects a long argument [-Wattribute-warning]1800pg_net-0.14.0>     6 |       if (curl_easy_setopt(hdl, opt, prm) != CURLE_OK) \1801pg_net-0.14.0>       |           ^~~~~~~~~~~~~~~~1802pg_net-0.14.0> src/core.c:136:3: note: in expansion of macro 'EREPORT_CURL_SETOPT'1803pg_net-0.14.0>   136 |   EREPORT_CURL_SETOPT(curl_ez_handle, CURLOPT_FOLLOWLOCATION, true);1804pg_net-0.14.0>       |   ^~~~~~~~~~~~~~~~~~~1805pg_net-0.14.0> gcc -Wall -Wmissing-prototypes -Wpointer-arith -Wdeclaration-after-statement -Werror=vla -Wendif-labels -Wmissing-format-attribute -Wimplicit-fallthrough=3 -Wcast-function-type -Wshadow=compatible-local -Wformat-security -fno-strict-aliasing -fwrapv -fexcess-precision=standard -Wno-format-truncation -Wno-stringop-truncation -moutline-atomics -g -O2 -std=c11 -Werror -Wno-declaration-after-statement -fPIC -fvisibility=hidden  -DEXTVERSION=\"0.14.0\" -I. -I./ -I/nix/store/wq2kfr0rkb0hdmf1iwi3mi8pxycakzmq-postgresql-17_22/include/server -I/nix/store/wq2kfr0rkb0hdmf1iwi3mi8pxycakzmq-postgresql-17_22/include/internal -D_GNU_SOURCE  -I/nix/store/p17klc3qq4nl9ihfwqfpi8cnqvcf92xz-libxml2-2.15.1-dev/include/libxml2 -I/nix/store/mglbi4dy4kpx7v1dcgf6iincp5x38hsc-lz4-1.10.0-dev/include -I/nix/store/g41q9md9rdcr3lkydi6f8zd6fza3h1q4-zstd-1.5.7-dev/include -I/nix/store/n2vnr7ycfk6midbzxcwd28qj3bgb50cz-icu4c-75.1-dev/include  -c -o src/errors.o src/errors.c1806pg_net-0.14.0> gcc -Wall -Wmissing-prototypes -Wpointer-arith -Wdeclaration-after-statement -Werror=vla -Wendif-labels -Wmissing-format-attribute -Wimplicit-fallthrough=3 -Wcast-function-type -Wshadow=compatible-local -Wformat-security -fno-strict-aliasing -fwrapv -fexcess-precision=standard -Wno-format-truncation -Wno-stringop-truncation -moutline-atomics -g -O2 -std=c11 -Werror -Wno-declaration-after-statement -fPIC -fvisibility=hidden  -DEXTVERSION=\"0.14.0\" -I. -I./ -I/nix/store/wq2kfr0rkb0hdmf1iwi3mi8pxycakzmq-postgresql-17_22/include/server -I/nix/store/wq2kfr0rkb0hdmf1iwi3mi8pxycakzmq-postgresql-17_22/include/internal -D_GNU_SOURCE  -I/nix/store/p17klc3qq4nl9ihfwqfpi8cnqvcf92xz-libxml2-2.15.1-dev/include/libxml2 -I/nix/store/mglbi4dy4kpx7v1dcgf6iincp5x38hsc-lz4-1.10.0-dev/include -I/nix/store/g41q9md9rdcr3lkydi6f8zd6fza3h1q4-zstd-1.5.7-dev/include -I/nix/store/n2vnr7ycfk6midbzxcwd28qj3bgb50cz-icu4c-75.1-dev/include  -c -o src/event.o src/event.c1807pg_net-0.14.0> In file included from /nix/store/jviasb44hibgh09829gbmbssbz2jjnhz-curl-8.17.0-dev/include/curl/curl.h:3333,1808pg_net-0.14.0>                  from /nix/store/jviasb44hibgh09829gbmbssbz2jjnhz-curl-8.17.0-dev/include/curl/multi.h:51,1809pg_net-0.14.0>                  from src/event.h:4,1810pg_net-0.14.0>                  from src/event.c:6:1811pg_net-0.14.0> /nix/store/jviasb44hibgh09829gbmbssbz2jjnhz-curl-8.17.0-dev/include/curl/multi.h:429:23: error: expected identifier or '(' before '__extension__'1812pg_net-0.14.0>   429 | CURL_EXTERN CURLMcode curl_multi_setopt(CURLM *multi_handle,1813pg_net-0.14.0>       |                       ^~~~~~~~~~~~~~~~~1814pg_net-0.14.0> /nix/store/jviasb44hibgh09829gbmbssbz2jjnhz-curl-8.17.0-dev/include/curl/multi.h:429:23: error: expected identifier or '(' before ')' token1815pg_net-0.14.0>   429 | CURL_EXTERN CURLMcode curl_multi_setopt(CURLM *multi_handle,1816pg_net-0.14.0>       |                       ^~~~~~~~~~~~~~~~~1817pg_net-0.14.0> make: *** [<builtin>: src/event.o] Error 11818error: build of '/nix/store/rdglczxf0sk4hhwsppqw13zl43vf5wr0-pg_net-0.14.0.drv' on 'ssh-ng://nixbot-remote-build@78.232.36.247' failed: Cannot build '/nix/store/rdglczxf0sk4hhwsppqw13zl43vf5wr0-pg_net-0.14.0.drv'.1819       Reason: builder failed with exit code 2.1820       Output paths:1821         /nix/store/dljg9dqcggn0gx9wwgbw43zdg392qhq2-pg_net-0.14.01822       Last 25 log lines:1823       > src/errors.h:6:11: warning: call to 'Wcurl_easy_setopt_err_long' declared with attribute warning: curl_easy_setopt expects a long argument [-Wattribute-warning]1824       >     6 |       if (curl_easy_setopt(hdl, opt, prm) != CURLE_OK) \1825       >       |           ^~~~~~~~~~~~~~~~1826       > src/core.c:134:3: note: in expansion of macro 'EREPORT_CURL_SETOPT'1827       >   134 |   EREPORT_CURL_SETOPT(curl_ez_handle, CURLOPT_TIMEOUT_MS, cdata->timeout_milliseconds);1828       >       |   ^~~~~~~~~~~~~~~~~~~1829       > src/errors.h:6:11: warning: call to 'Wcurl_easy_setopt_err_long' declared with attribute warning: curl_easy_setopt expects a long argument [-Wattribute-warning]1830       >     6 |       if (curl_easy_setopt(hdl, opt, prm) != CURLE_OK) \1831       >       |           ^~~~~~~~~~~~~~~~1832       > src/core.c:136:3: note: in expansion of macro 'EREPORT_CURL_SETOPT'1833       >   136 |   EREPORT_CURL_SETOPT(curl_ez_handle, CURLOPT_FOLLOWLOCATION, true);1834       >       |   ^~~~~~~~~~~~~~~~~~~1835       > gcc -Wall -Wmissing-prototypes -Wpointer-arith -Wdeclaration-after-statement -Werror=vla -Wendif-labels -Wmissing-format-attribute -Wimplicit-fallthrough=3 -Wcast-function-type -Wshadow=compatible-local -Wformat-security -fno-strict-aliasing -fwrapv -fexcess-precision=standard -Wno-format-truncation -Wno-stringop-truncation -moutline-atomics -g -O2 -std=c11 -Werror -Wno-declaration-after-statement -fPIC -fvisibility=hidden  -DEXTVERSION=\"0.14.0\" -I. -I./ -I/nix/store/wq2kfr0rkb0hdmf1iwi3mi8pxycakzmq-postgresql-17_22/include/server -I/nix/store/wq2kfr0rkb0hdmf1iwi3mi8pxycakzmq-postgresql-17_22/include/internal -D_GNU_SOURCE  -I/nix/store/p17klc3qq4nl9ihfwqfpi8cnqvcf92xz-libxml2-2.15.1-dev/include/libxml2 -I/nix/store/mglbi4dy4kpx7v1dcgf6iincp5x38hsc-lz4-1.10.0-dev/include -I/nix/store/g41q9md9rdcr3lkydi6f8zd6fza3h1q4-zstd-1.5.7-dev/include -I/nix/store/n2vnr7ycfk6midbzxcwd28qj3bgb50cz-icu4c-75.1-dev/include  -c -o src/errors.o src/errors.c1836       > gcc -Wall -Wmissing-prototypes -Wpointer-arith -Wdeclaration-after-statement -Werror=vla -Wendif-labels -Wmissing-format-attribute -Wimplicit-fallthrough=3 -Wcast-function-type -Wshadow=compatible-local -Wformat-security -fno-strict-aliasing -fwrapv -fexcess-precision=standard -Wno-format-truncation -Wno-stringop-truncation -moutline-atomics -g -O2 -std=c11 -Werror -Wno-declaration-after-statement -fPIC -fvisibility=hidden  -DEXTVERSION=\"0.14.0\" -I. -I./ -I/nix/store/wq2kfr0rkb0hdmf1iwi3mi8pxycakzmq-postgresql-17_22/include/server -I/nix/store/wq2kfr0rkb0hdmf1iwi3mi8pxycakzmq-postgresql-17_22/include/internal -D_GNU_SOURCE  -I/nix/store/p17klc3qq4nl9ihfwqfpi8cnqvcf92xz-libxml2-2.15.1-dev/include/libxml2 -I/nix/store/mglbi4dy4kpx7v1dcgf6iincp5x38hsc-lz4-1.10.0-dev/include -I/nix/store/g41q9md9rdcr3lkydi6f8zd6fza3h1q4-zstd-1.5.7-dev/include -I/nix/store/n2vnr7ycfk6midbzxcwd28qj3bgb50cz-icu4c-75.1-dev/include  -c -o src/event.o src/event.c1837       > In file included from /nix/store/jviasb44hibgh09829gbmbssbz2jjnhz-curl-8.17.0-dev/include/curl/curl.h:3333,1838       >                  from /nix/store/jviasb44hibgh09829gbmbssbz2jjnhz-curl-8.17.0-dev/include/curl/multi.h:51,1839       >                  from src/event.h:4,1840       >                  from src/event.c:6:1841       > /nix/store/jviasb44hibgh09829gbmbssbz2jjnhz-curl-8.17.0-dev/include/curl/multi.h:429:23: error: expected identifier or '(' before '__extension__'1842       >   429 | CURL_EXTERN CURLMcode curl_multi_setopt(CURLM *multi_handle,1843       >       |                       ^~~~~~~~~~~~~~~~~1844       > /nix/store/jviasb44hibgh09829gbmbssbz2jjnhz-curl-8.17.0-dev/include/curl/multi.h:429:23: error: expected identifier or '(' before ')' token1845       >   429 | CURL_EXTERN CURLMcode curl_multi_setopt(CURLM *multi_handle,1846       >       |                       ^~~~~~~~~~~~~~~~~1847       > make: *** [<builtin>: src/event.o] Error 11848       For full logs, run:1849         nix log /nix/store/rdglczxf0sk4hhwsppqw13zl43vf5wr0-pg_net-0.14.0.drv1850error: Cannot build '/nix/store/rdglczxf0sk4hhwsppqw13zl43vf5wr0-pg_net-0.14.0.drv'.1851       Reason: builder failed with exit code 1.1852       Output paths:1853         /nix/store/dljg9dqcggn0gx9wwgbw43zdg392qhq2-pg_net-0.14.0