nixbot

builds
1these 3 derivations will be built:2 /nix/store/s0vv7iysq2xrh9gx0p3ask3ciiy9rncn-start-postgres-server-test.drv3 /nix/store/b9carrw88y946y14l9087p04hafcpjf7-postgres-17-check-harness.drv4 /nix/store/kaiqpv3dppbknajp4aj4c3g4wp7079ii-run-check-harness-psql-17-slim.drv5error: Cannot build '/nix/store/kaiqpv3dppbknajp4aj4c3g4wp7079ii-run-check-harness-psql-17-slim.drv'.6 Reason: builder failed with exit code 1.7 Output paths:8 /nix/store/2mr0ihkv6n6gsmb9m3kv49flr39x042p-run-check-harness-psql-17-slim9 Last 25 log lines:10 > test roles ... ok 13 ms11 > test security ... ok 11 ms12 > test storage ... ok 15 ms13 > test supautils_reserved_roles ... ok 7 ms14 > test supautils_restrict_versions ... ok 82 ms15 > test vault ... ok 28 ms16 > test wal2json ... ok 15 ms17 > test z_17_ext_interface ... FAILED 114 ms18 > test z_17_intarray_ltree_query ... ok 14 ms19 > test z_17_pg_stat_monitor ... ok 7 ms20 > test z_17_pgvector ... ok 15 ms21 > test z_17_roles ... ok 15 ms22 > test z_17_rum ... ok 16 ms23 >24 > =======================25 > 2 of 68 tests failed.26 > =======================27 >28 > The differences that caused some tests to fail can be viewed in the29 > file "/nix/store/2mr0ihkv6n6gsmb9m3kv49flr39x042p-run-check-harness-psql-17-slim/regression_output/regression.diffs". A copy of the test summary that you see30 > above is saved in the file "/nix/store/2mr0ihkv6n6gsmb9m3kv49flr39x042p-run-check-harness-psql-17-slim/regression_output/regression.out".31 >32 > 2026-10-06 11:32:58 [ERROR] pg_regress tests failed33 > 2026-10-06 11:32:58 [ERROR] An error occurred. Exit code: 134 > 2026-10-06 11:32:58 [ERROR] Debug logs:35 For full logs, run:36 nix log /nix/store/kaiqpv3dppbknajp4aj4c3g4wp7079ii-run-check-harness-psql-17-slim.drv