nixbot

builds
1these 3 derivations will be built:2 /nix/store/ssbhsw721gvn1dyac1x6zhfwqj8d1f2i-start-postgres-server-test.drv3 /nix/store/k0jlakp1gzwryvd2m1nf1w5h8ipm0w4m-postgres-15-check-harness.drv4 /nix/store/a3jkv4i829jq9832w6by7j30qzc7ad8h-run-check-harness-psql-15-slim.drv5error: Cannot build '/nix/store/a3jkv4i829jq9832w6by7j30qzc7ad8h-run-check-harness-psql-15-slim.drv'.6 Reason: builder failed with exit code 1.7 Output paths:8 /nix/store/p2adh1s2gnax8bb8hklh7c6pl3c4ylqz-run-check-harness-psql-15-slim9 Last 25 log lines:10 > test supautils_restrict_versions ... ok 84 ms11 > test vault ... ok 29 ms12 > test wal2json ... ok 15 ms13 > test z_15_ext_interface ... FAILED 684 ms14 > test z_15_intarray_ltree_query ... ok 12 ms15 > test z_15_pg_stat_monitor ... ok 11 ms16 > test z_15_pgjwt ... ok 19 ms17 > test z_15_pgvector ... ok 32 ms18 > test z_15_plv8 ... ok 49 ms19 > test z_15_roles ... ok 20 ms20 > test z_15_rum ... ok 21 ms21 > test z_15_timescale ... ok 25 ms22 > test z_15_unhype_timescale_to_partman ... ok 11748 ms23 >24 > =======================25 > 2 of 72 tests failed.26 > =======================27 >28 > The differences that caused some tests to fail can be viewed in the29 > file "/nix/store/p2adh1s2gnax8bb8hklh7c6pl3c4ylqz-run-check-harness-psql-15-slim/regression_output/regression.diffs". A copy of the test summary that you see30 > above is saved in the file "/nix/store/p2adh1s2gnax8bb8hklh7c6pl3c4ylqz-run-check-harness-psql-15-slim/regression_output/regression.out".31 >32 > 2026-10-06 11:33:15 [ERROR] pg_regress tests failed33 > 2026-10-06 11:33:15 [ERROR] An error occurred. Exit code: 134 > 2026-10-06 11:33:15 [ERROR] Debug logs:35 For full logs, run:36 nix log /nix/store/a3jkv4i829jq9832w6by7j30qzc7ad8h-run-check-harness-psql-15-slim.drv