nixbot

builds
1this derivation will be built:2 /nix/store/dlq1am1n7c9s5s17d364r4i2ixfykzix-run-check-harness-psql-15.drv3these 2 paths will be fetched (23.2 KiB download, 92.0 KiB unpacked):4 /nix/store/f3jbx5cvr32x8ympzjragb98y45dznap-postgres-15-check-harness5 /nix/store/f2pdj42s5r9ryqv5bd8mg9bga74vraj6-start-postgres-server-test6error: Cannot build '/nix/store/dlq1am1n7c9s5s17d364r4i2ixfykzix-run-check-harness-psql-15.drv'.7 Reason: builder failed with exit code 1.8 Output paths:9 /nix/store/4nnkh6bas4krq4avcn7zi9l1aibcilz9-run-check-harness-psql-1510 Last 25 log lines:11 > test supautils_restrict_versions ... ok 84 ms12 > test vault ... ok 29 ms13 > test wal2json ... ok 13 ms14 > test z_15_ext_interface ... FAILED 693 ms15 > test z_15_intarray_ltree_query ... ok 12 ms16 > test z_15_pg_stat_monitor ... ok 12 ms17 > test z_15_pgjwt ... ok 19 ms18 > test z_15_pgvector ... ok 34 ms19 > test z_15_plv8 ... ok 52 ms20 > test z_15_roles ... ok 17 ms21 > test z_15_rum ... ok 20 ms22 > test z_15_timescale ... ok 26 ms23 > test z_15_unhype_timescale_to_partman ... ok 11441 ms24 >25 > =======================26 > 2 of 72 tests failed.27 > =======================28 >29 > The differences that caused some tests to fail can be viewed in the30 > file "/nix/store/4nnkh6bas4krq4avcn7zi9l1aibcilz9-run-check-harness-psql-15/regression_output/regression.diffs". A copy of the test summary that you see31 > above is saved in the file "/nix/store/4nnkh6bas4krq4avcn7zi9l1aibcilz9-run-check-harness-psql-15/regression_output/regression.out".32 >33 > 2026-10-06 11:33:29 [ERROR] pg_regress tests failed34 > 2026-10-06 11:33:29 [ERROR] An error occurred. Exit code: 135 > 2026-10-06 11:33:29 [ERROR] Debug logs:36 For full logs, run:37 nix log /nix/store/dlq1am1n7c9s5s17d364r4i2ixfykzix-run-check-harness-psql-15.drv