this derivation will be built: /nix/store/ms23slpgvz54z8x8bz5kxskmjmyvdcrd-run-check-harness-psql-17.drv error: build of '/nix/store/ms23slpgvz54z8x8bz5kxskmjmyvdcrd-run-check-harness-psql-17.drv' on 'ssh-ng://nixbot-remote-build@62.210.193.142' failed: Cannot build '/nix/store/ms23slpgvz54z8x8bz5kxskmjmyvdcrd-run-check-harness-psql-17.drv'. Reason: builder failed with exit code 1. Output paths: /nix/store/2n5nqavmq2ryy18w8hwwl1iqivrgp3mi-run-check-harness-psql-17 Last 25 log lines: > test roles ... ok 33 ms > test security ... ok 31 ms > test storage ... ok 44 ms > test supautils_reserved_roles ... ok 29 ms > test supautils_restrict_versions ... ok 77 ms > test vault ... ok 48 ms > test wal2json ... ok 29 ms > test z_17_ext_interface ... FAILED 105 ms > test z_17_intarray_ltree_query ... ok 30 ms > test z_17_pg_stat_monitor ... ok 20 ms > test z_17_pgvector ... ok 22 ms > test z_17_roles ... ok 25 ms > test z_17_rum ... ok 26 ms > > ======================= > 2 of 67 tests failed. > ======================= > > The differences that caused some tests to fail can be viewed in the > file "/nix/store/2n5nqavmq2ryy18w8hwwl1iqivrgp3mi-run-check-harness-psql-17/regression_output/regression.diffs". A copy of the test summary that you see > above is saved in the file "/nix/store/2n5nqavmq2ryy18w8hwwl1iqivrgp3mi-run-check-harness-psql-17/regression_output/regression.out". > > 2026-10-05 16:40:14 [ERROR] pg_regress tests failed > 2026-10-05 16:40:14 [ERROR] An error occurred. Exit code: 1 > 2026-10-05 16:40:14 [ERROR] Debug logs: For full logs, run: nix log /nix/store/ms23slpgvz54z8x8bz5kxskmjmyvdcrd-run-check-harness-psql-17.drv error: Cannot build '/nix/store/ms23slpgvz54z8x8bz5kxskmjmyvdcrd-run-check-harness-psql-17.drv'. Reason: builder failed with exit code 1. Output paths: /nix/store/2n5nqavmq2ryy18w8hwwl1iqivrgp3mi-run-check-harness-psql-17