nixbot

builds

supabase/postgres build #489 failed

branch develop · PR #2593 · commit e0b3df9ee3 · · took 39m 2s · eval 9m 7s

2 failed
failed attributes
status attribute duration
failed checks.aarch64-linux.ext-pg_cron 6m 45s
vm-test-run-pg_cron: !!! RequestedAssertionFailed: unit "postgresql.service" is inactive and there are no pending jobs cleanup kill machine (pid 9) qemu-system- …
vm-test-run-pg_cron:
!!! RequestedAssertionFailed: unit "postgresql.service" is inactive and there are no pending jobs
cleanup
kill machine (pid 9)
qemu-system-aarch64: terminating on signal 15 from pid 6 (/nix/store/y88crn50yx35fiiwcjx6xqwi6ahk7mlq-python3-3.13.11/bin/python3.13)
vde_switch: EOF data port: Interrupted system call
kill vlan (pid 7)
vde_switch: vde_switch: Caught signal 15, cleaning up and exiting
(finished: cleanup, in 0.01 seconds)
failed checks.aarch64-linux.psql_orioledb-17_slim 1m 57s
run-check-harness-psql-orioledb-17-slim: 1 of 67 tests failed. ======================= The differences that caused some tests to fail can be viewed in the fil …
run-check-harness-psql-orioledb-17-slim:
 1 of 67 tests failed. 
=======================
The differences that caused some tests to fail can be viewed in the
file "/nix/store/f66qh2fh06r1i37bbw03jnfysp694mx7-run-check-harness-psql-orioledb-17-slim/regression_output/regression.diffs".  A copy of the test summary that you see
above is saved in the file "/nix/store/f66qh2fh06r1i37bbw03jnfysp694mx7-run-check-harness-psql-orioledb-17-slim/regression_output/regression.out".
2026-10-28 10:50:51 [ERROR] pg_regress tests failed
2026-10-28 10:50:51 [ERROR] An error occurred. Exit code: 1
2026-10-28 10:50:51 [ERROR] Debug logs:
72 succeeded
succeeded attributes
status attribute duration
loading…
62 already built
skipped attributes
status attribute duration
loading…