nixbot

builds

cancelled checks.aarch64-linux.psql_orioledb-17 build #473 · raw · eval 5.2 s · 195.1 MiB allocated · ·

1these 333 derivations will be built:2  /nix/store/0f5pzsjk75ly0y0s40zfnnqfhx4s1q8a-vector-0.7.0.drv3  /nix/store/0z269aqlj6wp74wx7ypqpzxnmn93sa5l-vector-0.8.0.drv4  /nix/store/140k8r00jrq7xm8prgybddiygv6y0myn-vector-0.6.2.drv5  /nix/store/1wc4a57d8m7763d1jcfkn303m8ghyc0x-vector-0.7.4.drv6  /nix/store/95l3xg1ym6cfxngl2bsl0p0734r5xqc6-vector-0.4.0.drv7  /nix/store/asrym2b7yfhyy87fk0lnpvjfhhcc7cnc-vector-0.8.2.drv8  /nix/store/gh6pr0kp8y1lpb0vyzx4665jn0nrkbnc-vector-0.5.1.drv9  /nix/store/q20ycljk94izdvymf6z375m5a978vk5r-vector-0.6.0.drv10  /nix/store/00a351w2k8wd2l61bac5wg50qa2hm4ai-vector.drv11  /nix/store/08q581ngf8fx9v62wa4aq8glcsy37vby-pgtap-1.3.3.drv12  /nix/store/0b70ch8iwvqnkj155y23a8h7z400l16p-wrappers-0.5.5.drv13  /nix/store/1csyswpxgzzcag63281b3r27i9hdg7ah-safeupdate-1.4.drv14  /nix/store/0bmxfmf46m1r9w1q5wjl1xzi9r1qgirr-safeupdate.drv15  /nix/store/9qbbl3p7wsh5iwdd0i1h377h1yfxmrnv-pgaudit-17.0.drv16  /nix/store/l7hi6y6xyq3l68bwzn23gaqyl4n49vh5-pgaudit-17.1.drv17  /nix/store/0l3z4sjlwvcpzd3va4pvdkcnrk4a6yy8-pgaudit.drv18  /nix/store/0m5cns76lj96dm62z2v5ql10fixdv8mj-rum-1.3.drv19  /nix/store/0qxnj9sgg8pvaksv11lb8ln5va31cr19-pg_net-0.19.5.drv20  /nix/store/0vhnhv1n5jxdxy2w1hmdx1920b193x71-hypopg.drv21  /nix/store/ww3lr1f9yndzli35jbdb4jwjhwr0xf4c-http-1.6.1.drv22  /nix/store/0x83lnqlq23i6r05cwgqacz1sl49alls-http.drv23  /nix/store/0y65h6h65q03gl3f1rp1n8xhf9sm8gv0-plan_filter-0.1.drv24  /nix/store/ayylscr3rnv7b8jy573xavslwjm34xs9-pg_repack-1.4.8.drv25  /nix/store/cq3zf8jvw7zr6j79aw564kg4pxlg867b-pg_repack-1.5.2.drv26  /nix/store/cw8ra9zgx6ayvfhrhyadxfxcamyvsf28-pg_repack-1.5.0.drv27  /nix/store/lzmdgd9l5f5mwja1z9p5bnmik9ys5y6w-pg_repack-1.5.1.drv28  /nix/store/0zh9s9wzhk71bsx6ccilskmggziyapg0-pg_repack.drv29  /nix/store/2nmbfmbwc4r46n5rn3fwvf4vhxv75s5c-pg_net-0.14.0.drv30  /nix/store/5mhpaw68bks5sq6951xgyqxwjd8xmxfr-pg_net-0.20.4.drv31  /nix/store/6j3j8z0x0vpvcf74xp7p8ffjby8b7mp5-pg_net-0.7.1.drv32  /nix/store/9hcgh425487agi7v1yayivzsm8ivl63p-pg_net-0.8.0.drv33  /nix/store/b8nk9jbsbrp1c3hj20f91b2fanydpffb-pg_net-0.11.0.drv34  /nix/store/gs3bfrd6w8j2sfwpxlvmbvb23r9wayrq-pg_net-0.20.0.drv35  /nix/store/n27q4jzly9s78m7fcbc1h37gg65qc323-pg_net-0.2.drv36  /nix/store/n58pcf9bsll99r6q9l5xf50x8m96aak3-pg_net-0.20.3.drv37  /nix/store/pmsb2cipa3sh5b1x9spv779xvc86ngxl-pg_net-0.7.drv38  /nix/store/rdk6gks8iag5485lr0xsw5j2yd3kpfxh-pg_net-0.13.0.drv39  /nix/store/rvy95m7q01mivcqyd9jmgk1gnvchnmfa-pg_net-0.6.drv40  /nix/store/15x2ylh2r836kylraz00gar8r64z9c3v-pg_net.drv41  /nix/store/1825w5xw6bcknsyx4q8dg88h75k4dq36-pg_graphql-1.5.11.drv42  /nix/store/1bqw77gimsw66f829hpgj9kaaahr4c7g-pg_net-0.19.5.drv43  /nix/store/1ihmwiy45rq4b1q45hw9s8pqz6fhcd73-pg_net-0.20.4.drv44  /nix/store/1rd6xhwknbkvzb45ilzj5kwpzk9qgswd-pg_stat_monitor.drv45  /nix/store/1v40zf8d32al19dn5vcc7f495l3kizph-pgsodium-3.1.7.drv46  /nix/store/26fn0rb3qzxawci6lpsi0rvkhlarm5mw-pg_graphql-1.6.1.drv47  /nix/store/i4bvf139s4nqq5yamskvd2sfygkb7r2k-wal2json-2.6.drv48  /nix/store/2r99g6gmckbndmgkw98973paxahqzq8m-wal2json.drv49  /nix/store/34w595ii74k9ppmp32xyvvny84d39fsw-pg_partman.drv50  /nix/store/7qhs8rqz8knar5ifs37ykzf05a0cv9rv-pg_repack-1.4.8.drv51  /nix/store/gn5yzpcf5idlnszdamlwbx3rbym6malx-pg_repack-1.5.0.drv52  /nix/store/i84kdpgpsm2j9754nnclgli4wxaiyig2-pg_repack-1.5.2.drv53  /nix/store/nljyfikjf5clwah60mjp8m3g0ha68x8c-pg_repack-1.5.1.drv54  /nix/store/3wrrr0m5rl3v1jlvv45mcjc3cij9nhwg-pg_repack.drv55  /nix/store/41ibpqvx5lwdrx1gwrqfakkf39j4pjq1-pgaudit-17.0.drv56  /nix/store/gqwnscrk1fsz3h1avfb46sk68amz6li1-pgaudit-17.1.drv57  /nix/store/617sgsfb1kg2wwhv7xd11pjbdp08wvc4-pgaudit.drv58  /nix/store/4flmjbrnrzwd3dj4wqgwichbdj3gm9vg-pgroonga-3.2.5.drv59  /nix/store/cpvvl9hggasr03685wxkllbj9y06zfih-pgroonga.drv60  /nix/store/d0jzfq6zy19wzl9kkfqkm6zr1mbj1j11-pgmq-1.5.1.drv61  /nix/store/d55x9w0jd2ibiirmyk8hayyg9xv7pl4s-pgmq.drv62  /nix/store/di7w3jzyj5wi4xq4k1sikj269nm165dk-supautils.drv63  /nix/store/3ra23mgj1jkgphixmzf7zkniprr8m1v7-wrappers-0.5.3.drv64  /nix/store/a71dcdl4iv0s4pdi3nc95vdxpqwgymz4-wrappers-0.5.0.drv65  /nix/store/al9zb9hrs5d3qhl7shpmz1yisaxam4wi-wrappers-0.6.3.drv66  /nix/store/fwy32lzzw8464lgwlfcjgazid27fy0b3-wrappers-0.6.2.drv67  /nix/store/g462mkwai8ngjkwcw7k2qiiwbamjpj2w-wrappers-0.5.4.drv68  /nix/store/jsza7phkrfyi7rbl8liym55dvrzb8fzz-wrappers-0.4.4.drv69  /nix/store/nsdbbzm3d5yjrnnsas26qgxc817y41r2-wrappers-0.4.6.drv70  /nix/store/p9rsvpqr2yi8qki844y50z0nf9aqr408-wrappers-0.5.6.drv71  /nix/store/rbkdj2w2jznvc5xv0c3d2qmzz0dglagf-wrappers-0.5.7.drv72  /nix/store/wbys69cj2n7n4yq5ym7l7b8z66fvkkfq-wrappers-0.6.1.drv73  /nix/store/zi5xbr6jpdy7b3x3slhi5477ngrfv95s-wrappers-0.4.5.drv74  /nix/store/zj2d4614hmbns41qw2pz982kbzialvyv-wrappers-0.6.0.drv75  /nix/store/fc6n41k2w3wbdbl5l6mn0hqvwm0kcpfg-wrappers.drv76  /nix/store/7lycdzfnvgkw1f7lna5s8c1njsgah1hq-pg_tle-1.0.4.drv77  /nix/store/83lnjslzha8b2a10izi9cr1p6cgk1wfm-pg_tle-1.4.0.drv78  /nix/store/y8cw2d463r1lw5r4ml9jfda6ayz8ilk6-pg_tle-1.3.0.drv79  /nix/store/fcfb8xbl5kvx3m6icj6ncxk1bnkmmvxr-pg_tle.drv80  /nix/store/fbwjcxn85q138dkds5hkfj1b1ya3r5j2-pg_hashids-1.3.0-cd0e1b31d52b394a0df64079406a14a4f7387cd6.drv81  /nix/store/jn7fznj63vd9g2aqfl7xfipmh0c67gdn-pg_hashids.drv82  /nix/store/7zp57l5f9k6fyx8c2jgbmb3xs6rixcd4-pgrouting-3.4.1.drv83  /nix/store/jvb65k2k3rbimz0phb6mpp3jvzamky34-pgrouting.drv84  /nix/store/3ig5q2gzy2slavmiszby2zhdbc1fl51w-vector-0.8.0.drv85  /nix/store/4qd0mrrxj10cys1ia7qyhfykiig1l3g3-vector-0.7.4.drv86  /nix/store/8kijw5d8mxlmnirmywrihf297y8zv1ys-vector-0.5.1.drv87  /nix/store/bcig0ch6nx8c9v49470amjh5lh0mb7fs-vector-0.6.2.drv88  /nix/store/bx8i72mqp6dx8m7wkdvp7jfyc0vldbn3-vector-0.7.0.drv89  /nix/store/gsr1iv3zisa8pm2nyib4abqy7qn4kia0-vector-0.6.0.drv90  /nix/store/igbfxbpkpj708sllvfv7cni5dvlqp1zi-vector-0.8.2.drv91  /nix/store/kgc8r6gxk7mwrj7v250xqjxgasmgfq39-vector.drv92  /nix/store/5fhpy9zjwqq7ddpik2bxkf2w0dpyswp2-pg_net-0.20.3.drv93  /nix/store/adh4mcpp5xpvccs1lb9h2yxsxnsx1yki-pg_net-0.14.0.drv94  /nix/store/aj6g6xamdg369wpqfwyd70z3i1qnfdqq-pg_net-0.11.0.drv95  /nix/store/idn2icvvirzwp2wv92fp1xm1w0rfz28p-pg_net-0.19.5.drv96  /nix/store/s4zrcj6vh69fk10vrni21s240rgikah0-pg_net-0.20.0.drv97  /nix/store/yf2bi43b51ga6m8q3mhcb0rvacb0qw9s-pg_net-0.13.0.drv98  /nix/store/kvs292wck9hlpzy1yl7bh9j9w5hg7dbw-pg_net.drv99  /nix/store/x1nagg4mf8qh475y5npjqycz6rg413fd-safeupdate-1.4.drv100  /nix/store/l9xb7zxch6hwhp309ikdp19r37i245m9-safeupdate.drv101  /nix/store/8nq5kffdbw07v8bvalc93gy4jh9yl012-supabase_vault-0.3.1.drv102  /nix/store/ix4p0pamicpal8pzmf6gh6vvdvjk3q2m-supabase_vault-0.2.8.drv103  /nix/store/lgdxj8jfg7gjzka1mm5q0vr6hq8mbm83-supabase_vault.drv104  /nix/store/b969bk5wq13fd7gx3nssbqi3nykmxqc7-pg_cron-1.6.4.drv105  /nix/store/lq44ynk7kmbwnvfl7adlmpz9bdlmk1yg-pg_cron.drv106  /nix/store/9aj3kjr4xsfzj152ds53g1f6v9s4zhzk-pgsodium-3.0.4.drv107  /nix/store/i5gbk2dkga52y12nifmgw4yai5s0vjp3-pgsodium-3.1.8.drv108  /nix/store/w6lpmp7a1raizb2rbl817rwy73j9v81w-pgsodium-3.1.5.drv109  /nix/store/zxciqwidzr9a32ga5zvsk9k288ik84lb-pgsodium-3.1.6.drv110  /nix/store/p4p4bbpp28h6hj0a6kk3s5kjhz1j97is-pgsodium.drv111  /nix/store/3lnsfq42g59dcv6izyrkm2gngm74p2cs-pg_graphql-1.6.1.drv112  /nix/store/61mvnpi4a66dffaphz77pymqyxij3m2z-pg_graphql-1.5.9.drv113  /nix/store/s76s3s72y8srwfdnkbzng326n2zilc4i-pg_graphql-1.6.2.drv114  /nix/store/pdbh8xq7fp4wwx79pgb22dwkh6spwnsh-pg_graphql.drv115  /nix/store/phyxfqmnc31py5a14b53q3wiiav32ldl-plan_filter.drv116  /nix/store/pp8p5ph74pd3bf8afvp5nn3msvqybf7p-plpgsql_check-2.7.drv117  /nix/store/qmxp5zj9iq03hrchykmqdnarm9rhyn12-plpgsql_check-2.8.drv118  /nix/store/pw797x71ggpb0mpnbx2xdg0n9anrgmxb-plpgsql_check.drv119  /nix/store/gamh0pnvb0bjz17p9i80rb8rvdvzb1kv-pgtap-1.3.3.drv120  /nix/store/k9ks00ccwblb86rzfl0xs8ml78nzl9ph-pgtap-1.3.1.drv121  /nix/store/qmq0jk586xdwxbcw2h5imrs4jkn6fwfg-pgtap.drv122  /nix/store/khbaryz92a9p43isj0ffvyqpas6a5asv-sfcgal-2.2.0.drv123  /nix/store/yzjmajka8ainv2rs9hr4b5nsnrbz8647-gdal-3.8.5.drv124  /nix/store/mcgccpm3blzlkfrdv994hyxz1h23m0df-postgis-3.3.7.drv125  /nix/store/rr37ihfdyyp412bb8r795397m4b8plqz-postgis.drv126  /nix/store/vhg6ghpirk2wddxi5a4g4qd0lcvk0p97-rum.drv127  /nix/store/fh3wjmw2iqabi3ph2vnckix0ns8y22kf-pg_jsonschema-0.3.3.drv128  /nix/store/xh9j8wvdlk1376dw8vv3dzvv7wrng9qj-pg_jsonschema.drv129  /nix/store/rl5c2d3qsm2ays55vdgfjv401b18y5qy-index_advisor-0.2.0.drv130  /nix/store/sy4iy1inmn39iv88fh2vvjzvq8m3vxkb-index_advisor-0.2.1.drv131  /nix/store/zzcwq74h6271fs0f0icwklh1kn1ldyr2-index_advisor.drv132  /nix/store/90552xhrcnnsf3agdz2v68gfxs92qfza-postgresql-and-plugins-17.11.drv133  /nix/store/94a9ir29mhwfz32f9pxapxi3p1pmnrqc-receipt.drv134  /nix/store/274vlsv715gpqpwl4llbx72fpgz5n14g-postgresql-and-plugins-17.11.drv135  /nix/store/4aisqki8njs0zq654vfkqmqzh4wbp7ik-pg_repack-1.5.2.drv136  /nix/store/4as5ixpyb6x7g5px1asmyy1qpfqnlpjz-pg_repack-1.4.8.drv137  /nix/store/ld03dq33rx5laq5qm2dfi0hp3g7hh5cy-pg_repack-1.5.1.drv138  /nix/store/snm0dxhxqmmgq9c03gqhmrafngb6y9rz-pg_repack-1.5.0.drv139  /nix/store/2bffnv3kpqb0ds37awxn31id57wbnfww-pg_repack.drv140  /nix/store/2d97540fv1lpdpivdzphhy8am2dyr8r4-pg_graphql-1.2.3.drv141  /nix/store/2g7vgzxilw1jrqvk2nww87l24i8vk9vh-pg_net-0.20.4.drv142  /nix/store/2iwlyh3a087d6md5grmwdivmp9k7pi5x-wrappers-0.4.2.drv143  /nix/store/vcrgvyc2b3jdd6p98dydnpsdlmai6mpd-pgmq-1.5.1.drv144  /nix/store/2x8sr5sknccg4n323ipk8a1pg73lvvi7-pgmq.drv145  /nix/store/75l9jfbjnp69lc9mcwf4j3zas5723chv-vector-0.7.4.drv146  /nix/store/gipwzai2smrmdhwsi9505ppncc4zm57d-vector-0.8.2.drv147  /nix/store/gw4c6w7kwjsswxvkygk3jfrj5s3qjwp9-vector-0.5.1.drv148  /nix/store/h7jpn72v4bwp2pm1zpv55mb94wfmyj8c-vector-0.6.2.drv149  /nix/store/r7296bf6s0hlvf6k6kz81ng3admk19y7-vector-0.8.0.drv150  /nix/store/rsdbh6ys9jjfhfr04bg169jdly24cvsq-vector-0.6.0.drv151  /nix/store/z6aryaxgd01s3csz3pg904g22a9hw3sl-vector-0.7.0.drv152  /nix/store/2yvqixdhzdr3dzvfg32dy0zclmn7ryg6-vector.drv153  /nix/store/487l8bxzd9r33nq5skgxdk7zcspl3cnr-pg_partman.drv154  /nix/store/9704wcydniirzcxl7ll7ci5mkphn49vg-pgrouting-3.4.1.drv155  /nix/store/7zd796d6i7g9jxgz202yw7wzwwqm0xbs-pgrouting.drv156  /nix/store/f9mc0bplrplvfsbanvgp7nz93lqk6j6s-http-1.6.1.drv157  /nix/store/8zmg1yajhqyhr59qc52afc27sn9xamza-http.drv158  /nix/store/vvv1d3w15mgambbb6qscdjb74gg6ayn6-pg_jsonschema-0.3.3.drv159  /nix/store/b25cdmcmamk34wxy8mzybc014khpb1b0-pg_jsonschema.drv160  /nix/store/cz6hmpzzi2cjrl8gj9w0xa6z9y507f8b-plpgsql_check-2.8.drv161  /nix/store/z1x46azyys6zij15vg5iqllm0sagqny1-plpgsql_check-2.7.drv162  /nix/store/bsrcjjdd8b3x6d0y6ihcr9xpxig2hvg9-plpgsql_check.drv163  /nix/store/dplk4s5apvvz4971q1q1m4y51djkfm5x-pg_tle-1.3.0.drv164  /nix/store/l83vxccsaw64g3j0ss4ykjxf34wdjccp-pg_tle-1.4.0.drv165  /nix/store/bx18r50hmm16y4d5ssy72ghd61a7g8wr-pg_tle.drv166  /nix/store/4vlh1x1x3zsnl2rhadkw211dsjc6hzpa-pgtap-1.3.3.drv167  /nix/store/h7rd17i7f96dn0dwimj5dmikwz5m61qx-pgtap.drv168  /nix/store/9n2d04gq5l0985p9203b74gxj94qwqmx-gdal-3.8.5.drv169  /nix/store/ba7h61cwss8j5wxmkam96qqay9s2hn6p-postgis-3.3.7.drv170  /nix/store/ipsgs1l5vflyv185q7vnvan30m0lwhlw-postgis.drv171  /nix/store/nbx721l1sslrmcgl6jylp0fd4q66z4fx-pgroonga-3.2.5.drv172  /nix/store/ivwjjb86w84sfpwqkh9jid0j3rrcqkyh-pgroonga.drv173  /nix/store/70a99c51n78cfwcjb3lngqsj9ja5bpki-plan_filter-0.1.drv174  /nix/store/k2w7q47azl2fj1z1171gxy9jp737r033-plan_filter.drv175  /nix/store/khfhym4c19mncms93kh6lpd39696wb9n-supautils.drv176  /nix/store/kj0nlh6274lwff18mavjbn1jbxscbm9n-hypopg.drv177  /nix/store/kpx5pd9dd3gwbkihghpki2ql7xsrg1gn-pg_stat_monitor-2.1.drv178  /nix/store/n7x3apbqi8b3m6h6qfgismnz9bf64vlw-pg_stat_monitor.drv179  /nix/store/k7mk7qm3n65cnv2srxi1gsq3jgk25r66-pg_hashids-1.2.1.drv180  /nix/store/wldajgac1n6fv74bshfrz42jmbnxlbp0-pg_hashids-1.3.0-cd0e1b31d52b394a0df64079406a14a4f7387cd6.drv181  /nix/store/nrfcw9vgmvdkidh7111a36rg3w7z9h01-pg_hashids.drv182  /nix/store/fgdcm9higmw7ck1msnzcs4p4vir4a5dc-index_advisor-0.2.0.drv183  /nix/store/j1k1yh41g9ch0g3gf8n38hx61iw9rs5k-index_advisor-0.2.1.drv184  /nix/store/nsycjsaa5pmc6qjc4r946w9pxkf56zzp-index_advisor.drv185  /nix/store/3mkvaj0lc4v67fqm59s9wr9hwm96nw9i-pg_net-0.20.0.drv186  /nix/store/9aj9m31w0h7hcmnbx1fqd9mxwrl5s032-pg_net-0.14.0.drv187  /nix/store/c9xviq5dbvilsrxfvslac23vl0as7v92-pg_net-0.20.3.drv188  /nix/store/hrn5qdnhv0rg4w1pfa6v2s9vvy3080wi-pg_net-0.13.0.drv189  /nix/store/x8jxs7agbcvam007ylcrk766l7fgazhi-pg_net-0.11.0.drv190  /nix/store/p35j8v78nfl29idwgryfglw2v3bgz23a-pg_net.drv191  /nix/store/532l8m1dinlkszwsnxp2hpkzwr4dr28y-pgsodium-3.1.5.drv192  /nix/store/75r64nj0181nzpg27s0313skc3mx131d-pgsodium-3.1.7.drv193  /nix/store/g0dk6x8l9gx4w1819qqvl9prfbsh0hgj-pgsodium-3.0.4.drv194  /nix/store/r5hp5f9c95dkrndhshzr0dahkh24rg3s-pgsodium-3.1.8.drv195  /nix/store/wpc1ifwmcccqlvdv1h53n1hxlxiplnvi-pgsodium-3.1.6.drv196  /nix/store/qsk74cca9wjx5ycndn8693p3dy3q4z0l-pgsodium.drv197  /nix/store/mdd0pfpi2f85x21gwpzi39qvbjnhmb7x-safeupdate-1.4.drv198  /nix/store/qyrrixcnp2yzmh40p2zggfm94glf3x7c-safeupdate.drv199  /nix/store/37xdkyaqphcf3i6dpxcp8smxn8hy9vl4-wrappers-0.5.4.drv200  /nix/store/84q99xbv6apn51c071wp9qg6mfjfh2q2-wrappers-0.6.3.drv201  /nix/store/94ryxzpyr22il8f2r1qkz68a46y1lbr6-wrappers-0.5.5.drv202  /nix/store/952jv6j7mhgdl8kqs2mn0hhqh11441zm-wrappers-0.5.7.drv203  /nix/store/gavzcx5iy39h881gh7gpnmn1d17jmkv1-wrappers-0.4.6.drv204  /nix/store/hg97zp6nhihsyd3fpirlsqasaq0zn0yl-wrappers-0.5.6.drv205  /nix/store/mb0yvdyb04f03g5naiix5n91zwj4y47m-wrappers-0.4.5.drv206  /nix/store/mwglp67vwpr2h4g05v2g02mc7900x8wx-wrappers-0.6.0.drv207  /nix/store/nr8birdqgagjjskmsfgkxlb6nkphc62f-wrappers-0.4.4.drv208  /nix/store/pc21nynd9x3zm74mpdnhvhkzyfi0zsq2-wrappers-0.5.3.drv209  /nix/store/vivfb7i24njkf3d8zvp6ykkr50s4axg5-wrappers-0.6.2.drv210  /nix/store/w0mk2x2jviysijn6yw82g02dmi6f787j-wrappers-0.5.0.drv211  /nix/store/w52n2n970pxzgai4pwh1kzl3ik9lxwxh-wrappers-0.6.1.drv212  /nix/store/s0psr9aqch7zss333q8p0y1kpica6b5z-wrappers.drv213  /nix/store/vsqdadm69v4w8yb0fggryzvb87z70y6g-rum-1.3.drv214  /nix/store/s2ilv35s7h13kcf9azskpxhgw1ivhf8i-rum.drv215  /nix/store/kyvlc6436f3y1x4026nryjvlpm8xzd1s-supabase_vault-0.2.8.drv216  /nix/store/l5p7gbxxcczv5lwqnyql8awzk2878pdi-supabase_vault-0.3.1.drv217  /nix/store/sw5wvsvc9j6wa8wwnisz0pm2y8z96lvm-supabase_vault.drv218  /nix/store/63hyl8xsljb5f5xkcj9ijm0gnahrm1xj-pg_graphql-1.6.1.drv219  /nix/store/b9dmsdagjh34saxi45wgawgq389csdyi-pg_graphql-1.5.11.drv220  /nix/store/c2zk9rycmw0vwa3qq1pyplnh513fkq9j-pg_graphql-1.5.9.drv221  /nix/store/w0bpwzz5zdfm8qnhwz483r3slpilmb0x-pg_graphql-1.6.2.drv222  /nix/store/v28ahsirc4vmfn1l07kihqgjph3lrj4m-pg_graphql.drv223  /nix/store/8ang9rmqys1aclwfhiisk2754znkm80j-wal2json-2.6.drv224  /nix/store/ykkdshr554q95a76ym6nfaqp2grj9wfb-wal2json.drv225  /nix/store/mxwlby61q216yh9wcyllplwig6pkrq4p-pg_cron-1.6.4.drv226  /nix/store/zdgxm3yzl3rc46xjhngzmznzazw0yz47-pg_cron.drv227  /nix/store/8rkq0v0vzd8qxj9hxs92krannjx3wp14-postgresql-and-plugins-17_22.drv228  /nix/store/agk970fwy2pw0skxp73jk3g83z766h5b-receipt.drv229  /nix/store/2qhy0xjz2dnxg8xdlcgbjaczrwfqhqsn-postgresql-and-plugins-17_22.drv230  /nix/store/2rq7ss3x1rfdljra4pnv6qryp4hndym8-rum-1.3.drv231  /nix/store/2z6acyjswb75mgpalfgxd1f54d0yrx00-plv8-3.1.5.drv232  /nix/store/325yf3yfi8jx2ndmpa95c4n06xisghdk-pg_graphql-1.0.2.drv233  /nix/store/7rqv622yy14bn825jwj32n7lhbcvs16a-pgmq-1.5.1.drv234  /nix/store/ydshamqx75gbawn4839946c91fm5alf7-pgmq-1.4.4.drv235  /nix/store/3f6k95m95wdg530hab7f0ngc3ar2zdjf-pgmq.drv236  /nix/store/a1zw6badsj7lgfj8mqmjgmnc68h7d8ni-supabase_vault-0.3.1.drv237  /nix/store/vy7aannkny9c9pfw6dazd3vc7311zf37-supabase_vault-0.2.8.drv238  /nix/store/3izndgbsw5399ixbgb7nkw13r0sl4qaw-supabase_vault.drv239  /nix/store/3j3p0qwydls7hpdxmbrcsxps2vz6jbfn-timescaledb-2.9.1.drv240  /nix/store/4c051z9bv4diia0jv8mwf0pqa32rn086-pg_graphql-1.5.1.drv241  /nix/store/4dy6capyaxx9jiw2hnh62i8d899zvbl7-pg_jsonschema-0.3.1.drv242  /nix/store/54c61xamz0agmbkpq968r93qly3fwm7q-wrappers-0.5.3.drv243  /nix/store/5j6b9h5d66cbvy2bspsdynapmifryys2-pgsodium-3.1.7.drv244  /nix/store/5m3nn42qqsazch0knlsfsjk1dw6djzj4-wrappers-0.6.1.drv245  /nix/store/iyqgynqsv64k0b3hr6i9cvwp4qbxqcd5-index_advisor-0.2.0.drv246  /nix/store/mfix33qj69lhgb2bvr1j62xcdp1h1y4c-hypopg.drv247  /nix/store/zxajzalkdm0rv11mvd0hiy2qr8sfw8rl-index_advisor-0.2.1.drv248  /nix/store/5ynhxa9wdzb913f1q808gavswplsdwl9-index_advisor.drv249  /nix/store/6kpm9wiza85lwn3zygnnhhiwcx0jwc03-pgsodium-3.1.5.drv250  /nix/store/nd5k960wh12rpxcxr07h1mvqkm5ix8h5-timescaledb-2.16.1.drv251  /nix/store/6xllrrwdmkiyf76ynhcij4qbbldmh71d-timescaledb.drv252  /nix/store/mbhrh171hpvkid8lyawpisf1nizqx5ix-pg_jsonschema-0.2.0.drv253  /nix/store/mf581vfc3rays5n33yifqg8wsdyc7xqn-pg_jsonschema-0.3.3.drv254  /nix/store/9a7a0bmdxpajkl7kmyf6pq6wj03kq2ib-pg_jsonschema.drv255  /nix/store/b67h42v24f8q0qbair995ybn3px7fr6k-pgrouting-3.4.1.drv256  /nix/store/9vym4yi5inj4rrl74m47lbxs2712pfm3-pgrouting.drv257  /nix/store/gbp83irwcnykdjpfxsjk182xznmiddjq-plpgsql_check-2.7.drv258  /nix/store/n5ghj3gi3w0gavymiarnsxi5sg5w8cfb-plpgsql_check-2.2.drv259  /nix/store/ylkf1hkzyiah1gkxknnd94z72j4grb6g-plpgsql_check-2.8.drv260  /nix/store/a62giqbh1z7xjy4bf6bqf1v06bwb19dn-plpgsql_check.drv261  /nix/store/bfqnks8xwkan5n18b2cswrmn4zlrs7dw-supautils.drv262  /nix/store/7553w2rln4dj9nlc38vd5fs47lgg3s08-wrappers-0.5.5.drv263  /nix/store/7ph8kw32w5m73l9a3v44mbp9mfxg6d8j-wrappers-0.4.5.drv264  /nix/store/cjwl8n3gpyfqmq4az906qncljlgmcp6d-wrappers-0.6.3.drv265  /nix/store/dj4z29qgd138hzqkls9sfnbdr17zcsc5-wrappers-0.6.0.drv266  /nix/store/fxbk433nnvzhaj2pml7asvh2zr0nc8q6-wrappers-0.4.3.drv267  /nix/store/h2b5c91pdy91a8jkhnkdqvsgm67pd4vx-wrappers-0.5.7.drv268  /nix/store/hg7gkclsf3kx46r64mm9m3dnsilnx9w8-wrappers-0.6.2.drv269  /nix/store/hxchhwq08wvp1yvcmsgx6d7ylh489cz5-wrappers-0.3.0.drv270  /nix/store/jj6kipi10p2l7kwja706kfy3zakh3yv7-wrappers-0.5.0.drv271  /nix/store/kya2awmbbzfjb51wwps36h9sv4h2wm3i-wrappers-0.4.6.drv272  /nix/store/nkmm23lcwh0v6v7x8ja0k0x47whvb92h-wrappers-0.5.4.drv273  /nix/store/qcaqqjzk1achv1zq8yrgx7zqnaq5mikl-wrappers-0.5.6.drv274  /nix/store/w0bw3gynjlmrzqc8xpgy1371ssl2ada2-wrappers-0.4.4.drv275  /nix/store/yqljly15yz1jlghvrahb42zavk2si5fp-wrappers-0.4.1.drv276  /nix/store/cm4ichkr1v3ksqfszvqpa08hjsgbjq56-wrappers.drv277  /nix/store/xpa5s1m4sw7w7faln7cggjv5ysg3ghc6-plan_filter-0.1.drv278  /nix/store/f76w7hkdj29qvj3c6fmahn46qc53cq1k-plan_filter.drv279  /nix/store/fs27zx1ly6ywxagh4vr0d239wxyf651q-pgtap.drv280  /nix/store/a50ky6hkds7pwp82kgm70j8pf9f3f4xm-pg_cron-1.5.2.drv281  /nix/store/isjw82mxvhs9sw30dh7mq44whp7hgr5w-pg_cron-1.6.4.drv282  /nix/store/hwn4k8izpb3xw6f2wi4nlnahmvb3bxzh-pg_cron.drv283  /nix/store/xi9yfl6p5mmgjfj2zv2qc14z668yk2f7-wal2json-2.6.drv284  /nix/store/jbr4aikfg14920d88j5mm4g6qgk8i23f-wal2json.drv285  /nix/store/pbmzq25by7fg0df56r901zz16w0xvpiz-pg_stat_monitor-2.1.drv286  /nix/store/jrrwpv2291afz3688c5rjiwsjlwg15mv-pg_stat_monitor.drv287  /nix/store/ikyw1h0ls2j6fryx71yis05nirwbm6cp-plv8-3.1.10.drv288  /nix/store/lgqsnf165p7zbawa6xskmhzmp50zy4xr-plv8-3.1.4.drv289  /nix/store/jwqaj0bkc43h74x9aghhk58k24gbc8dd-plv8.drv290  /nix/store/bxqdc2m723vsr1p81pvqj4k4zy20mc1l-pg_tle-1.3.0.drv291  /nix/store/pyfrmdskarsk92in9a4pr31kz8gw43gv-pg_tle-1.0.4.drv292  /nix/store/v2xb010kwcfxdk90cz21yf1m4h6sqj7l-pg_tle-1.4.0.drv293  /nix/store/lhvwsvmv7gpzr9n30xd486j9m8v34hvk-pg_tle.drv294  /nix/store/a4m1lflk6vjw0lzdcpb1gbf0bmcfqrv0-pg_hashids-1.2.1.drv295  /nix/store/qpwlqdcvdbzr6pd7q3rwkdq4hisipbqq-pg_hashids-1.3.0-cd0e1b31d52b394a0df64079406a14a4f7387cd6.drv296  /nix/store/mgma5yd04lqb71b1x8q8absvvjib6ayv-pg_hashids.drv297  /nix/store/mvswxgb3q1swkkh16yi0yarw56gqrm00-rum.drv298  /nix/store/l5lq63gk5bp7j4lrc73lh8vwl8zpyism-pgaudit-1.7.1.drv299  /nix/store/mv3i0cbzpapid9bgfrnyg5yjlixjdc0r-pgaudit-1.7.0.drv300  /nix/store/s2cikfjvjq2m137lkrk0py2x5vpq6jny-pgaudit.drv301  /nix/store/zs4jhmljjjqlziakcw6misqgla085g93-http-1.6.1.drv302  /nix/store/wjslhyw34hv6i5grih3j3sbb62q6zr9a-http.drv303  /nix/store/gkhcj9h87qg9q5rg5y1ly2d8sl71jj3v-pgsodium-3.0.4.drv304  /nix/store/rjlqx38lhgj70l65ly405q8mw8vaxvad-pgsodium-3.1.8.drv305  /nix/store/x98girz0pj5bxyxri9d0sabi5s0hpwl0-pgsodium-3.1.6.drv306  /nix/store/xzfbz414rlcnlfp43mbr7cwmgqw6dd0x-pgsodium.drv307  /nix/store/y0r8wl6xdnl4jqkngg6m2av9ml9mmhqs-pg_partman.drv308  /nix/store/wmahr2aakhg9718j8qjsk8dgxhqxycpb-gdal-3.8.5.drv309  /nix/store/m3vbcrddsbypghx41llhs3fw3dxzyh6l-postgis-3.3.2.drv310  /nix/store/ybqij8lx2nad5957wl7ifssgfvi7bg4f-postgis.drv311  /nix/store/s1ibllsfjmz3kvcgfcv4cd31gvq98r9b-pgroonga-3.2.5.drv312  /nix/store/w0d5frbwa5dd26dr5r3azrj6s358i4g0-pgroonga-3.0.7.drv313  /nix/store/zhpgxwrcm88brf5lpmw0bw40r5875qhr-pgroonga.drv314  /nix/store/95b1rzgciqh5xy8inalxq7370hn2f2m8-pg_graphql-1.1.0.drv315  /nix/store/9f94yvgw5hrz2jjzagd543lykidi76w5-pg_graphql-1.4.2.drv316  /nix/store/a496hwlnv3r89dkv60fmmwbff5i3zqc7-pg_graphql-1.5.11.drv317  /nix/store/bqap5yqr48aznl3j1h5k2yhvc99d9c33-pg_graphql-1.5.7.drv318  /nix/store/d3cd2aihrx4q64wgsy0a7pxbsrgzcmh8-pg_graphql-1.4.4.drv319  /nix/store/fhmf2803z73lv6ryzq1427gyk0098k16-pg_graphql-1.2.0.drv320  /nix/store/fzkqqymhxyrwzcgg3lvq18yn2j5mf9im-pg_graphql-1.5.1-mergeless.drv321  /nix/store/mp5hrhajad9d1lrli35zybq5klawxb48-pg_graphql-1.4.1.drv322  /nix/store/p0gbqi8bspd8xh2gk8dvfjphn624pyh3-pg_graphql-1.2.2.drv323  /nix/store/v7sa7kywvzvxis2c7b76w4jc0arcbp0m-pg_graphql-1.5.6.drv324  /nix/store/ybg01jvqbvnpgrazcnnhyfrgalk9mvyz-pg_graphql-1.6.2.drv325  /nix/store/yda6awhhivif3n8jn8arql4k0glg560m-pg_graphql-1.5.4.drv326  /nix/store/ykzk834jbir2cayjcnrr4m5wiam80kr8-pg_graphql-1.5.0.drv327  /nix/store/zj90anjy23060h6p64ycs0ldx4wpja5z-pg_graphql-1.5.9.drv328  /nix/store/zv2isif0w19crf4rq24mqq2f282x1cl6-pg_graphql.drv329  /nix/store/aicf8lxqn9gbjzjismqhmil6hss9pjzv-postgresql-and-plugins-15.19.drv330  /nix/store/c861x06gw6mchb269icdg1zgax79gs79-receipt.drv331  /nix/store/9mfbc7x1y40li9wy8bkgzd236b7cas43-postgresql-and-plugins-15.19.drv332  /nix/store/fscfawdlcb24d5l00c3zi155fh31s39p-start-postgres-server-test.drv333  /nix/store/73cnmnpr07dryxcbwlsx6v93xky78jfm-postgres-orioledb-17-check-harness.drv334  /nix/store/ckra4pq5rnii01mwnl48rwvp4c0scmfn-run-check-harness-psql-orioledb-17.drv335building '/nix/store/ww3lr1f9yndzli35jbdb4jwjhwr0xf4c-http-1.6.1.drv' on 'ssh-ng://nixbot-remote-build@78.232.36.247'336building '/nix/store/ww3lr1f9yndzli35jbdb4jwjhwr0xf4c-http-1.6.1.drv'337http-1.6.1> Running phase: unpackPhase338http-1.6.1> unpacking source archive /nix/store/cpxghg5cw7n5fhigvx3yc8vyis8way3s-source339http-1.6.1> source root is source340http-1.6.1> Running phase: patchPhase341http-1.6.1> Running phase: updateAutotoolsGnuConfigScriptsPhase342http-1.6.1> Running phase: configurePhase343http-1.6.1> no configure script, doing nothing344http-1.6.1> Running phase: buildPhase345http-1.6.1> build flags: SHELL=/nix/store/pbjg9k27s3v1wp5s8c6pb23s0m69yjwz-bash-5.3p9/bin/bash346http-1.6.1> gcc -Wall -Wmissing-prototypes -Wpointer-arith -Wdeclaration-after-statement -Werror=vla -Wendif-labels -Wmissing-format-attribute -Wimplicit-fallthrough=3 -Wcast-function-type -Wshadow=compatible-local -Wformat-security -fno-strict-aliasing -fwrapv -fexcess-precision=standard -Wno-format-truncation -Wno-stringop-truncation -g -O2 -fPIC -fvisibility=hidden -I. -I./ -I/nix/store/3jrlp8bmrlfal71jwaj244rjgdnngl81-postgresql-17.11/include/server -I/nix/store/3jrlp8bmrlfal71jwaj244rjgdnngl81-postgresql-17.11/include/internal -D_GNU_SOURCE  -I/nix/store/n8zb5iyyaqfrjmdgibap9j6a29y1cl41-libxml2-2.15.4-dev/include/libxml2 -I/nix/store/3gx080m9qfv8k0sff9bg5877n6zd9kv8-lz4-1.10.0-dev/include -I/nix/store/3y8mdshg1hkwpcnzhhd1q71p2wps47d4-zstd-1.5.7-dev/include -I/nix/store/qm179cq3lxwcmmm6lnkfghiw67zjbm3c-icu4c-75.1-dev/include  -c -o http.o http.c347http-1.6.1> http.c:170:9: warning: 'CURLOPT_TLSAUTH_USERNAME' is deprecated: since 8.22.0. Support was removed [-Wdeprecated-declarations]348http-1.6.1>   170 |         { "CURLOPT_TLSAUTH_USERNAME", NULL, CURLOPT_TLSAUTH_USERNAME, CURLOPT_STRING, false },349http-1.6.1>       |         ^350http-1.6.1> In file included from http.c:88:351http-1.6.1> /nix/store/i6jyqhi7zdnf1p1m489mr9r6y8z4jfj6-curl-8.22.0-dev/include/curl/curl.h:1874:3: note: declared here352http-1.6.1>  1874 |   CURLOPTDEPRECATED(CURLOPT_TLSAUTH_USERNAME, CURLOPTTYPE_STRINGPOINT, 204,353http-1.6.1>       |   ^~~~~~~~~~~~~~~~~354http-1.6.1> http.c:171:9: warning: 'CURLOPT_TLSAUTH_PASSWORD' is deprecated: since 8.22.0. Support was removed [-Wdeprecated-declarations]355http-1.6.1>   171 |         { "CURLOPT_TLSAUTH_PASSWORD", NULL, CURLOPT_TLSAUTH_PASSWORD, CURLOPT_STRING, false },356http-1.6.1>       |         ^357http-1.6.1> /nix/store/i6jyqhi7zdnf1p1m489mr9r6y8z4jfj6-curl-8.22.0-dev/include/curl/curl.h:1878:3: note: declared here358http-1.6.1>  1878 |   CURLOPTDEPRECATED(CURLOPT_TLSAUTH_PASSWORD, CURLOPTTYPE_STRINGPOINT, 205,359http-1.6.1>       |   ^~~~~~~~~~~~~~~~~360http-1.6.1> http.c:172:9: warning: 'CURLOPT_TLSAUTH_TYPE' is deprecated: since 8.22.0. Support was removed [-Wdeprecated-declarations]361http-1.6.1>   172 |         { "CURLOPT_TLSAUTH_TYPE", NULL, CURLOPT_TLSAUTH_TYPE, CURLOPT_STRING, false },362http-1.6.1>       |         ^363http-1.6.1> /nix/store/i6jyqhi7zdnf1p1m489mr9r6y8z4jfj6-curl-8.22.0-dev/include/curl/curl.h:1882:3: note: declared here364http-1.6.1>  1882 |   CURLOPTDEPRECATED(CURLOPT_TLSAUTH_TYPE, CURLOPTTYPE_STRINGPOINT, 206,365http-1.6.1>       |   ^~~~~~~~~~~~~~~~~366http-1.6.1> http.c:189:9: warning: 'CURLOPT_PROXY_TLSAUTH_USERNAME' is deprecated: since 8.22.0. Support was removed [-Wdeprecated-declarations]367http-1.6.1>   189 |         { "CURLOPT_PROXY_CAINFO", NULL, CURLOPT_PROXY_TLSAUTH_USERNAME, CURLOPT_STRING, false },368http-1.6.1>       |         ^369http-1.6.1> /nix/store/i6jyqhi7zdnf1p1m489mr9r6y8z4jfj6-curl-8.22.0-dev/include/curl/curl.h:2044:3: note: declared here370http-1.6.1>  2044 |   CURLOPTDEPRECATED(CURLOPT_PROXY_TLSAUTH_USERNAME, CURLOPTTYPE_STRINGPOINT,371http-1.6.1>       |   ^~~~~~~~~~~~~~~~~372http-1.6.1> http.c:190:9: warning: 'CURLOPT_PROXY_TLSAUTH_USERNAME' is deprecated: since 8.22.0. Support was removed [-Wdeprecated-declarations]373http-1.6.1>   190 |         { "CURLOPT_PROXY_TLSAUTH_USERNAME", NULL, CURLOPT_PROXY_TLSAUTH_USERNAME, CURLOPT_STRING, false },374http-1.6.1>       |         ^375http-1.6.1> /nix/store/i6jyqhi7zdnf1p1m489mr9r6y8z4jfj6-curl-8.22.0-dev/include/curl/curl.h:2044:3: note: declared here376http-1.6.1>  2044 |   CURLOPTDEPRECATED(CURLOPT_PROXY_TLSAUTH_USERNAME, CURLOPTTYPE_STRINGPOINT,377http-1.6.1>       |   ^~~~~~~~~~~~~~~~~378http-1.6.1> http.c:191:9: warning: 'CURLOPT_PROXY_TLSAUTH_PASSWORD' is deprecated: since 8.22.0. Support was removed [-Wdeprecated-declarations]379http-1.6.1>   191 |         { "CURLOPT_PROXY_TLSAUTH_PASSWORD", NULL, CURLOPT_PROXY_TLSAUTH_PASSWORD, CURLOPT_STRING, false },380http-1.6.1>       |         ^381http-1.6.1> /nix/store/i6jyqhi7zdnf1p1m489mr9r6y8z4jfj6-curl-8.22.0-dev/include/curl/curl.h:2048:3: note: declared here382http-1.6.1>  2048 |   CURLOPTDEPRECATED(CURLOPT_PROXY_TLSAUTH_PASSWORD, CURLOPTTYPE_STRINGPOINT,383http-1.6.1>       |   ^~~~~~~~~~~~~~~~~384http-1.6.1> http.c:192:9: warning: 'CURLOPT_PROXY_TLSAUTH_TYPE' is deprecated: since 8.22.0. Support was removed [-Wdeprecated-declarations]385http-1.6.1>   192 |         { "CURLOPT_PROXY_TLSAUTH_TYPE", NULL, CURLOPT_PROXY_TLSAUTH_TYPE, CURLOPT_STRING, false },386http-1.6.1>       |         ^387http-1.6.1> /nix/store/i6jyqhi7zdnf1p1m489mr9r6y8z4jfj6-curl-8.22.0-dev/include/curl/curl.h:2052:3: note: declared here388http-1.6.1>  2052 |   CURLOPTDEPRECATED(CURLOPT_PROXY_TLSAUTH_TYPE, CURLOPTTYPE_STRINGPOINT, 253,389http-1.6.1>       |   ^~~~~~~~~~~~~~~~~390http-1.6.1> gcc -Wall -Wmissing-prototypes -Wpointer-arith -Wdeclaration-after-statement -Werror=vla -Wendif-labels -Wmissing-format-attribute -Wimplicit-fallthrough=3 -Wcast-function-type -Wshadow=compatible-local -Wformat-security -fno-strict-aliasing -fwrapv -fexcess-precision=standard -Wno-format-truncation -Wno-stringop-truncation -g -O2 -fPIC -fvisibility=hidden -shared -o http.so http.o -L/nix/store/dpr85nhbv5igqis7gnaavv9x21sjbc0i-postgresql-17.11-lib/lib    -L/nix/store/xjnvfcp3i347rp7zncsw5vdp7wgnpyaf-libxml2-2.15.4/lib -L/nix/store/yq0c2jhzc3877vagbkwxinm80wajlkh6-lz4-1.10.0-lib/lib -L/nix/store/i8f26lwk8i93hmiyrmsy752m6nwi4pmk-zstd-1.5.7/lib -Wl,--as-needed -Wl,-rpath,'/nix/store/dpr85nhbv5igqis7gnaavv9x21sjbc0i-postgresql-17.11-lib/lib',--enable-new-dtags -fvisibility=hidden -L/nix/store/dj86hb1ivsa2wp2kic39i6k64kzni2p5-curl-8.22.0/lib -lcurl391http-1.6.1> Running phase: installPhase392http-1.6.1> Running phase: fixupPhase393http-1.6.1> shrinking RPATHs of ELF executables and libraries in /nix/store/bb7xdixxbhi21y6w5vbkp1i9wyqpzngy-http-1.6.1394http-1.6.1> shrinking /nix/store/bb7xdixxbhi21y6w5vbkp1i9wyqpzngy-http-1.6.1/lib/http-1.6.so395http-1.6.1> checking for references to /build/ in /nix/store/bb7xdixxbhi21y6w5vbkp1i9wyqpzngy-http-1.6.1...396http-1.6.1> patching script interpreter paths in /nix/store/bb7xdixxbhi21y6w5vbkp1i9wyqpzngy-http-1.6.1397http-1.6.1> stripping (with command strip and flags -S -p) in  /nix/store/bb7xdixxbhi21y6w5vbkp1i9wyqpzngy-http-1.6.1/lib398building '/nix/store/w0bpwzz5zdfm8qnhwz483r3slpilmb0x-pg_graphql-1.6.2.drv' on 'ssh-ng://nixbot-remote-build@78.232.36.247'399building '/nix/store/w0bpwzz5zdfm8qnhwz483r3slpilmb0x-pg_graphql-1.6.2.drv'400pg_graphql-1.6.2> Running phase: unpackPhase401pg_graphql-1.6.2> unpacking source archive /nix/store/2ymsya7ri7iymhzql481a4pni14177m6-source402pg_graphql-1.6.2> source root is source403pg_graphql-1.6.2> Executing cargoSetupPostUnpackHook404pg_graphql-1.6.2> Finished cargoSetupPostUnpackHook405pg_graphql-1.6.2> Running phase: patchPhase406pg_graphql-1.6.2> Executing cargoSetupPostPatchHook407pg_graphql-1.6.2> Validating consistency between /build/source/Cargo.lock and /build/cargo-vendor-dir/Cargo.lock408pg_graphql-1.6.2> Finished cargoSetupPostPatchHook409pg_graphql-1.6.2> Running phase: updateAutotoolsGnuConfigScriptsPhase410pg_graphql-1.6.2> Running phase: configurePhase411pg_graphql-1.6.2> Running phase: buildPhase412pg_graphql-1.6.2> Executing cargo-pgrx buildPhase413pg_graphql-1.6.2>    Validating /nix/store/pmaflmk45425rq04ajcb4yhm58w6hq3p-postgresql-17_22/bin/pg_config414pg_graphql-1.6.2>  Initializing data directory at /build/tmp.tvSLxZCS57/data-17415pg_graphql-1.6.2> waiting for server to start....2026-10-27 12:55:30.199 GMT [72] LOG:  starting PostgreSQL 17.11 on aarch64-unknown-linux-gnu, compiled by gcc (GCC) 15.3.0, 64-bit416pg_graphql-1.6.2> 2026-10-27 12:55:30.201 GMT [72] LOG:  listening on Unix socket "/build/tmp.uul5yxgfvC/.s.PGSQL.5432"417pg_graphql-1.6.2> 2026-10-27 12:55:30.208 GMT [75] LOG:  database system was shut down at 2026-10-27 12:55:30 GMT418pg_graphql-1.6.2> 2026-10-27 12:55:30.214 GMT [72] LOG:  database system is ready to accept connections419pg_graphql-1.6.2>  done420pg_graphql-1.6.2> server started421pg_graphql-1.6.2> createuser: error: connection to server at "localhost" (127.0.0.1), port 5432 failed: Connection refused422pg_graphql-1.6.2> 	Is the server running on that host and accepting TCP/IP connections?423pg_graphql-1.6.2> waiting for server to shut down....2026-10-27 12:55:30.283 GMT [72] LOG:  received fast shutdown request424pg_graphql-1.6.2> 2026-10-27 12:55:30.297 GMT [72] LOG:  aborting any active transactions425pg_graphql-1.6.2> 2026-10-27 12:55:30.300 GMT [72] LOG:  background worker "logical replication launcher" (PID 78) exited with exit code 1426pg_graphql-1.6.2> 2026-10-27 12:55:30.302 GMT [73] LOG:  shutting down427pg_graphql-1.6.2> 2026-10-27 12:55:30.304 GMT [73] LOG:  checkpoint starting: shutdown immediate428pg_graphql-1.6.2> 2026-10-27 12:55:30.319 GMT [73] LOG:  checkpoint complete: wrote 3 buffers (0.0%); 0 WAL file(s) added, 0 removed, 0 recycled; write=0.005 s, sync=0.002 s, total=0.018 s; sync files=2, longest=0.002 s, average=0.001 s; distance=0 kB, estimate=0 kB; lsn=0/14EC910, redo lsn=0/14EC910429pg_graphql-1.6.2> 2026-10-27 12:55:30.325 GMT [72] LOG:  database system is shut down430pg_graphql-1.6.2>  done431pg_graphql-1.6.2> server stopped432pg_graphql-1.6.2>        Using PgConfig("pg17") and `pg_config` from /nix/store/pmaflmk45425rq04ajcb4yhm58w6hq3p-postgresql-17_22/bin/pg_config433pg_graphql-1.6.2>     Building extension with features  pg17434pg_graphql-1.6.2>      Running command "/nix/store/bgr0dgszr17dlzppy49547arlppz95qw-cargo-1.97.1-aarch64-unknown-linux-gnu/bin/cargo" "rustc" "--lib" "--manifest-path" "/build/source/Cargo.toml" "--release" "--features" " pg17" "--no-default-features" "--message-format=json-render-diagnostics" "--frozen" "-j" "2" "--" "-C" "link-arg=-Wl,--no-gc-sections"435pg_graphql-1.6.2>    Compiling proc-macro2 v1.0.101436pg_graphql-1.6.2>    Compiling quote v1.0.47437pg_graphql-1.6.2>    Compiling unicode-ident v1.0.16438pg_graphql-1.6.2>    Compiling stable_deref_trait v1.2.0439pg_graphql-1.6.2>    Compiling libc v0.2.189440pg_graphql-1.6.2>    Compiling serde_core v1.0.229441pg_graphql-1.6.2>    Compiling syn v2.0.117442pg_graphql-1.6.2>    Compiling syn v3.0.3443pg_graphql-1.6.2>    Compiling synstructure v0.13.1444pg_graphql-1.6.2>    Compiling litemap v0.7.4445pg_graphql-1.6.2>    Compiling writeable v0.5.5446pg_graphql-1.6.2>    Compiling zerofrom-derive v0.1.5447pg_graphql-1.6.2>    Compiling yoke-derive v0.7.5448pg_graphql-1.6.2>    Compiling zerovec-derive v0.10.3449pg_graphql-1.6.2>    Compiling zerofrom v0.1.5450pg_graphql-1.6.2>    Compiling yoke v0.7.5451pg_graphql-1.6.2>    Compiling displaydoc v0.2.5452pg_graphql-1.6.2>    Compiling icu_provider_macros v1.5.0453pg_graphql-1.6.2>    Compiling zerovec v0.10.4454pg_graphql-1.6.2>    Compiling serde_derive v1.0.229455pg_graphql-1.6.2>    Compiling tinystr v0.7.6456pg_graphql-1.6.2>    Compiling icu_locid v1.5.0457pg_graphql-1.6.2>    Compiling eyre v0.6.12458pg_graphql-1.6.2>    Compiling memchr v2.7.4459pg_graphql-1.6.2>    Compiling thiserror v2.0.16460pg_graphql-1.6.2>    Compiling icu_provider v1.5.0461pg_graphql-1.6.2>    Compiling zmij v1.0.23462pg_graphql-1.6.2>    Compiling icu_locid_transform_data v1.5.0463pg_graphql-1.6.2>    Compiling icu_locid_transform v1.5.0464pg_graphql-1.6.2>    Compiling icu_collections v1.5.0465pg_graphql-1.6.2>    Compiling thiserror-impl v2.0.16466pg_graphql-1.6.2>    Compiling serde v1.0.229467pg_graphql-1.6.2>    Compiling icu_properties_data v1.5.0468pg_graphql-1.6.2>    Compiling icu_properties v1.5.1469pg_graphql-1.6.2>    Compiling shlex v1.3.0470pg_graphql-1.6.2>    Compiling icu_normalizer_data v1.5.0471pg_graphql-1.6.2>    Compiling write16 v1.0.0472pg_graphql-1.6.2>    Compiling serde_json v1.0.151473pg_graphql-1.6.2>    Compiling utf8_iter v1.0.4474pg_graphql-1.6.2>    Compiling smallvec v1.13.2475pg_graphql-1.6.2>    Compiling utf16_iter v1.0.5476pg_graphql-1.6.2>    Compiling winnow v1.0.4477pg_graphql-1.6.2>    Compiling glob v0.3.2478pg_graphql-1.6.2>    Compiling clang-sys v1.8.1479pg_graphql-1.6.2>    Compiling toml_parser v1.1.3+spec-1.1.0480pg_graphql-1.6.2>    Compiling icu_normalizer v1.5.0481pg_graphql-1.6.2>    Compiling serde_spanned v1.1.1482pg_graphql-1.6.2>    Compiling anyhow v1.0.95483pg_graphql-1.6.2>    Compiling indenter v0.3.3484pg_graphql-1.6.2>    Compiling once_cell v1.21.3485pg_graphql-1.6.2>    Compiling toml_writer v1.1.2+spec-1.1.0486pg_graphql-1.6.2>    Compiling toml_datetime v0.7.0487pg_graphql-1.6.2>    Compiling idna_adapter v1.2.0488pg_graphql-1.6.2>    Compiling cc v1.2.11489pg_graphql-1.6.2>    Compiling aho-corasick v1.1.3490pg_graphql-1.6.2>    Compiling percent-encoding v2.3.2491pg_graphql-1.6.2>    Compiling is_ci v1.2.0492pg_graphql-1.6.2>    Compiling cfg-if v1.0.0493pg_graphql-1.6.2>    Compiling regex-syntax v0.8.11494pg_graphql-1.6.2>    Compiling winnow v0.7.13495pg_graphql-1.6.2>    Compiling minimal-lexical v0.2.1496pg_graphql-1.6.2>    Compiling owo-colors v4.2.2497pg_graphql-1.6.2>    Compiling nom v7.1.3498pg_graphql-1.6.2>    Compiling regex-automata v0.4.16499pg_graphql-1.6.2>    Compiling toml v0.9.5500pg_graphql-1.6.2>    Compiling supports-color v3.0.2501pg_graphql-1.6.2>    Compiling libloading v0.8.6502pg_graphql-1.6.2>    Compiling form_urlencoded v1.2.2503pg_graphql-1.6.2>    Compiling idna v1.1.0504pg_graphql-1.6.2>    Compiling toml_datetime v1.1.1+spec-1.1.0505pg_graphql-1.6.2>    Compiling bindgen v0.72.1506pg_graphql-1.6.2>    Compiling either v1.13.0507pg_graphql-1.6.2>    Compiling itoa v1.0.14508pg_graphql-1.6.2>    Compiling syn v1.0.109509pg_graphql-1.6.2>    Compiling itertools v0.13.0510pg_graphql-1.6.2>    Compiling toml v1.1.4+spec-1.1.0511pg_graphql-1.6.2>    Compiling pathsearch v0.2.0512pg_graphql-1.6.2>    Compiling url v2.5.8513pg_graphql-1.6.2>    Compiling cargo_toml v0.22.3514pg_graphql-1.6.2>    Compiling regex v1.13.1515pg_graphql-1.6.2>    Compiling cexpr v0.6.0516pg_graphql-1.6.2>    Compiling hashbrown v0.17.1517pg_graphql-1.6.2>    Compiling equivalent v1.0.1518pg_graphql-1.6.2>    Compiling same-file v1.0.6519pg_graphql-1.6.2>    Compiling foldhash v0.1.5520pg_graphql-1.6.2>    Compiling bitflags v2.13.1521pg_graphql-1.6.2>    Compiling rustc-hash v2.1.1522pg_graphql-1.6.2>    Compiling hashbrown v0.15.2523pg_graphql-1.6.2>    Compiling walkdir v2.5.0524pg_graphql-1.6.2>    Compiling indexmap v2.14.0525pg_graphql-1.6.2>    Compiling pgrx-pg-config v0.19.2526pg_graphql-1.6.2>    Compiling shlex v2.0.1527pg_graphql-1.6.2>    Compiling getrandom v0.4.2528pg_graphql-1.6.2>    Compiling ident_case v1.0.1529pg_graphql-1.6.2>    Compiling rand_core v0.10.1530pg_graphql-1.6.2>    Compiling unicode-segmentation v1.12.0531pg_graphql-1.6.2>    Compiling fixedbitset v0.5.7532pg_graphql-1.6.2>    Compiling strsim v0.10.0533pg_graphql-1.6.2>    Compiling fnv v1.0.7534pg_graphql-1.6.2>    Compiling darling_core v0.14.4535pg_graphql-1.6.2>    Compiling petgraph v0.8.3536pg_graphql-1.6.2>    Compiling convert_case v0.11.0537pg_graphql-1.6.2>    Compiling pgrx-bindgen v0.19.2538pg_graphql-1.6.2>    Compiling cee-scape v0.2.0539pg_graphql-1.6.2>    Compiling unescape v0.1.0540pg_graphql-1.6.2>    Compiling radium v0.7.0541pg_graphql-1.6.2>    Compiling thiserror v1.0.69542pg_graphql-1.6.2>    Compiling pgrx-sql-entity-graph v0.19.2543pg_graphql-1.6.2>    Compiling pgrx-pg-sys v0.19.2544pg_graphql-1.6.2>    Compiling darling_macro v0.14.4545pg_graphql-1.6.2>    Compiling thiserror-impl v1.0.69546pg_graphql-1.6.2>    Compiling tap v1.0.1547pg_graphql-1.6.2>    Compiling wyz v0.5.1548pg_graphql-1.6.2>    Compiling darling v0.14.4549pg_graphql-1.6.2>    Compiling pgrx-macros v0.19.2550pg_graphql-1.6.2>    Compiling enum-map-derive v0.17.0551pg_graphql-1.6.2>    Compiling bytes v1.11.1552pg_graphql-1.6.2>    Compiling funty v2.0.0553pg_graphql-1.6.2>    Compiling half v1.8.3554pg_graphql-1.6.2>    Compiling serde_cbor v0.11.2555pg_graphql-1.6.2>    Compiling bitvec v1.0.1556pg_graphql-1.6.2>    Compiling combine v4.6.7557pg_graphql-1.6.2>    Compiling enum-map v2.7.3558pg_graphql-1.6.2>    Compiling cached_proc_macro v0.18.1559pg_graphql-1.6.2>    Compiling uuid v1.24.0560pg_graphql-1.6.2>    Compiling chacha20 v0.10.0561pg_graphql-1.6.2>    Compiling instant v0.1.13562pg_graphql-1.6.2>    Compiling seahash v4.1.0563pg_graphql-1.6.2>    Compiling hashbrown v0.14.5564pg_graphql-1.6.2>    Compiling cached_proc_macro_types v0.1.1565pg_graphql-1.6.2>    Compiling itertools v0.10.5566pg_graphql-1.6.2>    Compiling pgrx v0.19.2567pg_graphql-1.6.2>    Compiling cached v0.46.1568pg_graphql-1.6.2>    Compiling rand v0.10.1569pg_graphql-1.6.2>    Compiling graphql-parser v0.4.1570pg_graphql-1.6.2>    Compiling bimap v0.6.3571pg_graphql-1.6.2>    Compiling base64 v0.13.1572pg_graphql-1.6.2>    Compiling lazy_static v1.5.0573pg_graphql-1.6.2>    Compiling pg_graphql v1.6.2 (/build/source)574pg_graphql-1.6.2>     Finished `release` profile [optimized] target(s) in 3m 04s575pg_graphql-1.6.2>   Installing extension576pg_graphql-1.6.2>      Copying control file to /nix/store/w1i7873j12lnfmjxn3gsijk2dxjyyp36-pg_graphql-1.6.2/nix/store/pmaflmk45425rq04ajcb4yhm58w6hq3p-postgresql-17_22/share/postgresql/extension/pg_graphql.control577pg_graphql-1.6.2>      Copying shared library to /nix/store/w1i7873j12lnfmjxn3gsijk2dxjyyp36-pg_graphql-1.6.2/nix/store/j71vd8cq510zphc7wk56959mij4dfriv-postgresql-17_22-lib/lib/pg_graphql.so578pg_graphql-1.6.2>   Discovered 5 SQL entities: 0 schemas (0 unique), 1 functions, 0 types, 0 enums, 4 sqls, 0 ords, 0 hashes, 0 aggregates, 0 triggers579pg_graphql-1.6.2>      Writing SQL entities to /nix/store/w1i7873j12lnfmjxn3gsijk2dxjyyp36-pg_graphql-1.6.2/nix/store/pmaflmk45425rq04ajcb4yhm58w6hq3p-postgresql-17_22/share/postgresql/extension/pg_graphql--1.6.2.sql580pg_graphql-1.6.2>     Finished installing pg_graphql581pg_graphql-1.6.2> buildPhase completed in 3 minutes 6 seconds582pg_graphql-1.6.2> Running phase: checkPhase583pg_graphql-1.6.2>    Validating /nix/store/pmaflmk45425rq04ajcb4yhm58w6hq3p-postgresql-17_22/bin/pg_config584pg_graphql-1.6.2>  Initializing data directory at /build/tmp.nMkIKBJdnF/data-17585pg_graphql-1.6.2> waiting for server to start....2026-10-27 12:58:36.281 GMT [3049] LOG:  starting PostgreSQL 17.11 on aarch64-unknown-linux-gnu, compiled by gcc (GCC) 15.3.0, 64-bit586pg_graphql-1.6.2> 2026-10-27 12:58:36.283 GMT [3049] LOG:  listening on Unix socket "/build/tmp.0CxXvPFD6P/.s.PGSQL.5432"587pg_graphql-1.6.2> 2026-10-27 12:58:36.289 GMT [3052] LOG:  database system was shut down at 2026-10-27 12:58:36 GMT588pg_graphql-1.6.2> 2026-10-27 12:58:36.295 GMT [3049] LOG:  database system is ready to accept connections589pg_graphql-1.6.2>  done590pg_graphql-1.6.2> server started591pg_graphql-1.6.2> createuser: error: connection to server at "localhost" (127.0.0.1), port 5432 failed: Connection refused592pg_graphql-1.6.2> 	Is the server running on that host and accepting TCP/IP connections?593pg_graphql-1.6.2> waiting for server to shut down....2026-10-27 12:58:36.366 GMT [3049] LOG:  received fast shutdown request594pg_graphql-1.6.2> 2026-10-27 12:58:36.369 GMT [3049] LOG:  aborting any active transactions595pg_graphql-1.6.2> 2026-10-27 12:58:36.371 GMT [3049] LOG:  background worker "logical replication launcher" (PID 3055) exited with exit code 1596pg_graphql-1.6.2> 2026-10-27 12:58:36.371 GMT [3050] LOG:  shutting down597pg_graphql-1.6.2> 2026-10-27 12:58:36.375 GMT [3050] LOG:  checkpoint starting: shutdown immediate598pg_graphql-1.6.2> 2026-10-27 12:58:36.393 GMT [3050] LOG:  checkpoint complete: wrote 3 buffers (0.0%); 0 WAL file(s) added, 0 removed, 0 recycled; write=0.007 s, sync=0.003 s, total=0.023 s; sync files=2, longest=0.002 s, average=0.002 s; distance=0 kB, estimate=0 kB; lsn=0/14EC910, redo lsn=0/14EC910599pg_graphql-1.6.2> 2026-10-27 12:58:36.399 GMT [3049] LOG:  database system is shut down600pg_graphql-1.6.2>  done601pg_graphql-1.6.2> server stopped602pg_graphql-1.6.2>    Validating /build/tmp.uExe5qxrub/17/bin/pg_config603pg_graphql-1.6.2>  Initializing data directory at /build/tmp.uExe5qxrub/data-17604pg_graphql-1.6.2>        Using PgConfig("pg17") and `pg_config` from /build/tmp.uExe5qxrub/17/bin/pg_config605pg_graphql-1.6.2>     Building extension with features pg17606pg_graphql-1.6.2>      Running command "/nix/store/bgr0dgszr17dlzppy49547arlppz95qw-cargo-1.97.1-aarch64-unknown-linux-gnu/bin/cargo" "rustc" "--lib" "--manifest-path" "/build/source/Cargo.toml" "--release" "--features" "pg17" "--no-default-features" "--message-format=json-render-diagnostics" "--frozen" "-j" "2" "--" "-C" "link-arg=-Wl,--no-gc-sections"607pg_graphql-1.6.2>     Finished `release` profile [optimized] target(s) in 0.16s608pg_graphql-1.6.2>   Installing extension609pg_graphql-1.6.2>      Copying control file to /build/tmp.uExe5qxrub/17/share/postgresql/extension/pg_graphql.control610pg_graphql-1.6.2>      Copying shared library to /build/tmp.uExe5qxrub/17/lib/pg_graphql.so611pg_graphql-1.6.2>   Discovered 5 SQL entities: 0 schemas (0 unique), 1 functions, 0 types, 0 enums, 4 sqls, 0 ords, 0 hashes, 0 aggregates, 0 triggers612pg_graphql-1.6.2>      Writing SQL entities to /build/tmp.uExe5qxrub/17/share/postgresql/extension/pg_graphql--1.6.2.sql613pg_graphql-1.6.2>     Finished installing pg_graphql614pg_graphql-1.6.2> ++ mktemp -d615pg_graphql-1.6.2> + TMPDIR=/build/tmp.VJonGozErB616pg_graphql-1.6.2> + export PGDATA=/build/tmp.VJonGozErB617pg_graphql-1.6.2> + PGDATA=/build/tmp.VJonGozErB618pg_graphql-1.6.2> + export PGHOST=/build/tmp.VJonGozErB619pg_graphql-1.6.2> + PGHOST=/build/tmp.VJonGozErB620pg_graphql-1.6.2> + export PGUSER=postgres621pg_graphql-1.6.2> + PGUSER=postgres622pg_graphql-1.6.2> + export PGDATABASE=postgres623pg_graphql-1.6.2> + PGDATABASE=postgres624pg_graphql-1.6.2> + export PGTZ=UTC625pg_graphql-1.6.2> + PGTZ=UTC626pg_graphql-1.6.2> + export PG_COLOR=auto627pg_graphql-1.6.2> + PG_COLOR=auto628pg_graphql-1.6.2> + trap 'pg_ctl stop -m i' sigint sigterm exit629pg_graphql-1.6.2> + rm -rf /build/tmp.VJonGozErB630pg_graphql-1.6.2> + initdb --no-locale --encoding=UTF8 --nosync -U postgres631pg_graphql-1.6.2> The files belonging to this database system will be owned by user "nixbld".632pg_graphql-1.6.2> This user must also own the server process.633pg_graphql-1.6.2> 634pg_graphql-1.6.2> The database cluster will be initialized with locale "C".635pg_graphql-1.6.2> The default text search configuration will be set to "english".636pg_graphql-1.6.2> 637pg_graphql-1.6.2> Data page checksums are disabled.638pg_graphql-1.6.2> 639pg_graphql-1.6.2> creating directory /build/tmp.VJonGozErB ... ok640pg_graphql-1.6.2> creating subdirectories ... ok641pg_graphql-1.6.2> selecting dynamic shared memory implementation ... posix642pg_graphql-1.6.2> selecting default "max_connections" ... 100643pg_graphql-1.6.2> selecting default "shared_buffers" ... 128MB644pg_graphql-1.6.2> selecting default time zone ... UTC645pg_graphql-1.6.2> creating configuration files ... ok646pg_graphql-1.6.2> running bootstrap script ... ok647pg_graphql-1.6.2> performing post-bootstrap initialization ... ok648pg_graphql-1.6.2> 649pg_graphql-1.6.2> Sync to disk skipped.650pg_graphql-1.6.2> The data directory might become corrupt if the operating system crashes.651pg_graphql-1.6.2> 652pg_graphql-1.6.2> initdb: warning: enabling "trust" authentication for local connections653pg_graphql-1.6.2> initdb: hint: You can change this by editing pg_hba.conf or using the option -A, or --auth-local and --auth-host, the next time you run initdb.654pg_graphql-1.6.2> 655pg_graphql-1.6.2> Success. You can now start the database server using:656pg_graphql-1.6.2> 657pg_graphql-1.6.2>     /build/tmp.uExe5qxrub/17/bin/pg_ctl -D /build/tmp.VJonGozErB -l logfile start658pg_graphql-1.6.2> 659pg_graphql-1.6.2> + pg_ctl start -o '-F -c listen_addresses="" -c log_min_messages=WARNING -k /build/tmp.VJonGozErB'660pg_graphql-1.6.2> waiting for server to start....2026-10-27 12:58:38.635 UTC [3107] LOG:  starting PostgreSQL 17.11 on aarch64-unknown-linux-gnu, compiled by gcc (GCC) 15.3.0, 64-bit661pg_graphql-1.6.2> 2026-10-27 12:58:38.635 UTC [3107] LOG:  listening on Unix socket "/build/tmp.VJonGozErB/.s.PGSQL.5432"662pg_graphql-1.6.2> 2026-10-27 12:58:38.637 UTC [3110] LOG:  database system was shut down at 2026-10-27 12:58:38 UTC663pg_graphql-1.6.2> 2026-10-27 12:58:38.641 UTC [3107] LOG:  database system is ready to accept connections664pg_graphql-1.6.2>  done665pg_graphql-1.6.2> server started666pg_graphql-1.6.2> + createdb contrib_regression667pg_graphql-1.6.2> + TESTDIR=test668pg_graphql-1.6.2> +++ pg_config --pgxs669pg_graphql-1.6.2> ++ dirname /nix/store/pmaflmk45425rq04ajcb4yhm58w6hq3p-postgresql-17_22/lib/pgxs/src/makefiles/pgxs.mk670pg_graphql-1.6.2> + PGXS=/nix/store/pmaflmk45425rq04ajcb4yhm58w6hq3p-postgresql-17_22/lib/pgxs/src/makefiles671pg_graphql-1.6.2> + REGRESS=/nix/store/pmaflmk45425rq04ajcb4yhm58w6hq3p-postgresql-17_22/lib/pgxs/src/makefiles/../test/regress/pg_regress672pg_graphql-1.6.2> + '[' 0 -ne 0 ']'673pg_graphql-1.6.2> ++ ls test/sql674pg_graphql-1.6.2> ++ sed -e 's/\..*$//'675pg_graphql-1.6.2> ++ sort676pg_graphql-1.6.2> + TESTS=$'aggregate\naggregate_directive\naliases\nallow_camel_names\narray_args_and_return_types\nbigint_is_string\nbuiltin_directives\ncomment_directive\ncomment_directive_description\ncompound_filters\ndepth_limit\nempty_mutations\nenum_mappings\nextend_type_with_function\nextend_type_with_function_relation\nextend_type_with_generated_column\nfilter_by_node_id\nfragment_on_mutation\nfragment_on_query\nfunction_calls\nfunction_calls_default_args\nfunction_calls_unsupported\nfunction_return_row_is_selectable\nfunction_return_view_has_pkey\ninflection_fields\ninflection_function\ninflection_relationships\ninflection_types\nintrospection\nissue_163\nissue_170\nissue_225\nissue_237_field_merging\nissue_237_field_merging_mismatched\nissue_300\nissue_306\nissue_312\nissue_334_ambiguous_function\nissue_337\nissue_339_function_return_json\nissue_339_function_return_table\nissue_353_too_many_fields\nissue_370_citext_as_string\nissue_373\nissue_377_enum_search_path\nissue_409_fkey_rls_nullability\nissue_444\nissue_463\nissue_511\nissue_533\nissue_542_partial_unique\nissue_551_too_many_fields\nissue_557_1_to_1_nullability\nissue_581_missing_desc_on_schema\nissue_fragment_spread_cycles\njson_is_stringified\nmax_page_size\nmax_rows_directive\nmulti_column_primary_key\nmultiple_mutations\nmultiple_queries\nmutation_delete\nmutation_delete_variable\nmutation_insert\nmutation_update\nnull_argument\nomit_exotic_types\nomit_weird_names\noperation_name\noverride_enum_name\noverride_field_name\noverride_func_field_name\noverride_relationship_field_name\noverride_type_name\npage_info\npermissions_connection_column\npermissions_functions\npermissions_node_column\npermissions_table_level\npermissions_types\nprimary_key_is_required\nprimary_key_queries\nrelationship_one_to_one\nresolve___schema\nresolve___type\nresolve___typename\nresolve_array_type\nresolve_connection_filter\nresolve_connection_named\nresolve_connection_order_by\nresolve_connection_pagination_args\nresolve_connection_to_conn\nresolve_connection_to_node\nresolve_error_connection_edge_no_field\nresolve_error_connection_edge_node_no_field\nresolve_error_connection_no_field\nresolve_error_from_parser\nresolve_error_mutation_no_field\nresolve_error_node_no_field\nresolve_error_query_no_field\nresolve_fragment\nresolve_graphiql_schema\nresolve_one\nroundtrip_types\nrow_level_security\nsqli_connection\nstring_filters\ntest_error_anon_and_named_operations\ntest_error_invalid_offset\ntest_error_multiple_anon_operations\ntest_error_mutation_transpilation\ntest_error_operation_name_not_found\ntest_error_operation_names_not_unique\ntest_error_query_transpilation\ntest_error_subscription\ntest_query__type\ntotal_count\ntype_bigfloat\ntype_modifier_max_length\ntype_opaque\nvariable_default\nviews_integration'677pg_graphql-1.6.2> + psql -v ON_ERROR_STOP=1 -f test/fixtures.sql -d contrib_regression678pg_graphql-1.6.2> psql:test/fixtures.sql:1: NOTICE:  extension "pg_graphql" does not exist, skipping679pg_graphql-1.6.2> DROP EXTENSION680pg_graphql-1.6.2> CREATE EXTENSION681pg_graphql-1.6.2> COMMENT682pg_graphql-1.6.2> CREATE FUNCTION683pg_graphql-1.6.2> + /nix/store/pmaflmk45425rq04ajcb4yhm58w6hq3p-postgresql-17_22/lib/pgxs/src/makefiles/../test/regress/pg_regress --use-existing --dbname=contrib_regression --inputdir=test aggregate aggregate_directive aliases allow_camel_names array_args_and_return_types bigint_is_string builtin_directives comment_directive comment_directive_description compound_filters depth_limit empty_mutations enum_mappings extend_type_with_function extend_type_with_function_relation extend_type_with_generated_column filter_by_node_id fragment_on_mutation fragment_on_query function_calls function_calls_default_args function_calls_unsupported function_return_row_is_selectable function_return_view_has_pkey inflection_fields inflection_function inflection_relationships inflection_types introspection issue_163 issue_170 issue_225 issue_237_field_merging issue_237_field_merging_mismatched issue_300 issue_306 issue_312 issue_334_ambiguous_function issue_337 issue_339_function_return_json issue_339_function_return_table issue_353_too_many_fields issue_370_citext_as_string issue_373 issue_377_enum_search_path issue_409_fkey_rls_nullability issue_444 issue_463 issue_511 issue_533 issue_542_partial_unique issue_551_too_many_fields issue_557_1_to_1_nullability issue_581_missing_desc_on_schema issue_fragment_spread_cycles json_is_stringified max_page_size max_rows_directive multi_column_primary_key multiple_mutations multiple_queries mutation_delete mutation_delete_variable mutation_insert mutation_update null_argument omit_exotic_types omit_weird_names operation_name override_enum_name override_field_name override_func_field_name override_relationship_field_name override_type_name page_info permissions_connection_column permissions_functions permissions_node_column permissions_table_level permissions_types primary_key_is_required primary_key_queries relationship_one_to_one resolve___schema resolve___type resolve___typename resolve_array_type resolve_connection_filter resolve_connection_named resolve_connection_order_by resolve_connection_pagination_args resolve_connection_to_conn resolve_connection_to_node resolve_error_connection_edge_no_field resolve_error_connection_edge_node_no_field resolve_error_connection_no_field resolve_error_from_parser resolve_error_mutation_no_field resolve_error_node_no_field resolve_error_query_no_field resolve_fragment resolve_graphiql_schema resolve_one roundtrip_types row_level_security sqli_connection string_filters test_error_anon_and_named_operations test_error_invalid_offset test_error_multiple_anon_operations test_error_mutation_transpilation test_error_operation_name_not_found test_error_operation_names_not_unique test_error_query_transpilation test_error_subscription test_query__type total_count type_bigfloat type_modifier_max_length type_opaque variable_default views_integration684pg_graphql-1.6.2> # using postmaster on /build/tmp.VJonGozErB, default port685pg_graphql-1.6.2> ok 1         - aggregate                                  87 ms686pg_graphql-1.6.2> ok 2         - aggregate_directive                        75 ms687pg_graphql-1.6.2> ok 3         - aliases                                    55 ms688pg_graphql-1.6.2> ok 4         - allow_camel_names                          54 ms689pg_graphql-1.6.2> ok 5         - array_args_and_return_types              1523 ms690pg_graphql-1.6.2> ok 6         - bigint_is_string                           51 ms691pg_graphql-1.6.2> ok 7         - builtin_directives                         61 ms692pg_graphql-1.6.2> ok 8         - comment_directive                          10 ms693pg_graphql-1.6.2> ok 9         - comment_directive_description              47 ms694pg_graphql-1.6.2> ok 10        - compound_filters                          251 ms695pg_graphql-1.6.2> ok 11        - depth_limit                                63 ms696pg_graphql-1.6.2> ok 12        - empty_mutations                            66 ms697pg_graphql-1.6.2> ok 13        - enum_mappings                              57 ms698pg_graphql-1.6.2> ok 14        - extend_type_with_function                  53 ms699pg_graphql-1.6.2> ok 15        - extend_type_with_function_relation        142 ms700pg_graphql-1.6.2> ok 16        - extend_type_with_generated_column          51 ms701pg_graphql-1.6.2> ok 17        - filter_by_node_id                          67 ms702pg_graphql-1.6.2> ok 18        - fragment_on_mutation                       48 ms703pg_graphql-1.6.2> ok 19        - fragment_on_query                          49 ms704pg_graphql-1.6.2> ok 20        - function_calls                           1315 ms705pg_graphql-1.6.2> ok 21        - function_calls_default_args                97 ms706pg_graphql-1.6.2> ok 22        - function_calls_unsupported                295 ms707pg_graphql-1.6.2> ok 23        - function_return_row_is_selectable          87 ms708pg_graphql-1.6.2> ok 24        - function_return_view_has_pkey              76 ms709pg_graphql-1.6.2> ok 25        - inflection_fields                         125 ms710pg_graphql-1.6.2> ok 26        - inflection_function                       148 ms711pg_graphql-1.6.2> ok 27        - inflection_relationships                  183 ms712pg_graphql-1.6.2> ok 28        - inflection_types                          125 ms713pg_graphql-1.6.2> ok 29        - introspection                             250 ms714pg_graphql-1.6.2> ok 30        - issue_163                                  65 ms715pg_graphql-1.6.2> ok 31        - issue_170                                  49 ms716pg_graphql-1.6.2> ok 32        - issue_225                                  53 ms717pg_graphql-1.6.2> ok 33        - issue_237_field_merging                    90 ms718pg_graphql-1.6.2> ok 34        - issue_237_field_merging_mismatched         82 ms719pg_graphql-1.6.2> ok 35        - issue_300                                  51 ms720pg_graphql-1.6.2> ok 36        - issue_306                                  61 ms721pg_graphql-1.6.2> ok 37        - issue_312                                  50 ms722pg_graphql-1.6.2> ok 38        - issue_334_ambiguous_function               49 ms723pg_graphql-1.6.2> ok 39        - issue_337                                  83 ms724pg_graphql-1.6.2> ok 40        - issue_339_function_return_json             52 ms725pg_graphql-1.6.2> ok 41        - issue_339_function_return_table            47 ms726pg_graphql-1.6.2> ok 42        - issue_353_too_many_fields                  59 ms727pg_graphql-1.6.2> ok 43        - issue_370_citext_as_string                 63 ms728pg_graphql-1.6.2> ok 44        - issue_373                                  51 ms729pg_graphql-1.6.2> ok 45        - issue_377_enum_search_path                 74 ms730pg_graphql-1.6.2> ok 46        - issue_409_fkey_rls_nullability            107 ms731pg_graphql-1.6.2> ok 47        - issue_444                                  43 ms732pg_graphql-1.6.2> ok 48        - issue_463                                  49 ms733pg_graphql-1.6.2> ok 49        - issue_511                                  80 ms734pg_graphql-1.6.2> ok 50        - issue_533                                 106 ms735pg_graphql-1.6.2> ok 51        - issue_542_partial_unique                   77 ms736pg_graphql-1.6.2> ok 52        - issue_551_too_many_fields                  67 ms737pg_graphql-1.6.2> ok 53        - issue_557_1_to_1_nullability               54 ms738pg_graphql-1.6.2> ok 54        - issue_581_missing_desc_on_schema           50 ms739pg_graphql-1.6.2> ok 55        - issue_fragment_spread_cycles              234 ms740pg_graphql-1.6.2> ok 56        - json_is_stringified                        59 ms741pg_graphql-1.6.2> ok 57        - max_page_size                              48 ms742pg_graphql-1.6.2> ok 58        - max_rows_directive                        194 ms743pg_graphql-1.6.2> ok 59        - multi_column_primary_key                   60 ms744pg_graphql-1.6.2> ok 60        - multiple_mutations                         50 ms745pg_graphql-1.6.2> ok 61        - multiple_queries                           50 ms746pg_graphql-1.6.2> ok 62        - mutation_delete                            63 ms747pg_graphql-1.6.2> ok 63        - mutation_delete_variable                   48 ms748pg_graphql-1.6.2> ok 64        - mutation_insert                            58 ms749pg_graphql-1.6.2> ok 65        - mutation_update                            62 ms750pg_graphql-1.6.2> ok 66        - null_argument                              47 ms751pg_graphql-1.6.2> ok 67        - omit_exotic_types                          48 ms752pg_graphql-1.6.2> ok 68        - omit_weird_names                           74 ms753pg_graphql-1.6.2> ok 69        - operation_name                             52 ms754pg_graphql-1.6.2> ok 70        - override_enum_name                         44 ms755pg_graphql-1.6.2> ok 71        - override_field_name                        48 ms756pg_graphql-1.6.2> ok 72        - override_func_field_name                   50 ms757pg_graphql-1.6.2> ok 73        - override_relationship_field_name           51 ms758pg_graphql-1.6.2> ok 74        - override_type_name                         49 ms759pg_graphql-1.6.2> ok 75        - page_info                                  72 ms760pg_graphql-1.6.2> ok 76        - permissions_connection_column              85 ms761pg_graphql-1.6.2> ok 77        - permissions_functions                      78 ms762building '/nix/store/5fhpy9zjwqq7ddpik2bxkf2w0dpyswp2-pg_net-0.20.3.drv' on 'ssh-ng://nixbot-remote-build@78.232.36.247'763pg_graphql-1.6.2> ok 78        - permissions_node_column                    85 ms764pg_graphql-1.6.2> ok 79        - permissions_table_level                   164 ms765pg_graphql-1.6.2> ok 80        - permissions_types                          94 ms766pg_graphql-1.6.2> ok 81        - primary_key_is_required                    76 ms767pg_graphql-1.6.2> ok 82        - primary_key_queries                       270 ms768pg_graphql-1.6.2> ok 83        - relationship_one_to_one                    57 ms769pg_graphql-1.6.2> ok 84        - resolve___schema                           57 ms770building '/nix/store/5fhpy9zjwqq7ddpik2bxkf2w0dpyswp2-pg_net-0.20.3.drv'771pg_graphql-1.6.2> ok 85        - resolve___type                             50 ms772pg_net-0.20.3> Running phase: unpackPhase773pg_net-0.20.3> unpacking source archive /nix/store/fdvpi9rrahp0pzx91srrjghjahx1kw43-source774pg_graphql-1.6.2> ok 86        - resolve___typename                        111 ms775pg_net-0.20.3> source root is source776pg_net-0.20.3> Running phase: patchPhase777pg_graphql-1.6.2> ok 87        - resolve_array_type                         53 ms778pg_net-0.20.3> Running phase: updateAutotoolsGnuConfigScriptsPhase779pg_net-0.20.3> Running phase: configurePhase780pg_net-0.20.3> no configure script, doing nothing781pg_net-0.20.3> Running phase: buildPhase782pg_net-0.20.3> gcc -Wall -Wmissing-prototypes -Wpointer-arith -Wdeclaration-after-statement -Werror=vla -Wendif-labels -Wmissing-format-attribute -Wimplicit-fallthrough=3 -Wcast-function-type -Wshadow=compatible-local -Wformat-security -fno-strict-aliasing -fwrapv -fexcess-precision=standard -Wno-format-truncation -Wno-stringop-truncation -g -O2 -std=c11 -Wextra -Wall -Werror -Wno-declaration-after-statement -Wno-vla -Wno-long-long -Wmissing-variable-declarations -fPIC -fvisibility=hidden  -DEXTVERSION=\"0.20.3\" -I. -I./ -I/nix/store/3jrlp8bmrlfal71jwaj244rjgdnngl81-postgresql-17.11/include/server -I/nix/store/3jrlp8bmrlfal71jwaj244rjgdnngl81-postgresql-17.11/include/internal -D_GNU_SOURCE  -I/nix/store/n8zb5iyyaqfrjmdgibap9j6a29y1cl41-libxml2-2.15.4-dev/include/libxml2 -I/nix/store/3gx080m9qfv8k0sff9bg5877n6zd9kv8-lz4-1.10.0-dev/include -I/nix/store/3y8mdshg1hkwpcnzhhd1q71p2wps47d4-zstd-1.5.7-dev/include -I/nix/store/qm179cq3lxwcmmm6lnkfghiw67zjbm3c-icu4c-75.1-dev/include  -c -o src/core.o src/core.c783pg_graphql-1.6.2> ok 88        - resolve_connection_filter                 110 ms784pg_graphql-1.6.2> ok 89        - resolve_connection_named                   48 ms785pg_graphql-1.6.2> ok 90        - resolve_connection_order_by                87 ms786pg_graphql-1.6.2> ok 91        - resolve_connection_pagination_args        100 ms787pg_graphql-1.6.2> ok 92        - resolve_connection_to_conn                 55 ms788pg_graphql-1.6.2> ok 93        - resolve_connection_to_node                 63 ms789pg_graphql-1.6.2> ok 94        - resolve_error_connection_edge_no_field       46 ms790pg_net-0.20.3> gcc -Wall -Wmissing-prototypes -Wpointer-arith -Wdeclaration-after-statement -Werror=vla -Wendif-labels -Wmissing-format-attribute -Wimplicit-fallthrough=3 -Wcast-function-type -Wshadow=compatible-local -Wformat-security -fno-strict-aliasing -fwrapv -fexcess-precision=standard -Wno-format-truncation -Wno-stringop-truncation -g -O2 -std=c11 -Wextra -Wall -Werror -Wno-declaration-after-statement -Wno-vla -Wno-long-long -Wmissing-variable-declarations -fPIC -fvisibility=hidden  -DEXTVERSION=\"0.20.3\" -I. -I./ -I/nix/store/3jrlp8bmrlfal71jwaj244rjgdnngl81-postgresql-17.11/include/server -I/nix/store/3jrlp8bmrlfal71jwaj244rjgdnngl81-postgresql-17.11/include/internal -D_GNU_SOURCE  -I/nix/store/n8zb5iyyaqfrjmdgibap9j6a29y1cl41-libxml2-2.15.4-dev/include/libxml2 -I/nix/store/3gx080m9qfv8k0sff9bg5877n6zd9kv8-lz4-1.10.0-dev/include -I/nix/store/3y8mdshg1hkwpcnzhhd1q71p2wps47d4-zstd-1.5.7-dev/include -I/nix/store/qm179cq3lxwcmmm6lnkfghiw67zjbm3c-icu4c-75.1-dev/include  -c -o src/errors.o src/errors.c791pg_graphql-1.6.2> ok 95        - resolve_error_connection_edge_node_no_field       46 ms792pg_graphql-1.6.2> ok 96        - resolve_error_connection_no_field          46 ms793pg_graphql-1.6.2> ok 97        - resolve_error_from_parser                  22 ms794pg_graphql-1.6.2> ok 98        - resolve_error_mutation_no_field            54 ms795pg_graphql-1.6.2> ok 99        - resolve_error_node_no_field                50 ms796pg_graphql-1.6.2> ok 100       - resolve_error_query_no_field               44 ms797pg_net-0.20.3> gcc -Wall -Wmissing-prototypes -Wpointer-arith -Wdeclaration-after-statement -Werror=vla -Wendif-labels -Wmissing-format-attribute -Wimplicit-fallthrough=3 -Wcast-function-type -Wshadow=compatible-local -Wformat-security -fno-strict-aliasing -fwrapv -fexcess-precision=standard -Wno-format-truncation -Wno-stringop-truncation -g -O2 -std=c11 -Wextra -Wall -Werror -Wno-declaration-after-statement -Wno-vla -Wno-long-long -Wmissing-variable-declarations -fPIC -fvisibility=hidden  -DEXTVERSION=\"0.20.3\" -I. -I./ -I/nix/store/3jrlp8bmrlfal71jwaj244rjgdnngl81-postgresql-17.11/include/server -I/nix/store/3jrlp8bmrlfal71jwaj244rjgdnngl81-postgresql-17.11/include/internal -D_GNU_SOURCE  -I/nix/store/n8zb5iyyaqfrjmdgibap9j6a29y1cl41-libxml2-2.15.4-dev/include/libxml2 -I/nix/store/3gx080m9qfv8k0sff9bg5877n6zd9kv8-lz4-1.10.0-dev/include -I/nix/store/3y8mdshg1hkwpcnzhhd1q71p2wps47d4-zstd-1.5.7-dev/include -I/nix/store/qm179cq3lxwcmmm6lnkfghiw67zjbm3c-icu4c-75.1-dev/include  -c -o src/event.o src/event.c798pg_graphql-1.6.2> ok 101       - resolve_fragment                           49 ms799pg_graphql-1.6.2> ok 102       - resolve_graphiql_schema                   110 ms800pg_graphql-1.6.2> ok 103       - resolve_one                                92 ms801pg_graphql-1.6.2> ok 104       - roundtrip_types                            72 ms802pg_net-0.20.3> gcc -Wall -Wmissing-prototypes -Wpointer-arith -Wdeclaration-after-statement -Werror=vla -Wendif-labels -Wmissing-format-attribute -Wimplicit-fallthrough=3 -Wcast-function-type -Wshadow=compatible-local -Wformat-security -fno-strict-aliasing -fwrapv -fexcess-precision=standard -Wno-format-truncation -Wno-stringop-truncation -g -O2 -std=c11 -Wextra -Wall -Werror -Wno-declaration-after-statement -Wno-vla -Wno-long-long -Wmissing-variable-declarations -fPIC -fvisibility=hidden  -DEXTVERSION=\"0.20.3\" -I. -I./ -I/nix/store/3jrlp8bmrlfal71jwaj244rjgdnngl81-postgresql-17.11/include/server -I/nix/store/3jrlp8bmrlfal71jwaj244rjgdnngl81-postgresql-17.11/include/internal -D_GNU_SOURCE  -I/nix/store/n8zb5iyyaqfrjmdgibap9j6a29y1cl41-libxml2-2.15.4-dev/include/libxml2 -I/nix/store/3gx080m9qfv8k0sff9bg5877n6zd9kv8-lz4-1.10.0-dev/include -I/nix/store/3y8mdshg1hkwpcnzhhd1q71p2wps47d4-zstd-1.5.7-dev/include -I/nix/store/qm179cq3lxwcmmm6lnkfghiw67zjbm3c-icu4c-75.1-dev/include  -c -o src/util.o src/util.c803pg_graphql-1.6.2> ok 105       - row_level_security                         56 ms804pg_graphql-1.6.2> ok 106       - sqli_connection                            62 ms805pg_graphql-1.6.2> ok 107       - string_filters                             70 ms806pg_graphql-1.6.2> ok 108       - test_error_anon_and_named_operations       57 ms807pg_graphql-1.6.2> ok 109       - test_error_invalid_offset                  78 ms808pg_net-0.20.3> gcc -Wall -Wmissing-prototypes -Wpointer-arith -Wdeclaration-after-statement -Werror=vla -Wendif-labels -Wmissing-format-attribute -Wimplicit-fallthrough=3 -Wcast-function-type -Wshadow=compatible-local -Wformat-security -fno-strict-aliasing -fwrapv -fexcess-precision=standard -Wno-format-truncation -Wno-stringop-truncation -g -O2 -std=c11 -Wextra -Wall -Werror -Wno-declaration-after-statement -Wno-vla -Wno-long-long -Wmissing-variable-declarations -fPIC -fvisibility=hidden  -DEXTVERSION=\"0.20.3\" -I. -I./ -I/nix/store/3jrlp8bmrlfal71jwaj244rjgdnngl81-postgresql-17.11/include/server -I/nix/store/3jrlp8bmrlfal71jwaj244rjgdnngl81-postgresql-17.11/include/internal -D_GNU_SOURCE  -I/nix/store/n8zb5iyyaqfrjmdgibap9j6a29y1cl41-libxml2-2.15.4-dev/include/libxml2 -I/nix/store/3gx080m9qfv8k0sff9bg5877n6zd9kv8-lz4-1.10.0-dev/include -I/nix/store/3y8mdshg1hkwpcnzhhd1q71p2wps47d4-zstd-1.5.7-dev/include -I/nix/store/qm179cq3lxwcmmm6lnkfghiw67zjbm3c-icu4c-75.1-dev/include  -c -o src/worker.o src/worker.c809pg_graphql-1.6.2> ok 110       - test_error_multiple_anon_operations        43 ms810pg_graphql-1.6.2> ok 111       - test_error_mutation_transpilation          54 ms811pg_graphql-1.6.2> ok 112       - test_error_operation_name_not_found        49 ms812pg_graphql-1.6.2> ok 113       - test_error_operation_names_not_unique       43 ms813pg_graphql-1.6.2> ok 114       - test_error_query_transpilation             58 ms814pg_graphql-1.6.2> ok 115       - test_error_subscription                    43 ms815pg_graphql-1.6.2> ok 116       - test_query__type                           43 ms816pg_graphql-1.6.2> ok 117       - total_count                                80 ms817pg_graphql-1.6.2> ok 118       - type_bigfloat                              55 ms818pg_graphql-1.6.2> ok 119       - type_modifier_max_length                   60 ms819pg_net-0.20.3> gcc -Wall -Wmissing-prototypes -Wpointer-arith -Wdeclaration-after-statement -Werror=vla -Wendif-labels -Wmissing-format-attribute -Wimplicit-fallthrough=3 -Wcast-function-type -Wshadow=compatible-local -Wformat-security -fno-strict-aliasing -fwrapv -fexcess-precision=standard -Wno-format-truncation -Wno-stringop-truncation -g -O2 -std=c11 -Wextra -Wall -Werror -Wno-declaration-after-statement -Wno-vla -Wno-long-long -Wmissing-variable-declarations -fPIC -fvisibility=hidden -shared -o pg_net.so  src/core.o  src/errors.o  src/event.o  src/util.o  src/worker.o  -L/nix/store/dpr85nhbv5igqis7gnaavv9x21sjbc0i-postgresql-17.11-lib/lib    -L/nix/store/xjnvfcp3i347rp7zncsw5vdp7wgnpyaf-libxml2-2.15.4/lib -L/nix/store/yq0c2jhzc3877vagbkwxinm80wajlkh6-lz4-1.10.0-lib/lib -L/nix/store/i8f26lwk8i93hmiyrmsy752m6nwi4pmk-zstd-1.5.7/lib -Wl,--as-needed -Wl,-rpath,'/nix/store/dpr85nhbv5igqis7gnaavv9x21sjbc0i-postgresql-17.11-lib/lib',--enable-new-dtags -fvisibility=hidden -lcurl 820pg_graphql-1.6.2> ok 120       - type_opaque                                55 ms821pg_graphql-1.6.2> ok 121       - variable_default                           53 ms822pg_net-0.20.3> cp sql/pg_net.sql sql/pg_net--0.20.3.sql823pg_net-0.20.3> sed "s/@EXTVERSION@/0.20.3/g" pg_net.control.in > pg_net.control824pg_net-0.20.3> Running phase: installPhase825pg_net-0.20.3> Running phase: fixupPhase826pg_net-0.20.3> shrinking RPATHs of ELF executables and libraries in /nix/store/y9r1ln8yg2q24jf4x552fjzd01hnmk28-pg_net-0.20.3827pg_net-0.20.3> shrinking /nix/store/y9r1ln8yg2q24jf4x552fjzd01hnmk28-pg_net-0.20.3/lib/pg_net-0.20.3.so828pg_net-0.20.3> checking for references to /build/ in /nix/store/y9r1ln8yg2q24jf4x552fjzd01hnmk28-pg_net-0.20.3...829pg_graphql-1.6.2> ok 122       - views_integration                         181 ms830pg_graphql-1.6.2> 1..122831pg_graphql-1.6.2> # All 122 tests passed.832pg_graphql-1.6.2> + pg_ctl stop -m i833pg_graphql-1.6.2> waiting for server to shut down....2026-10-27 12:58:51.051 UTC [3107] LOG:  received immediate shutdown request834pg_net-0.20.3> patching script interpreter paths in /nix/store/y9r1ln8yg2q24jf4x552fjzd01hnmk28-pg_net-0.20.3835pg_net-0.20.3> stripping (with command strip and flags -S -p) in  /nix/store/y9r1ln8yg2q24jf4x552fjzd01hnmk28-pg_net-0.20.3/lib836pg_graphql-1.6.2> 2026-10-27 12:58:51.060 UTC [3107] LOG:  database system is shut down837pg_graphql-1.6.2>  done838pg_graphql-1.6.2> server stopped839pg_graphql-1.6.2> Running phase: installPhase840pg_graphql-1.6.2> Executing buildPgrxExtension install841pg_graphql-1.6.2> Running phase: fixupPhase842pg_graphql-1.6.2> shrinking RPATHs of ELF executables and libraries in /nix/store/w1i7873j12lnfmjxn3gsijk2dxjyyp36-pg_graphql-1.6.2843pg_graphql-1.6.2> shrinking /nix/store/w1i7873j12lnfmjxn3gsijk2dxjyyp36-pg_graphql-1.6.2/lib/pg_graphql-1.6.2.so844pg_graphql-1.6.2> checking for references to /build/ in /nix/store/w1i7873j12lnfmjxn3gsijk2dxjyyp36-pg_graphql-1.6.2...845pg_graphql-1.6.2> patching script interpreter paths in /nix/store/w1i7873j12lnfmjxn3gsijk2dxjyyp36-pg_graphql-1.6.2846pg_graphql-1.6.2> stripping (with command strip and flags -S -p) in  /nix/store/w1i7873j12lnfmjxn3gsijk2dxjyyp36-pg_graphql-1.6.2/lib847building '/nix/store/2bffnv3kpqb0ds37awxn31id57wbnfww-pg_repack.drv' on 'ssh-ng://nixbot-remote-build@78.232.36.247'848building '/nix/store/2bffnv3kpqb0ds37awxn31id57wbnfww-pg_repack.drv'849pg_repack> structuredAttrs is enabled850pg_repack> created 19 symlinks in user environment851building '/nix/store/75r64nj0181nzpg27s0313skc3mx131d-pgsodium-3.1.7.drv' on 'ssh-ng://nixbot-remote-build@78.232.36.247'852building '/nix/store/75r64nj0181nzpg27s0313skc3mx131d-pgsodium-3.1.7.drv'853pgsodium-3.1.7> Running phase: unpackPhase854pgsodium-3.1.7> unpacking source archive /nix/store/xj81h9si3spl8xjc743spsi2256y6xsf-source855pgsodium-3.1.7> source root is source856pgsodium-3.1.7> Running phase: patchPhase857pgsodium-3.1.7> Running phase: updateAutotoolsGnuConfigScriptsPhase858pgsodium-3.1.7> Running phase: configurePhase859pgsodium-3.1.7> no configure script, doing nothing860pgsodium-3.1.7> Running phase: buildPhase861pgsodium-3.1.7> build flags: SHELL=/nix/store/pbjg9k27s3v1wp5s8c6pb23s0m69yjwz-bash-5.3p9/bin/bash862pgsodium-3.1.7> gcc -Wall -Wmissing-prototypes -Wpointer-arith -Wdeclaration-after-statement -Werror=vla -Wendif-labels -Wmissing-format-attribute -Wimplicit-fallthrough=3 -Wcast-function-type -Wshadow=compatible-local -Wformat-security -fno-strict-aliasing -fwrapv -fexcess-precision=standard -Wno-format-truncation -Wno-stringop-truncation -moutline-atomics -g -O2 -fPIC -fvisibility=hidden -O0 -I. -I./ -I/nix/store/pmaflmk45425rq04ajcb4yhm58w6hq3p-postgresql-17_22/include/server -I/nix/store/pmaflmk45425rq04ajcb4yhm58w6hq3p-postgresql-17_22/include/internal -D_GNU_SOURCE  -I/nix/store/n8zb5iyyaqfrjmdgibap9j6a29y1cl41-libxml2-2.15.4-dev/include/libxml2 -I/nix/store/3gx080m9qfv8k0sff9bg5877n6zd9kv8-lz4-1.10.0-dev/include -I/nix/store/3y8mdshg1hkwpcnzhhd1q71p2wps47d4-zstd-1.5.7-dev/include -I/nix/store/qm179cq3lxwcmmm6lnkfghiw67zjbm3c-icu4c-75.1-dev/include  -c -o src/aead.o src/aead.c863pgsodium-3.1.7> In file included from /nix/store/bmy3kwy9ap95i36rfjm2nn9amjys57jn-glibc-2.42-84-dev/include/bits/libc-header-start.h:33,864pgsodium-3.1.7>                  from /nix/store/bmy3kwy9ap95i36rfjm2nn9amjys57jn-glibc-2.42-84-dev/include/stdio.h:28,865pgsodium-3.1.7>                  from src/pgsodium.h:4,866pgsodium-3.1.7>                  from src/aead.c:1:867pgsodium-3.1.7> /nix/store/bmy3kwy9ap95i36rfjm2nn9amjys57jn-glibc-2.42-84-dev/include/features.h:435:4: warning: #warning _FORTIFY_SOURCE requires compiling with optimization (-O) [-Wcpp]868pgsodium-3.1.7>   435 | #  warning _FORTIFY_SOURCE requires compiling with optimization (-O)869pgsodium-3.1.7>       |    ^~~~~~~870pgsodium-3.1.7> gcc -Wall -Wmissing-prototypes -Wpointer-arith -Wdeclaration-after-statement -Werror=vla -Wendif-labels -Wmissing-format-attribute -Wimplicit-fallthrough=3 -Wcast-function-type -Wshadow=compatible-local -Wformat-security -fno-strict-aliasing -fwrapv -fexcess-precision=standard -Wno-format-truncation -Wno-stringop-truncation -moutline-atomics -g -O2 -fPIC -fvisibility=hidden -O0 -I. -I./ -I/nix/store/pmaflmk45425rq04ajcb4yhm58w6hq3p-postgresql-17_22/include/server -I/nix/store/pmaflmk45425rq04ajcb4yhm58w6hq3p-postgresql-17_22/include/internal -D_GNU_SOURCE  -I/nix/store/n8zb5iyyaqfrjmdgibap9j6a29y1cl41-libxml2-2.15.4-dev/include/libxml2 -I/nix/store/3gx080m9qfv8k0sff9bg5877n6zd9kv8-lz4-1.10.0-dev/include -I/nix/store/3y8mdshg1hkwpcnzhhd1q71p2wps47d4-zstd-1.5.7-dev/include -I/nix/store/qm179cq3lxwcmmm6lnkfghiw67zjbm3c-icu4c-75.1-dev/include  -c -o src/auth.o src/auth.c871pgsodium-3.1.7> In file included from /nix/store/bmy3kwy9ap95i36rfjm2nn9amjys57jn-glibc-2.42-84-dev/include/bits/libc-header-start.h:33,872pgsodium-3.1.7>                  from /nix/store/bmy3kwy9ap95i36rfjm2nn9amjys57jn-glibc-2.42-84-dev/include/stdio.h:28,873pgsodium-3.1.7>                  from src/pgsodium.h:4,874pgsodium-3.1.7>                  from src/auth.c:1:875pgsodium-3.1.7> /nix/store/bmy3kwy9ap95i36rfjm2nn9amjys57jn-glibc-2.42-84-dev/include/features.h:435:4: warning: #warning _FORTIFY_SOURCE requires compiling with optimization (-O) [-Wcpp]876pgsodium-3.1.7>   435 | #  warning _FORTIFY_SOURCE requires compiling with optimization (-O)877pgsodium-3.1.7>       |    ^~~~~~~878pgsodium-3.1.7> gcc -Wall -Wmissing-prototypes -Wpointer-arith -Wdeclaration-after-statement -Werror=vla -Wendif-labels -Wmissing-format-attribute -Wimplicit-fallthrough=3 -Wcast-function-type -Wshadow=compatible-local -Wformat-security -fno-strict-aliasing -fwrapv -fexcess-precision=standard -Wno-format-truncation -Wno-stringop-truncation -moutline-atomics -g -O2 -fPIC -fvisibility=hidden -O0 -I. -I./ -I/nix/store/pmaflmk45425rq04ajcb4yhm58w6hq3p-postgresql-17_22/include/server -I/nix/store/pmaflmk45425rq04ajcb4yhm58w6hq3p-postgresql-17_22/include/internal -D_GNU_SOURCE  -I/nix/store/n8zb5iyyaqfrjmdgibap9j6a29y1cl41-libxml2-2.15.4-dev/include/libxml2 -I/nix/store/3gx080m9qfv8k0sff9bg5877n6zd9kv8-lz4-1.10.0-dev/include -I/nix/store/3y8mdshg1hkwpcnzhhd1q71p2wps47d4-zstd-1.5.7-dev/include -I/nix/store/qm179cq3lxwcmmm6lnkfghiw67zjbm3c-icu4c-75.1-dev/include  -c -o src/box.o src/box.c879pgsodium-3.1.7> In file included from /nix/store/bmy3kwy9ap95i36rfjm2nn9amjys57jn-glibc-2.42-84-dev/include/bits/libc-header-start.h:33,880pgsodium-3.1.7>                  from /nix/store/bmy3kwy9ap95i36rfjm2nn9amjys57jn-glibc-2.42-84-dev/include/stdio.h:28,881pgsodium-3.1.7>                  from src/pgsodium.h:4,882pgsodium-3.1.7>                  from src/box.c:1:883pgsodium-3.1.7> /nix/store/bmy3kwy9ap95i36rfjm2nn9amjys57jn-glibc-2.42-84-dev/include/features.h:435:4: warning: #warning _FORTIFY_SOURCE requires compiling with optimization (-O) [-Wcpp]884pgsodium-3.1.7>   435 | #  warning _FORTIFY_SOURCE requires compiling with optimization (-O)885pgsodium-3.1.7>       |    ^~~~~~~886pgsodium-3.1.7> gcc -Wall -Wmissing-prototypes -Wpointer-arith -Wdeclaration-after-statement -Werror=vla -Wendif-labels -Wmissing-format-attribute -Wimplicit-fallthrough=3 -Wcast-function-type -Wshadow=compatible-local -Wformat-security -fno-strict-aliasing -fwrapv -fexcess-precision=standard -Wno-format-truncation -Wno-stringop-truncation -moutline-atomics -g -O2 -fPIC -fvisibility=hidden -O0 -I. -I./ -I/nix/store/pmaflmk45425rq04ajcb4yhm58w6hq3p-postgresql-17_22/include/server -I/nix/store/pmaflmk45425rq04ajcb4yhm58w6hq3p-postgresql-17_22/include/internal -D_GNU_SOURCE  -I/nix/store/n8zb5iyyaqfrjmdgibap9j6a29y1cl41-libxml2-2.15.4-dev/include/libxml2 -I/nix/store/3gx080m9qfv8k0sff9bg5877n6zd9kv8-lz4-1.10.0-dev/include -I/nix/store/3y8mdshg1hkwpcnzhhd1q71p2wps47d4-zstd-1.5.7-dev/include -I/nix/store/qm179cq3lxwcmmm6lnkfghiw67zjbm3c-icu4c-75.1-dev/include  -c -o src/crypto_aead_det_xchacha20.o src/crypto_aead_det_xchacha20.c887pgsodium-3.1.7> In file included from /nix/store/bmy3kwy9ap95i36rfjm2nn9amjys57jn-glibc-2.42-84-dev/include/bits/libc-header-start.h:33,888pgsodium-3.1.7>                  from /nix/store/bmy3kwy9ap95i36rfjm2nn9amjys57jn-glibc-2.42-84-dev/include/stdint.h:26,889pgsodium-3.1.7>                  from /nix/store/wwdfqzlkqiahwaaxwnzkbffqfcy3wgav-gcc-15.3.0/lib/gcc/aarch64-unknown-linux-gnu/15.3.0/include/stdint.h:11,890pgsodium-3.1.7>                  from /nix/store/w1dbca09jiyx1b8wh0ma31n6j8d6c9xw-libsodium-1.0.22-unstable-2026-04-09-dev/include/sodium/export.h:6,891pgsodium-3.1.7>                  from /nix/store/w1dbca09jiyx1b8wh0ma31n6j8d6c9xw-libsodium-1.0.22-unstable-2026-04-09-dev/include/sodium/version.h:5,892pgsodium-3.1.7>                  from /nix/store/w1dbca09jiyx1b8wh0ma31n6j8d6c9xw-libsodium-1.0.22-unstable-2026-04-09-dev/include/sodium.h:5,893pgsodium-3.1.7>                  from src/crypto_aead_det_xchacha20.c:27:894pgsodium-3.1.7> /nix/store/bmy3kwy9ap95i36rfjm2nn9amjys57jn-glibc-2.42-84-dev/include/features.h:435:4: warning: #warning _FORTIFY_SOURCE requires compiling with optimization (-O) [-Wcpp]895pgsodium-3.1.7>   435 | #  warning _FORTIFY_SOURCE requires compiling with optimization (-O)896pgsodium-3.1.7>       |    ^~~~~~~897pgsodium-3.1.7> gcc -Wall -Wmissing-prototypes -Wpointer-arith -Wdeclaration-after-statement -Werror=vla -Wendif-labels -Wmissing-format-attribute -Wimplicit-fallthrough=3 -Wcast-function-type -Wshadow=compatible-local -Wformat-security -fno-strict-aliasing -fwrapv -fexcess-precision=standard -Wno-format-truncation -Wno-stringop-truncation -moutline-atomics -g -O2 -fPIC -fvisibility=hidden -O0 -I. -I./ -I/nix/store/pmaflmk45425rq04ajcb4yhm58w6hq3p-postgresql-17_22/include/server -I/nix/store/pmaflmk45425rq04ajcb4yhm58w6hq3p-postgresql-17_22/include/internal -D_GNU_SOURCE  -I/nix/store/n8zb5iyyaqfrjmdgibap9j6a29y1cl41-libxml2-2.15.4-dev/include/libxml2 -I/nix/store/3gx080m9qfv8k0sff9bg5877n6zd9kv8-lz4-1.10.0-dev/include -I/nix/store/3y8mdshg1hkwpcnzhhd1q71p2wps47d4-zstd-1.5.7-dev/include -I/nix/store/qm179cq3lxwcmmm6lnkfghiw67zjbm3c-icu4c-75.1-dev/include  -c -o src/derive.o src/derive.c898pgsodium-3.1.7> In file included from /nix/store/bmy3kwy9ap95i36rfjm2nn9amjys57jn-glibc-2.42-84-dev/include/bits/libc-header-start.h:33,899pgsodium-3.1.7>                  from /nix/store/bmy3kwy9ap95i36rfjm2nn9amjys57jn-glibc-2.42-84-dev/include/stdio.h:28,900pgsodium-3.1.7>                  from src/pgsodium.h:4,901pgsodium-3.1.7>                  from src/derive.c:1:902pgsodium-3.1.7> /nix/store/bmy3kwy9ap95i36rfjm2nn9amjys57jn-glibc-2.42-84-dev/include/features.h:435:4: warning: #warning _FORTIFY_SOURCE requires compiling with optimization (-O) [-Wcpp]903pgsodium-3.1.7>   435 | #  warning _FORTIFY_SOURCE requires compiling with optimization (-O)904pgsodium-3.1.7>       |    ^~~~~~~905pgsodium-3.1.7> gcc -Wall -Wmissing-prototypes -Wpointer-arith -Wdeclaration-after-statement -Werror=vla -Wendif-labels -Wmissing-format-attribute -Wimplicit-fallthrough=3 -Wcast-function-type -Wshadow=compatible-local -Wformat-security -fno-strict-aliasing -fwrapv -fexcess-precision=standard -Wno-format-truncation -Wno-stringop-truncation -moutline-atomics -g -O2 -fPIC -fvisibility=hidden -O0 -I. -I./ -I/nix/store/pmaflmk45425rq04ajcb4yhm58w6hq3p-postgresql-17_22/include/server -I/nix/store/pmaflmk45425rq04ajcb4yhm58w6hq3p-postgresql-17_22/include/internal -D_GNU_SOURCE  -I/nix/store/n8zb5iyyaqfrjmdgibap9j6a29y1cl41-libxml2-2.15.4-dev/include/libxml2 -I/nix/store/3gx080m9qfv8k0sff9bg5877n6zd9kv8-lz4-1.10.0-dev/include -I/nix/store/3y8mdshg1hkwpcnzhhd1q71p2wps47d4-zstd-1.5.7-dev/include -I/nix/store/qm179cq3lxwcmmm6lnkfghiw67zjbm3c-icu4c-75.1-dev/include  -c -o src/hash.o src/hash.c906pgsodium-3.1.7> In file included from /nix/store/bmy3kwy9ap95i36rfjm2nn9amjys57jn-glibc-2.42-84-dev/include/bits/libc-header-start.h:33,907pgsodium-3.1.7>                  from /nix/store/bmy3kwy9ap95i36rfjm2nn9amjys57jn-glibc-2.42-84-dev/include/stdio.h:28,908pgsodium-3.1.7>                  from src/pgsodium.h:4,909pgsodium-3.1.7>                  from src/hash.c:1:910pgsodium-3.1.7> /nix/store/bmy3kwy9ap95i36rfjm2nn9amjys57jn-glibc-2.42-84-dev/include/features.h:435:4: warning: #warning _FORTIFY_SOURCE requires compiling with optimization (-O) [-Wcpp]911pgsodium-3.1.7>   435 | #  warning _FORTIFY_SOURCE requires compiling with optimization (-O)912pgsodium-3.1.7>       |    ^~~~~~~913pgsodium-3.1.7> gcc -Wall -Wmissing-prototypes -Wpointer-arith -Wdeclaration-after-statement -Werror=vla -Wendif-labels -Wmissing-format-attribute -Wimplicit-fallthrough=3 -Wcast-function-type -Wshadow=compatible-local -Wformat-security -fno-strict-aliasing -fwrapv -fexcess-precision=standard -Wno-format-truncation -Wno-stringop-truncation -moutline-atomics -g -O2 -fPIC -fvisibility=hidden -O0 -I. -I./ -I/nix/store/pmaflmk45425rq04ajcb4yhm58w6hq3p-postgresql-17_22/include/server -I/nix/store/pmaflmk45425rq04ajcb4yhm58w6hq3p-postgresql-17_22/include/internal -D_GNU_SOURCE  -I/nix/store/n8zb5iyyaqfrjmdgibap9j6a29y1cl41-libxml2-2.15.4-dev/include/libxml2 -I/nix/store/3gx080m9qfv8k0sff9bg5877n6zd9kv8-lz4-1.10.0-dev/include -I/nix/store/3y8mdshg1hkwpcnzhhd1q71p2wps47d4-zstd-1.5.7-dev/include -I/nix/store/qm179cq3lxwcmmm6lnkfghiw67zjbm3c-icu4c-75.1-dev/include  -c -o src/helpers.o src/helpers.c914pgsodium-3.1.7> In file included from /nix/store/bmy3kwy9ap95i36rfjm2nn9amjys57jn-glibc-2.42-84-dev/include/bits/libc-header-start.h:33,915pgsodium-3.1.7>                  from /nix/store/bmy3kwy9ap95i36rfjm2nn9amjys57jn-glibc-2.42-84-dev/include/stdio.h:28,916pgsodium-3.1.7>                  from src/pgsodium.h:4,917pgsodium-3.1.7>                  from src/helpers.c:1:918pgsodium-3.1.7> /nix/store/bmy3kwy9ap95i36rfjm2nn9amjys57jn-glibc-2.42-84-dev/include/features.h:435:4: warning: #warning _FORTIFY_SOURCE requires compiling with optimization (-O) [-Wcpp]919pgsodium-3.1.7>   435 | #  warning _FORTIFY_SOURCE requires compiling with optimization (-O)920pgsodium-3.1.7>       |    ^~~~~~~921pgsodium-3.1.7> gcc -Wall -Wmissing-prototypes -Wpointer-arith -Wdeclaration-after-statement -Werror=vla -Wendif-labels -Wmissing-format-attribute -Wimplicit-fallthrough=3 -Wcast-function-type -Wshadow=compatible-local -Wformat-security -fno-strict-aliasing -fwrapv -fexcess-precision=standard -Wno-format-truncation -Wno-stringop-truncation -moutline-atomics -g -O2 -fPIC -fvisibility=hidden -O0 -I. -I./ -I/nix/store/pmaflmk45425rq04ajcb4yhm58w6hq3p-postgresql-17_22/include/server -I/nix/store/pmaflmk45425rq04ajcb4yhm58w6hq3p-postgresql-17_22/include/internal -D_GNU_SOURCE  -I/nix/store/n8zb5iyyaqfrjmdgibap9j6a29y1cl41-libxml2-2.15.4-dev/include/libxml2 -I/nix/store/3gx080m9qfv8k0sff9bg5877n6zd9kv8-lz4-1.10.0-dev/include -I/nix/store/3y8mdshg1hkwpcnzhhd1q71p2wps47d4-zstd-1.5.7-dev/include -I/nix/store/qm179cq3lxwcmmm6lnkfghiw67zjbm3c-icu4c-75.1-dev/include  -c -o src/hmac.o src/hmac.c922pgsodium-3.1.7> In file included from /nix/store/bmy3kwy9ap95i36rfjm2nn9amjys57jn-glibc-2.42-84-dev/include/bits/libc-header-start.h:33,923pgsodium-3.1.7>                  from /nix/store/bmy3kwy9ap95i36rfjm2nn9amjys57jn-glibc-2.42-84-dev/include/stdio.h:28,924pgsodium-3.1.7>                  from src/pgsodium.h:4,925pgsodium-3.1.7>                  from src/hmac.c:1:926pgsodium-3.1.7> /nix/store/bmy3kwy9ap95i36rfjm2nn9amjys57jn-glibc-2.42-84-dev/include/features.h:435:4: warning: #warning _FORTIFY_SOURCE requires compiling with optimization (-O) [-Wcpp]927pgsodium-3.1.7>   435 | #  warning _FORTIFY_SOURCE requires compiling with optimization (-O)928pgsodium-3.1.7>       |    ^~~~~~~929pgsodium-3.1.7> gcc -Wall -Wmissing-prototypes -Wpointer-arith -Wdeclaration-after-statement -Werror=vla -Wendif-labels -Wmissing-format-attribute -Wimplicit-fallthrough=3 -Wcast-function-type -Wshadow=compatible-local -Wformat-security -fno-strict-aliasing -fwrapv -fexcess-precision=standard -Wno-format-truncation -Wno-stringop-truncation -moutline-atomics -g -O2 -fPIC -fvisibility=hidden -O0 -I. -I./ -I/nix/store/pmaflmk45425rq04ajcb4yhm58w6hq3p-postgresql-17_22/include/server -I/nix/store/pmaflmk45425rq04ajcb4yhm58w6hq3p-postgresql-17_22/include/internal -D_GNU_SOURCE  -I/nix/store/n8zb5iyyaqfrjmdgibap9j6a29y1cl41-libxml2-2.15.4-dev/include/libxml2 -I/nix/store/3gx080m9qfv8k0sff9bg5877n6zd9kv8-lz4-1.10.0-dev/include -I/nix/store/3y8mdshg1hkwpcnzhhd1q71p2wps47d4-zstd-1.5.7-dev/include -I/nix/store/qm179cq3lxwcmmm6lnkfghiw67zjbm3c-icu4c-75.1-dev/include  -c -o src/kdf.o src/kdf.c930pgsodium-3.1.7> In file included from /nix/store/bmy3kwy9ap95i36rfjm2nn9amjys57jn-glibc-2.42-84-dev/include/bits/libc-header-start.h:33,931pgsodium-3.1.7>                  from /nix/store/bmy3kwy9ap95i36rfjm2nn9amjys57jn-glibc-2.42-84-dev/include/stdio.h:28,932pgsodium-3.1.7>                  from src/pgsodium.h:4,933pgsodium-3.1.7>                  from src/kdf.c:1:934pgsodium-3.1.7> /nix/store/bmy3kwy9ap95i36rfjm2nn9amjys57jn-glibc-2.42-84-dev/include/features.h:435:4: warning: #warning _FORTIFY_SOURCE requires compiling with optimization (-O) [-Wcpp]935pgsodium-3.1.7>   435 | #  warning _FORTIFY_SOURCE requires compiling with optimization (-O)936pgsodium-3.1.7>       |    ^~~~~~~937pgsodium-3.1.7> gcc -Wall -Wmissing-prototypes -Wpointer-arith -Wdeclaration-after-statement -Werror=vla -Wendif-labels -Wmissing-format-attribute -Wimplicit-fallthrough=3 -Wcast-function-type -Wshadow=compatible-local -Wformat-security -fno-strict-aliasing -fwrapv -fexcess-precision=standard -Wno-format-truncation -Wno-stringop-truncation -moutline-atomics -g -O2 -fPIC -fvisibility=hidden -O0 -I. -I./ -I/nix/store/pmaflmk45425rq04ajcb4yhm58w6hq3p-postgresql-17_22/include/server -I/nix/store/pmaflmk45425rq04ajcb4yhm58w6hq3p-postgresql-17_22/include/internal -D_GNU_SOURCE  -I/nix/store/n8zb5iyyaqfrjmdgibap9j6a29y1cl41-libxml2-2.15.4-dev/include/libxml2 -I/nix/store/3gx080m9qfv8k0sff9bg5877n6zd9kv8-lz4-1.10.0-dev/include -I/nix/store/3y8mdshg1hkwpcnzhhd1q71p2wps47d4-zstd-1.5.7-dev/include -I/nix/store/qm179cq3lxwcmmm6lnkfghiw67zjbm3c-icu4c-75.1-dev/include  -c -o src/kx.o src/kx.c938pgsodium-3.1.7> In file included from /nix/store/bmy3kwy9ap95i36rfjm2nn9amjys57jn-glibc-2.42-84-dev/include/bits/libc-header-start.h:33,939pgsodium-3.1.7>                  from /nix/store/bmy3kwy9ap95i36rfjm2nn9amjys57jn-glibc-2.42-84-dev/include/stdio.h:28,940pgsodium-3.1.7>                  from src/pgsodium.h:4,941pgsodium-3.1.7>                  from src/kx.c:1:942pgsodium-3.1.7> /nix/store/bmy3kwy9ap95i36rfjm2nn9amjys57jn-glibc-2.42-84-dev/include/features.h:435:4: warning: #warning _FORTIFY_SOURCE requires compiling with optimization (-O) [-Wcpp]943pgsodium-3.1.7>   435 | #  warning _FORTIFY_SOURCE requires compiling with optimization (-O)944pgsodium-3.1.7>       |    ^~~~~~~945pgsodium-3.1.7> gcc -Wall -Wmissing-prototypes -Wpointer-arith -Wdeclaration-after-statement -Werror=vla -Wendif-labels -Wmissing-format-attribute -Wimplicit-fallthrough=3 -Wcast-function-type -Wshadow=compatible-local -Wformat-security -fno-strict-aliasing -fwrapv -fexcess-precision=standard -Wno-format-truncation -Wno-stringop-truncation -moutline-atomics -g -O2 -fPIC -fvisibility=hidden -O0 -I. -I./ -I/nix/store/pmaflmk45425rq04ajcb4yhm58w6hq3p-postgresql-17_22/include/server -I/nix/store/pmaflmk45425rq04ajcb4yhm58w6hq3p-postgresql-17_22/include/internal -D_GNU_SOURCE  -I/nix/store/n8zb5iyyaqfrjmdgibap9j6a29y1cl41-libxml2-2.15.4-dev/include/libxml2 -I/nix/store/3gx080m9qfv8k0sff9bg5877n6zd9kv8-lz4-1.10.0-dev/include -I/nix/store/3y8mdshg1hkwpcnzhhd1q71p2wps47d4-zstd-1.5.7-dev/include -I/nix/store/qm179cq3lxwcmmm6lnkfghiw67zjbm3c-icu4c-75.1-dev/include  -c -o src/pgsodium.o src/pgsodium.c946pgsodium-3.1.7> In file included from /nix/store/bmy3kwy9ap95i36rfjm2nn9amjys57jn-glibc-2.42-84-dev/include/bits/libc-header-start.h:33,947pgsodium-3.1.7>                  from /nix/store/bmy3kwy9ap95i36rfjm2nn9amjys57jn-glibc-2.42-84-dev/include/stdio.h:28,948pgsodium-3.1.7>                  from src/pgsodium.h:4,949pgsodium-3.1.7>                  from src/pgsodium.c:1:950pgsodium-3.1.7> /nix/store/bmy3kwy9ap95i36rfjm2nn9amjys57jn-glibc-2.42-84-dev/include/features.h:435:4: warning: #warning _FORTIFY_SOURCE requires compiling with optimization (-O) [-Wcpp]951pgsodium-3.1.7>   435 | #  warning _FORTIFY_SOURCE requires compiling with optimization (-O)952pgsodium-3.1.7>       |    ^~~~~~~953pgsodium-3.1.7> gcc -Wall -Wmissing-prototypes -Wpointer-arith -Wdeclaration-after-statement -Werror=vla -Wendif-labels -Wmissing-format-attribute -Wimplicit-fallthrough=3 -Wcast-function-type -Wshadow=compatible-local -Wformat-security -fno-strict-aliasing -fwrapv -fexcess-precision=standard -Wno-format-truncation -Wno-stringop-truncation -moutline-atomics -g -O2 -fPIC -fvisibility=hidden -O0 -I. -I./ -I/nix/store/pmaflmk45425rq04ajcb4yhm58w6hq3p-postgresql-17_22/include/server -I/nix/store/pmaflmk45425rq04ajcb4yhm58w6hq3p-postgresql-17_22/include/internal -D_GNU_SOURCE  -I/nix/store/n8zb5iyyaqfrjmdgibap9j6a29y1cl41-libxml2-2.15.4-dev/include/libxml2 -I/nix/store/3gx080m9qfv8k0sff9bg5877n6zd9kv8-lz4-1.10.0-dev/include -I/nix/store/3y8mdshg1hkwpcnzhhd1q71p2wps47d4-zstd-1.5.7-dev/include -I/nix/store/qm179cq3lxwcmmm6lnkfghiw67zjbm3c-icu4c-75.1-dev/include  -c -o src/pwhash.o src/pwhash.c954pgsodium-3.1.7> In file included from /nix/store/bmy3kwy9ap95i36rfjm2nn9amjys57jn-glibc-2.42-84-dev/include/bits/libc-header-start.h:33,955pgsodium-3.1.7>                  from /nix/store/bmy3kwy9ap95i36rfjm2nn9amjys57jn-glibc-2.42-84-dev/include/stdio.h:28,956pgsodium-3.1.7>                  from src/pgsodium.h:4,957pgsodium-3.1.7>                  from src/pwhash.c:1:958pgsodium-3.1.7> /nix/store/bmy3kwy9ap95i36rfjm2nn9amjys57jn-glibc-2.42-84-dev/include/features.h:435:4: warning: #warning _FORTIFY_SOURCE requires compiling with optimization (-O) [-Wcpp]959pgsodium-3.1.7>   435 | #  warning _FORTIFY_SOURCE requires compiling with optimization (-O)960pgsodium-3.1.7>       |    ^~~~~~~961pgsodium-3.1.7> gcc -Wall -Wmissing-prototypes -Wpointer-arith -Wdeclaration-after-statement -Werror=vla -Wendif-labels -Wmissing-format-attribute -Wimplicit-fallthrough=3 -Wcast-function-type -Wshadow=compatible-local -Wformat-security -fno-strict-aliasing -fwrapv -fexcess-precision=standard -Wno-format-truncation -Wno-stringop-truncation -moutline-atomics -g -O2 -fPIC -fvisibility=hidden -O0 -I. -I./ -I/nix/store/pmaflmk45425rq04ajcb4yhm58w6hq3p-postgresql-17_22/include/server -I/nix/store/pmaflmk45425rq04ajcb4yhm58w6hq3p-postgresql-17_22/include/internal -D_GNU_SOURCE  -I/nix/store/n8zb5iyyaqfrjmdgibap9j6a29y1cl41-libxml2-2.15.4-dev/include/libxml2 -I/nix/store/3gx080m9qfv8k0sff9bg5877n6zd9kv8-lz4-1.10.0-dev/include -I/nix/store/3y8mdshg1hkwpcnzhhd1q71p2wps47d4-zstd-1.5.7-dev/include -I/nix/store/qm179cq3lxwcmmm6lnkfghiw67zjbm3c-icu4c-75.1-dev/include  -c -o src/random.o src/random.c962pgsodium-3.1.7> In file included from /nix/store/bmy3kwy9ap95i36rfjm2nn9amjys57jn-glibc-2.42-84-dev/include/bits/libc-header-start.h:33,963pgsodium-3.1.7>                  from /nix/store/bmy3kwy9ap95i36rfjm2nn9amjys57jn-glibc-2.42-84-dev/include/stdio.h:28,964pgsodium-3.1.7>                  from src/pgsodium.h:4,965pgsodium-3.1.7>                  from src/random.c:1:966pgsodium-3.1.7> /nix/store/bmy3kwy9ap95i36rfjm2nn9amjys57jn-glibc-2.42-84-dev/include/features.h:435:4: warning: #warning _FORTIFY_SOURCE requires compiling with optimization (-O) [-Wcpp]967pgsodium-3.1.7>   435 | #  warning _FORTIFY_SOURCE requires compiling with optimization (-O)968pgsodium-3.1.7>       |    ^~~~~~~969pgsodium-3.1.7> gcc -Wall -Wmissing-prototypes -Wpointer-arith -Wdeclaration-after-statement -Werror=vla -Wendif-labels -Wmissing-format-attribute -Wimplicit-fallthrough=3 -Wcast-function-type -Wshadow=compatible-local -Wformat-security -fno-strict-aliasing -fwrapv -fexcess-precision=standard -Wno-format-truncation -Wno-stringop-truncation -moutline-atomics -g -O2 -fPIC -fvisibility=hidden -O0 -I. -I./ -I/nix/store/pmaflmk45425rq04ajcb4yhm58w6hq3p-postgresql-17_22/include/server -I/nix/store/pmaflmk45425rq04ajcb4yhm58w6hq3p-postgresql-17_22/include/internal -D_GNU_SOURCE  -I/nix/store/n8zb5iyyaqfrjmdgibap9j6a29y1cl41-libxml2-2.15.4-dev/include/libxml2 -I/nix/store/3gx080m9qfv8k0sff9bg5877n6zd9kv8-lz4-1.10.0-dev/include -I/nix/store/3y8mdshg1hkwpcnzhhd1q71p2wps47d4-zstd-1.5.7-dev/include -I/nix/store/qm179cq3lxwcmmm6lnkfghiw67zjbm3c-icu4c-75.1-dev/include  -c -o src/secretbox.o src/secretbox.c970pgsodium-3.1.7> In file included from /nix/store/bmy3kwy9ap95i36rfjm2nn9amjys57jn-glibc-2.42-84-dev/include/bits/libc-header-start.h:33,971pgsodium-3.1.7>                  from /nix/store/bmy3kwy9ap95i36rfjm2nn9amjys57jn-glibc-2.42-84-dev/include/stdio.h:28,972pgsodium-3.1.7>                  from src/pgsodium.h:4,973pgsodium-3.1.7>                  from src/secretbox.c:1:974pgsodium-3.1.7> /nix/store/bmy3kwy9ap95i36rfjm2nn9amjys57jn-glibc-2.42-84-dev/include/features.h:435:4: warning: #warning _FORTIFY_SOURCE requires compiling with optimization (-O) [-Wcpp]975pgsodium-3.1.7>   435 | #  warning _FORTIFY_SOURCE requires compiling with optimization (-O)976pgsodium-3.1.7>       |    ^~~~~~~977pgsodium-3.1.7> gcc -Wall -Wmissing-prototypes -Wpointer-arith -Wdeclaration-after-statement -Werror=vla -Wendif-labels -Wmissing-format-attribute -Wimplicit-fallthrough=3 -Wcast-function-type -Wshadow=compatible-local -Wformat-security -fno-strict-aliasing -fwrapv -fexcess-precision=standard -Wno-format-truncation -Wno-stringop-truncation -moutline-atomics -g -O2 -fPIC -fvisibility=hidden -O0 -I. -I./ -I/nix/store/pmaflmk45425rq04ajcb4yhm58w6hq3p-postgresql-17_22/include/server -I/nix/store/pmaflmk45425rq04ajcb4yhm58w6hq3p-postgresql-17_22/include/internal -D_GNU_SOURCE  -I/nix/store/n8zb5iyyaqfrjmdgibap9j6a29y1cl41-libxml2-2.15.4-dev/include/libxml2 -I/nix/store/3gx080m9qfv8k0sff9bg5877n6zd9kv8-lz4-1.10.0-dev/include -I/nix/store/3y8mdshg1hkwpcnzhhd1q71p2wps47d4-zstd-1.5.7-dev/include -I/nix/store/qm179cq3lxwcmmm6lnkfghiw67zjbm3c-icu4c-75.1-dev/include  -c -o src/secretstream.o src/secretstream.c978pgsodium-3.1.7> In file included from /nix/store/bmy3kwy9ap95i36rfjm2nn9amjys57jn-glibc-2.42-84-dev/include/bits/libc-header-start.h:33,979pgsodium-3.1.7>                  from /nix/store/bmy3kwy9ap95i36rfjm2nn9amjys57jn-glibc-2.42-84-dev/include/stdio.h:28,980pgsodium-3.1.7>                  from src/pgsodium.h:4,981pgsodium-3.1.7>                  from src/secretstream.c:2:982pgsodium-3.1.7> /nix/store/bmy3kwy9ap95i36rfjm2nn9amjys57jn-glibc-2.42-84-dev/include/features.h:435:4: warning: #warning _FORTIFY_SOURCE requires compiling with optimization (-O) [-Wcpp]983pgsodium-3.1.7>   435 | #  warning _FORTIFY_SOURCE requires compiling with optimization (-O)984pgsodium-3.1.7>       |    ^~~~~~~985pgsodium-3.1.7> gcc -Wall -Wmissing-prototypes -Wpointer-arith -Wdeclaration-after-statement -Werror=vla -Wendif-labels -Wmissing-format-attribute -Wimplicit-fallthrough=3 -Wcast-function-type -Wshadow=compatible-local -Wformat-security -fno-strict-aliasing -fwrapv -fexcess-precision=standard -Wno-format-truncation -Wno-stringop-truncation -moutline-atomics -g -O2 -fPIC -fvisibility=hidden -O0 -I. -I./ -I/nix/store/pmaflmk45425rq04ajcb4yhm58w6hq3p-postgresql-17_22/include/server -I/nix/store/pmaflmk45425rq04ajcb4yhm58w6hq3p-postgresql-17_22/include/internal -D_GNU_SOURCE  -I/nix/store/n8zb5iyyaqfrjmdgibap9j6a29y1cl41-libxml2-2.15.4-dev/include/libxml2 -I/nix/store/3gx080m9qfv8k0sff9bg5877n6zd9kv8-lz4-1.10.0-dev/include -I/nix/store/3y8mdshg1hkwpcnzhhd1q71p2wps47d4-zstd-1.5.7-dev/include -I/nix/store/qm179cq3lxwcmmm6lnkfghiw67zjbm3c-icu4c-75.1-dev/include  -c -o src/sha.o src/sha.c986pgsodium-3.1.7> In file included from /nix/store/bmy3kwy9ap95i36rfjm2nn9amjys57jn-glibc-2.42-84-dev/include/bits/libc-header-start.h:33,987pgsodium-3.1.7>                  from /nix/store/bmy3kwy9ap95i36rfjm2nn9amjys57jn-glibc-2.42-84-dev/include/stdio.h:28,988pgsodium-3.1.7>                  from src/pgsodium.h:4,989pgsodium-3.1.7>                  from src/sha.c:1:990pgsodium-3.1.7> /nix/store/bmy3kwy9ap95i36rfjm2nn9amjys57jn-glibc-2.42-84-dev/include/features.h:435:4: warning: #warning _FORTIFY_SOURCE requires compiling with optimization (-O) [-Wcpp]991pgsodium-3.1.7>   435 | #  warning _FORTIFY_SOURCE requires compiling with optimization (-O)992pgsodium-3.1.7>       |    ^~~~~~~993pgsodium-3.1.7> gcc -Wall -Wmissing-prototypes -Wpointer-arith -Wdeclaration-after-statement -Werror=vla -Wendif-labels -Wmissing-format-attribute -Wimplicit-fallthrough=3 -Wcast-function-type -Wshadow=compatible-local -Wformat-security -fno-strict-aliasing -fwrapv -fexcess-precision=standard -Wno-format-truncation -Wno-stringop-truncation -moutline-atomics -g -O2 -fPIC -fvisibility=hidden -O0 -I. -I./ -I/nix/store/pmaflmk45425rq04ajcb4yhm58w6hq3p-postgresql-17_22/include/server -I/nix/store/pmaflmk45425rq04ajcb4yhm58w6hq3p-postgresql-17_22/include/internal -D_GNU_SOURCE  -I/nix/store/n8zb5iyyaqfrjmdgibap9j6a29y1cl41-libxml2-2.15.4-dev/include/libxml2 -I/nix/store/3gx080m9qfv8k0sff9bg5877n6zd9kv8-lz4-1.10.0-dev/include -I/nix/store/3y8mdshg1hkwpcnzhhd1q71p2wps47d4-zstd-1.5.7-dev/include -I/nix/store/qm179cq3lxwcmmm6lnkfghiw67zjbm3c-icu4c-75.1-dev/include  -c -o src/sign.o src/sign.c994pgsodium-3.1.7> In file included from /nix/store/bmy3kwy9ap95i36rfjm2nn9amjys57jn-glibc-2.42-84-dev/include/bits/libc-header-start.h:33,995pgsodium-3.1.7>                  from /nix/store/bmy3kwy9ap95i36rfjm2nn9amjys57jn-glibc-2.42-84-dev/include/stdio.h:28,996pgsodium-3.1.7>                  from src/pgsodium.h:4,997pgsodium-3.1.7>                  from src/sign.c:1:998pgsodium-3.1.7> /nix/store/bmy3kwy9ap95i36rfjm2nn9amjys57jn-glibc-2.42-84-dev/include/features.h:435:4: warning: #warning _FORTIFY_SOURCE requires compiling with optimization (-O) [-Wcpp]999pgsodium-3.1.7>   435 | #  warning _FORTIFY_SOURCE requires compiling with optimization (-O)1000pgsodium-3.1.7>       |    ^~~~~~~1001pgsodium-3.1.7> gcc -Wall -Wmissing-prototypes -Wpointer-arith -Wdeclaration-after-statement -Werror=vla -Wendif-labels -Wmissing-format-attribute -Wimplicit-fallthrough=3 -Wcast-function-type -Wshadow=compatible-local -Wformat-security -fno-strict-aliasing -fwrapv -fexcess-precision=standard -Wno-format-truncation -Wno-stringop-truncation -moutline-atomics -g -O2 -fPIC -fvisibility=hidden -O0 -I. -I./ -I/nix/store/pmaflmk45425rq04ajcb4yhm58w6hq3p-postgresql-17_22/include/server -I/nix/store/pmaflmk45425rq04ajcb4yhm58w6hq3p-postgresql-17_22/include/internal -D_GNU_SOURCE  -I/nix/store/n8zb5iyyaqfrjmdgibap9j6a29y1cl41-libxml2-2.15.4-dev/include/libxml2 -I/nix/store/3gx080m9qfv8k0sff9bg5877n6zd9kv8-lz4-1.10.0-dev/include -I/nix/store/3y8mdshg1hkwpcnzhhd1q71p2wps47d4-zstd-1.5.7-dev/include -I/nix/store/qm179cq3lxwcmmm6lnkfghiw67zjbm3c-icu4c-75.1-dev/include  -c -o src/signcrypt.o src/signcrypt.c1002pgsodium-3.1.7> In file included from /nix/store/bmy3kwy9ap95i36rfjm2nn9amjys57jn-glibc-2.42-84-dev/include/bits/libc-header-start.h:33,1003pgsodium-3.1.7>                  from /nix/store/bmy3kwy9ap95i36rfjm2nn9amjys57jn-glibc-2.42-84-dev/include/stdio.h:28,1004pgsodium-3.1.7>                  from src/pgsodium.h:4,1005pgsodium-3.1.7>                  from src/signcrypt.c:1:1006pgsodium-3.1.7> /nix/store/bmy3kwy9ap95i36rfjm2nn9amjys57jn-glibc-2.42-84-dev/include/features.h:435:4: warning: #warning _FORTIFY_SOURCE requires compiling with optimization (-O) [-Wcpp]1007pgsodium-3.1.7>   435 | #  warning _FORTIFY_SOURCE requires compiling with optimization (-O)1008pgsodium-3.1.7>       |    ^~~~~~~1009pgsodium-3.1.7> gcc -Wall -Wmissing-prototypes -Wpointer-arith -Wdeclaration-after-statement -Werror=vla -Wendif-labels -Wmissing-format-attribute -Wimplicit-fallthrough=3 -Wcast-function-type -Wshadow=compatible-local -Wformat-security -fno-strict-aliasing -fwrapv -fexcess-precision=standard -Wno-format-truncation -Wno-stringop-truncation -moutline-atomics -g -O2 -fPIC -fvisibility=hidden -O0 -I. -I./ -I/nix/store/pmaflmk45425rq04ajcb4yhm58w6hq3p-postgresql-17_22/include/server -I/nix/store/pmaflmk45425rq04ajcb4yhm58w6hq3p-postgresql-17_22/include/internal -D_GNU_SOURCE  -I/nix/store/n8zb5iyyaqfrjmdgibap9j6a29y1cl41-libxml2-2.15.4-dev/include/libxml2 -I/nix/store/3gx080m9qfv8k0sff9bg5877n6zd9kv8-lz4-1.10.0-dev/include -I/nix/store/3y8mdshg1hkwpcnzhhd1q71p2wps47d4-zstd-1.5.7-dev/include -I/nix/store/qm179cq3lxwcmmm6lnkfghiw67zjbm3c-icu4c-75.1-dev/include  -c -o src/signcrypt_tbsbr.o src/signcrypt_tbsbr.c1010pgsodium-3.1.7> In file included from /nix/store/bmy3kwy9ap95i36rfjm2nn9amjys57jn-glibc-2.42-84-dev/include/bits/libc-header-start.h:33,1011pgsodium-3.1.7>                  from /nix/store/bmy3kwy9ap95i36rfjm2nn9amjys57jn-glibc-2.42-84-dev/include/stdlib.h:26,1012pgsodium-3.1.7>                  from src/signcrypt_tbsbr.h:31,1013pgsodium-3.1.7>                  from src/signcrypt_tbsbr.c:23:1014pgsodium-3.1.7> /nix/store/bmy3kwy9ap95i36rfjm2nn9amjys57jn-glibc-2.42-84-dev/include/features.h:435:4: warning: #warning _FORTIFY_SOURCE requires compiling with optimization (-O) [-Wcpp]1015pgsodium-3.1.7>   435 | #  warning _FORTIFY_SOURCE requires compiling with optimization (-O)1016pgsodium-3.1.7>       |    ^~~~~~~1017pgsodium-3.1.7> gcc -Wall -Wmissing-prototypes -Wpointer-arith -Wdeclaration-after-statement -Werror=vla -Wendif-labels -Wmissing-format-attribute -Wimplicit-fallthrough=3 -Wcast-function-type -Wshadow=compatible-local -Wformat-security -fno-strict-aliasing -fwrapv -fexcess-precision=standard -Wno-format-truncation -Wno-stringop-truncation -moutline-atomics -g -O2 -fPIC -fvisibility=hidden -O0 -I. -I./ -I/nix/store/pmaflmk45425rq04ajcb4yhm58w6hq3p-postgresql-17_22/include/server -I/nix/store/pmaflmk45425rq04ajcb4yhm58w6hq3p-postgresql-17_22/include/internal -D_GNU_SOURCE  -I/nix/store/n8zb5iyyaqfrjmdgibap9j6a29y1cl41-libxml2-2.15.4-dev/include/libxml2 -I/nix/store/3gx080m9qfv8k0sff9bg5877n6zd9kv8-lz4-1.10.0-dev/include -I/nix/store/3y8mdshg1hkwpcnzhhd1q71p2wps47d4-zstd-1.5.7-dev/include -I/nix/store/qm179cq3lxwcmmm6lnkfghiw67zjbm3c-icu4c-75.1-dev/include  -c -o src/stream.o src/stream.c1018pgsodium-3.1.7> In file included from /nix/store/bmy3kwy9ap95i36rfjm2nn9amjys57jn-glibc-2.42-84-dev/include/bits/libc-header-start.h:33,1019pgsodium-3.1.7>                  from /nix/store/bmy3kwy9ap95i36rfjm2nn9amjys57jn-glibc-2.42-84-dev/include/stdio.h:28,1020pgsodium-3.1.7>                  from src/pgsodium.h:4,1021pgsodium-3.1.7>                  from src/stream.c:2:1022pgsodium-3.1.7> /nix/store/bmy3kwy9ap95i36rfjm2nn9amjys57jn-glibc-2.42-84-dev/include/features.h:435:4: warning: #warning _FORTIFY_SOURCE requires compiling with optimization (-O) [-Wcpp]1023pgsodium-3.1.7>   435 | #  warning _FORTIFY_SOURCE requires compiling with optimization (-O)1024pgsodium-3.1.7>       |    ^~~~~~~1025pgsodium-3.1.7> gcc -Wall -Wmissing-prototypes -Wpointer-arith -Wdeclaration-after-statement -Werror=vla -Wendif-labels -Wmissing-format-attribute -Wimplicit-fallthrough=3 -Wcast-function-type -Wshadow=compatible-local -Wformat-security -fno-strict-aliasing -fwrapv -fexcess-precision=standard -Wno-format-truncation -Wno-stringop-truncation -moutline-atomics -g -O2 -fPIC -fvisibility=hidden -shared -o pgsodium.so src/aead.o src/auth.o src/box.o src/crypto_aead_det_xchacha20.o src/derive.o src/hash.o src/helpers.o src/hmac.o src/kdf.o src/kx.o src/pgsodium.o src/pwhash.o src/random.o src/secretbox.o src/secretstream.o src/sha.o src/sign.o src/signcrypt.o src/signcrypt_tbsbr.o src/stream.o -L/nix/store/j71vd8cq510zphc7wk56959mij4dfriv-postgresql-17_22-lib/lib    -L/nix/store/xjnvfcp3i347rp7zncsw5vdp7wgnpyaf-libxml2-2.15.4/lib -L/nix/store/yq0c2jhzc3877vagbkwxinm80wajlkh6-lz4-1.10.0-lib/lib -L/nix/store/i8f26lwk8i93hmiyrmsy752m6nwi4pmk-zstd-1.5.7/lib -Wl,--as-needed -Wl,-rpath,'/nix/store/j71vd8cq510zphc7wk56959mij4dfriv-postgresql-17_22-lib/lib',--enable-new-dtags -fvisibility=hidden -lsodium 1026pgsodium-3.1.7> Running phase: installPhase1027pgsodium-3.1.7> Running phase: fixupPhase1028pgsodium-3.1.7> shrinking RPATHs of ELF executables and libraries in /nix/store/cjqk314kqc3vfa4ci6zjcyvw0gijf9ih-pgsodium-3.1.71029pgsodium-3.1.7> shrinking /nix/store/cjqk314kqc3vfa4ci6zjcyvw0gijf9ih-pgsodium-3.1.7/lib/pgsodium-3.1.7.so1030pgsodium-3.1.7> checking for references to /build/ in /nix/store/cjqk314kqc3vfa4ci6zjcyvw0gijf9ih-pgsodium-3.1.7...1031pgsodium-3.1.7> patching script interpreter paths in /nix/store/cjqk314kqc3vfa4ci6zjcyvw0gijf9ih-pgsodium-3.1.71032pgsodium-3.1.7> stripping (with command strip and flags -S -p) in  /nix/store/cjqk314kqc3vfa4ci6zjcyvw0gijf9ih-pgsodium-3.1.7/lib1033building '/nix/store/vsqdadm69v4w8yb0fggryzvb87z70y6g-rum-1.3.drv' on 'ssh-ng://nixbot-remote-build@78.232.36.247'1034building '/nix/store/vsqdadm69v4w8yb0fggryzvb87z70y6g-rum-1.3.drv'1035rum-1.3> Running phase: unpackPhase1036rum-1.3> unpacking source archive /nix/store/2c12715qcrn817mfshv93zs5z71syks6-source1037rum-1.3> source root is source1038rum-1.3> Running phase: patchPhase1039rum-1.3> Running phase: updateAutotoolsGnuConfigScriptsPhase1040rum-1.3> Running phase: configurePhase1041rum-1.3> no configure script, doing nothing1042rum-1.3> Running phase: buildPhase1043rum-1.3> build flags: SHELL=/nix/store/pbjg9k27s3v1wp5s8c6pb23s0m69yjwz-bash-5.3p9/bin/bash USE_PGXS=11044rum-1.3> gcc -Wall -Wmissing-prototypes -Wpointer-arith -Wdeclaration-after-statement -Werror=vla -Wendif-labels -Wmissing-format-attribute -Wimplicit-fallthrough=3 -Wcast-function-type -Wshadow=compatible-local -Wformat-security -fno-strict-aliasing -fwrapv -fexcess-precision=standard -Wno-format-truncation -Wno-stringop-truncation -moutline-atomics -g -O2 -fPIC -fvisibility=hidden -I. -I./ -I/nix/store/pmaflmk45425rq04ajcb4yhm58w6hq3p-postgresql-17_22/include/server -I/nix/store/pmaflmk45425rq04ajcb4yhm58w6hq3p-postgresql-17_22/include/internal -D_GNU_SOURCE  -I/nix/store/n8zb5iyyaqfrjmdgibap9j6a29y1cl41-libxml2-2.15.4-dev/include/libxml2 -I/nix/store/3gx080m9qfv8k0sff9bg5877n6zd9kv8-lz4-1.10.0-dev/include -I/nix/store/3y8mdshg1hkwpcnzhhd1q71p2wps47d4-zstd-1.5.7-dev/include -I/nix/store/qm179cq3lxwcmmm6lnkfghiw67zjbm3c-icu4c-75.1-dev/include  -c -o src/rumsort.o src/rumsort.c1045rum-1.3> gcc -Wall -Wmissing-prototypes -Wpointer-arith -Wdeclaration-after-statement -Werror=vla -Wendif-labels -Wmissing-format-attribute -Wimplicit-fallthrough=3 -Wcast-function-type -Wshadow=compatible-local -Wformat-security -fno-strict-aliasing -fwrapv -fexcess-precision=standard -Wno-format-truncation -Wno-stringop-truncation -moutline-atomics -g -O2 -fPIC -fvisibility=hidden -I. -I./ -I/nix/store/pmaflmk45425rq04ajcb4yhm58w6hq3p-postgresql-17_22/include/server -I/nix/store/pmaflmk45425rq04ajcb4yhm58w6hq3p-postgresql-17_22/include/internal -D_GNU_SOURCE  -I/nix/store/n8zb5iyyaqfrjmdgibap9j6a29y1cl41-libxml2-2.15.4-dev/include/libxml2 -I/nix/store/3gx080m9qfv8k0sff9bg5877n6zd9kv8-lz4-1.10.0-dev/include -I/nix/store/3y8mdshg1hkwpcnzhhd1q71p2wps47d4-zstd-1.5.7-dev/include -I/nix/store/qm179cq3lxwcmmm6lnkfghiw67zjbm3c-icu4c-75.1-dev/include  -c -o src/rum_ts_utils.o src/rum_ts_utils.c1046rum-1.3> gcc -Wall -Wmissing-prototypes -Wpointer-arith -Wdeclaration-after-statement -Werror=vla -Wendif-labels -Wmissing-format-attribute -Wimplicit-fallthrough=3 -Wcast-function-type -Wshadow=compatible-local -Wformat-security -fno-strict-aliasing -fwrapv -fexcess-precision=standard -Wno-format-truncation -Wno-stringop-truncation -moutline-atomics -g -O2 -fPIC -fvisibility=hidden -I. -I./ -I/nix/store/pmaflmk45425rq04ajcb4yhm58w6hq3p-postgresql-17_22/include/server -I/nix/store/pmaflmk45425rq04ajcb4yhm58w6hq3p-postgresql-17_22/include/internal -D_GNU_SOURCE  -I/nix/store/n8zb5iyyaqfrjmdgibap9j6a29y1cl41-libxml2-2.15.4-dev/include/libxml2 -I/nix/store/3gx080m9qfv8k0sff9bg5877n6zd9kv8-lz4-1.10.0-dev/include -I/nix/store/3y8mdshg1hkwpcnzhhd1q71p2wps47d4-zstd-1.5.7-dev/include -I/nix/store/qm179cq3lxwcmmm6lnkfghiw67zjbm3c-icu4c-75.1-dev/include  -c -o src/rumtsquery.o src/rumtsquery.c1047rum-1.3> gcc -Wall -Wmissing-prototypes -Wpointer-arith -Wdeclaration-after-statement -Werror=vla -Wendif-labels -Wmissing-format-attribute -Wimplicit-fallthrough=3 -Wcast-function-type -Wshadow=compatible-local -Wformat-security -fno-strict-aliasing -fwrapv -fexcess-precision=standard -Wno-format-truncation -Wno-stringop-truncation -moutline-atomics -g -O2 -fPIC -fvisibility=hidden -I. -I./ -I/nix/store/pmaflmk45425rq04ajcb4yhm58w6hq3p-postgresql-17_22/include/server -I/nix/store/pmaflmk45425rq04ajcb4yhm58w6hq3p-postgresql-17_22/include/internal -D_GNU_SOURCE  -I/nix/store/n8zb5iyyaqfrjmdgibap9j6a29y1cl41-libxml2-2.15.4-dev/include/libxml2 -I/nix/store/3gx080m9qfv8k0sff9bg5877n6zd9kv8-lz4-1.10.0-dev/include -I/nix/store/3y8mdshg1hkwpcnzhhd1q71p2wps47d4-zstd-1.5.7-dev/include -I/nix/store/qm179cq3lxwcmmm6lnkfghiw67zjbm3c-icu4c-75.1-dev/include  -c -o src/rumbtree.o src/rumbtree.c1048rum-1.3> gcc -Wall -Wmissing-prototypes -Wpointer-arith -Wdeclaration-after-statement -Werror=vla -Wendif-labels -Wmissing-format-attribute -Wimplicit-fallthrough=3 -Wcast-function-type -Wshadow=compatible-local -Wformat-security -fno-strict-aliasing -fwrapv -fexcess-precision=standard -Wno-format-truncation -Wno-stringop-truncation -moutline-atomics -g -O2 -fPIC -fvisibility=hidden -I. -I./ -I/nix/store/pmaflmk45425rq04ajcb4yhm58w6hq3p-postgresql-17_22/include/server -I/nix/store/pmaflmk45425rq04ajcb4yhm58w6hq3p-postgresql-17_22/include/internal -D_GNU_SOURCE  -I/nix/store/n8zb5iyyaqfrjmdgibap9j6a29y1cl41-libxml2-2.15.4-dev/include/libxml2 -I/nix/store/3gx080m9qfv8k0sff9bg5877n6zd9kv8-lz4-1.10.0-dev/include -I/nix/store/3y8mdshg1hkwpcnzhhd1q71p2wps47d4-zstd-1.5.7-dev/include -I/nix/store/qm179cq3lxwcmmm6lnkfghiw67zjbm3c-icu4c-75.1-dev/include  -c -o src/rumbulk.o src/rumbulk.c1049rum-1.3> gcc -Wall -Wmissing-prototypes -Wpointer-arith -Wdeclaration-after-statement -Werror=vla -Wendif-labels -Wmissing-format-attribute -Wimplicit-fallthrough=3 -Wcast-function-type -Wshadow=compatible-local -Wformat-security -fno-strict-aliasing -fwrapv -fexcess-precision=standard -Wno-format-truncation -Wno-stringop-truncation -moutline-atomics -g -O2 -fPIC -fvisibility=hidden -I. -I./ -I/nix/store/pmaflmk45425rq04ajcb4yhm58w6hq3p-postgresql-17_22/include/server -I/nix/store/pmaflmk45425rq04ajcb4yhm58w6hq3p-postgresql-17_22/include/internal -D_GNU_SOURCE  -I/nix/store/n8zb5iyyaqfrjmdgibap9j6a29y1cl41-libxml2-2.15.4-dev/include/libxml2 -I/nix/store/3gx080m9qfv8k0sff9bg5877n6zd9kv8-lz4-1.10.0-dev/include -I/nix/store/3y8mdshg1hkwpcnzhhd1q71p2wps47d4-zstd-1.5.7-dev/include -I/nix/store/qm179cq3lxwcmmm6lnkfghiw67zjbm3c-icu4c-75.1-dev/include  -c -o src/rumdatapage.o src/rumdatapage.c1050rum-1.3> gcc -Wall -Wmissing-prototypes -Wpointer-arith -Wdeclaration-after-statement -Werror=vla -Wendif-labels -Wmissing-format-attribute -Wimplicit-fallthrough=3 -Wcast-function-type -Wshadow=compatible-local -Wformat-security -fno-strict-aliasing -fwrapv -fexcess-precision=standard -Wno-format-truncation -Wno-stringop-truncation -moutline-atomics -g -O2 -fPIC -fvisibility=hidden -I. -I./ -I/nix/store/pmaflmk45425rq04ajcb4yhm58w6hq3p-postgresql-17_22/include/server -I/nix/store/pmaflmk45425rq04ajcb4yhm58w6hq3p-postgresql-17_22/include/internal -D_GNU_SOURCE  -I/nix/store/n8zb5iyyaqfrjmdgibap9j6a29y1cl41-libxml2-2.15.4-dev/include/libxml2 -I/nix/store/3gx080m9qfv8k0sff9bg5877n6zd9kv8-lz4-1.10.0-dev/include -I/nix/store/3y8mdshg1hkwpcnzhhd1q71p2wps47d4-zstd-1.5.7-dev/include -I/nix/store/qm179cq3lxwcmmm6lnkfghiw67zjbm3c-icu4c-75.1-dev/include  -c -o src/rumentrypage.o src/rumentrypage.c1051rum-1.3> gcc -Wall -Wmissing-prototypes -Wpointer-arith -Wdeclaration-after-statement -Werror=vla -Wendif-labels -Wmissing-format-attribute -Wimplicit-fallthrough=3 -Wcast-function-type -Wshadow=compatible-local -Wformat-security -fno-strict-aliasing -fwrapv -fexcess-precision=standard -Wno-format-truncation -Wno-stringop-truncation -moutline-atomics -g -O2 -fPIC -fvisibility=hidden -I. -I./ -I/nix/store/pmaflmk45425rq04ajcb4yhm58w6hq3p-postgresql-17_22/include/server -I/nix/store/pmaflmk45425rq04ajcb4yhm58w6hq3p-postgresql-17_22/include/internal -D_GNU_SOURCE  -I/nix/store/n8zb5iyyaqfrjmdgibap9j6a29y1cl41-libxml2-2.15.4-dev/include/libxml2 -I/nix/store/3gx080m9qfv8k0sff9bg5877n6zd9kv8-lz4-1.10.0-dev/include -I/nix/store/3y8mdshg1hkwpcnzhhd1q71p2wps47d4-zstd-1.5.7-dev/include -I/nix/store/qm179cq3lxwcmmm6lnkfghiw67zjbm3c-icu4c-75.1-dev/include  -c -o src/rumget.o src/rumget.c1052rum-1.3> gcc -Wall -Wmissing-prototypes -Wpointer-arith -Wdeclaration-after-statement -Werror=vla -Wendif-labels -Wmissing-format-attribute -Wimplicit-fallthrough=3 -Wcast-function-type -Wshadow=compatible-local -Wformat-security -fno-strict-aliasing -fwrapv -fexcess-precision=standard -Wno-format-truncation -Wno-stringop-truncation -moutline-atomics -g -O2 -fPIC -fvisibility=hidden -I. -I./ -I/nix/store/pmaflmk45425rq04ajcb4yhm58w6hq3p-postgresql-17_22/include/server -I/nix/store/pmaflmk45425rq04ajcb4yhm58w6hq3p-postgresql-17_22/include/internal -D_GNU_SOURCE  -I/nix/store/n8zb5iyyaqfrjmdgibap9j6a29y1cl41-libxml2-2.15.4-dev/include/libxml2 -I/nix/store/3gx080m9qfv8k0sff9bg5877n6zd9kv8-lz4-1.10.0-dev/include -I/nix/store/3y8mdshg1hkwpcnzhhd1q71p2wps47d4-zstd-1.5.7-dev/include -I/nix/store/qm179cq3lxwcmmm6lnkfghiw67zjbm3c-icu4c-75.1-dev/include  -c -o src/ruminsert.o src/ruminsert.c1053rum-1.3> gcc -Wall -Wmissing-prototypes -Wpointer-arith -Wdeclaration-after-statement -Werror=vla -Wendif-labels -Wmissing-format-attribute -Wimplicit-fallthrough=3 -Wcast-function-type -Wshadow=compatible-local -Wformat-security -fno-strict-aliasing -fwrapv -fexcess-precision=standard -Wno-format-truncation -Wno-stringop-truncation -moutline-atomics -g -O2 -fPIC -fvisibility=hidden -I. -I./ -I/nix/store/pmaflmk45425rq04ajcb4yhm58w6hq3p-postgresql-17_22/include/server -I/nix/store/pmaflmk45425rq04ajcb4yhm58w6hq3p-postgresql-17_22/include/internal -D_GNU_SOURCE  -I/nix/store/n8zb5iyyaqfrjmdgibap9j6a29y1cl41-libxml2-2.15.4-dev/include/libxml2 -I/nix/store/3gx080m9qfv8k0sff9bg5877n6zd9kv8-lz4-1.10.0-dev/include -I/nix/store/3y8mdshg1hkwpcnzhhd1q71p2wps47d4-zstd-1.5.7-dev/include -I/nix/store/qm179cq3lxwcmmm6lnkfghiw67zjbm3c-icu4c-75.1-dev/include  -c -o src/rumscan.o src/rumscan.c1054rum-1.3> gcc -Wall -Wmissing-prototypes -Wpointer-arith -Wdeclaration-after-statement -Werror=vla -Wendif-labels -Wmissing-format-attribute -Wimplicit-fallthrough=3 -Wcast-function-type -Wshadow=compatible-local -Wformat-security -fno-strict-aliasing -fwrapv -fexcess-precision=standard -Wno-format-truncation -Wno-stringop-truncation -moutline-atomics -g -O2 -fPIC -fvisibility=hidden -I. -I./ -I/nix/store/pmaflmk45425rq04ajcb4yhm58w6hq3p-postgresql-17_22/include/server -I/nix/store/pmaflmk45425rq04ajcb4yhm58w6hq3p-postgresql-17_22/include/internal -D_GNU_SOURCE  -I/nix/store/n8zb5iyyaqfrjmdgibap9j6a29y1cl41-libxml2-2.15.4-dev/include/libxml2 -I/nix/store/3gx080m9qfv8k0sff9bg5877n6zd9kv8-lz4-1.10.0-dev/include -I/nix/store/3y8mdshg1hkwpcnzhhd1q71p2wps47d4-zstd-1.5.7-dev/include -I/nix/store/qm179cq3lxwcmmm6lnkfghiw67zjbm3c-icu4c-75.1-dev/include  -c -o src/rumutil.o src/rumutil.c1055rum-1.3> gcc -Wall -Wmissing-prototypes -Wpointer-arith -Wdeclaration-after-statement -Werror=vla -Wendif-labels -Wmissing-format-attribute -Wimplicit-fallthrough=3 -Wcast-function-type -Wshadow=compatible-local -Wformat-security -fno-strict-aliasing -fwrapv -fexcess-precision=standard -Wno-format-truncation -Wno-stringop-truncation -moutline-atomics -g -O2 -fPIC -fvisibility=hidden -I. -I./ -I/nix/store/pmaflmk45425rq04ajcb4yhm58w6hq3p-postgresql-17_22/include/server -I/nix/store/pmaflmk45425rq04ajcb4yhm58w6hq3p-postgresql-17_22/include/internal -D_GNU_SOURCE  -I/nix/store/n8zb5iyyaqfrjmdgibap9j6a29y1cl41-libxml2-2.15.4-dev/include/libxml2 -I/nix/store/3gx080m9qfv8k0sff9bg5877n6zd9kv8-lz4-1.10.0-dev/include -I/nix/store/3y8mdshg1hkwpcnzhhd1q71p2wps47d4-zstd-1.5.7-dev/include -I/nix/store/qm179cq3lxwcmmm6lnkfghiw67zjbm3c-icu4c-75.1-dev/include  -c -o src/rumvacuum.o src/rumvacuum.c1056rum-1.3> gcc -Wall -Wmissing-prototypes -Wpointer-arith -Wdeclaration-after-statement -Werror=vla -Wendif-labels -Wmissing-format-attribute -Wimplicit-fallthrough=3 -Wcast-function-type -Wshadow=compatible-local -Wformat-security -fno-strict-aliasing -fwrapv -fexcess-precision=standard -Wno-format-truncation -Wno-stringop-truncation -moutline-atomics -g -O2 -fPIC -fvisibility=hidden -I. -I./ -I/nix/store/pmaflmk45425rq04ajcb4yhm58w6hq3p-postgresql-17_22/include/server -I/nix/store/pmaflmk45425rq04ajcb4yhm58w6hq3p-postgresql-17_22/include/internal -D_GNU_SOURCE  -I/nix/store/n8zb5iyyaqfrjmdgibap9j6a29y1cl41-libxml2-2.15.4-dev/include/libxml2 -I/nix/store/3gx080m9qfv8k0sff9bg5877n6zd9kv8-lz4-1.10.0-dev/include -I/nix/store/3y8mdshg1hkwpcnzhhd1q71p2wps47d4-zstd-1.5.7-dev/include -I/nix/store/qm179cq3lxwcmmm6lnkfghiw67zjbm3c-icu4c-75.1-dev/include  -c -o src/rumvalidate.o src/rumvalidate.c1057rum-1.3> gcc -Wall -Wmissing-prototypes -Wpointer-arith -Wdeclaration-after-statement -Werror=vla -Wendif-labels -Wmissing-format-attribute -Wimplicit-fallthrough=3 -Wcast-function-type -Wshadow=compatible-local -Wformat-security -fno-strict-aliasing -fwrapv -fexcess-precision=standard -Wno-format-truncation -Wno-stringop-truncation -moutline-atomics -g -O2 -fPIC -fvisibility=hidden -I. -I./ -I/nix/store/pmaflmk45425rq04ajcb4yhm58w6hq3p-postgresql-17_22/include/server -I/nix/store/pmaflmk45425rq04ajcb4yhm58w6hq3p-postgresql-17_22/include/internal -D_GNU_SOURCE  -I/nix/store/n8zb5iyyaqfrjmdgibap9j6a29y1cl41-libxml2-2.15.4-dev/include/libxml2 -I/nix/store/3gx080m9qfv8k0sff9bg5877n6zd9kv8-lz4-1.10.0-dev/include -I/nix/store/3y8mdshg1hkwpcnzhhd1q71p2wps47d4-zstd-1.5.7-dev/include -I/nix/store/qm179cq3lxwcmmm6lnkfghiw67zjbm3c-icu4c-75.1-dev/include  -c -o src/btree_rum.o src/btree_rum.c1058rum-1.3> gcc -Wall -Wmissing-prototypes -Wpointer-arith -Wdeclaration-after-statement -Werror=vla -Wendif-labels -Wmissing-format-attribute -Wimplicit-fallthrough=3 -Wcast-function-type -Wshadow=compatible-local -Wformat-security -fno-strict-aliasing -fwrapv -fexcess-precision=standard -Wno-format-truncation -Wno-stringop-truncation -moutline-atomics -g -O2 -fPIC -fvisibility=hidden -I. -I./ -I/nix/store/pmaflmk45425rq04ajcb4yhm58w6hq3p-postgresql-17_22/include/server -I/nix/store/pmaflmk45425rq04ajcb4yhm58w6hq3p-postgresql-17_22/include/internal -D_GNU_SOURCE  -I/nix/store/n8zb5iyyaqfrjmdgibap9j6a29y1cl41-libxml2-2.15.4-dev/include/libxml2 -I/nix/store/3gx080m9qfv8k0sff9bg5877n6zd9kv8-lz4-1.10.0-dev/include -I/nix/store/3y8mdshg1hkwpcnzhhd1q71p2wps47d4-zstd-1.5.7-dev/include -I/nix/store/qm179cq3lxwcmmm6lnkfghiw67zjbm3c-icu4c-75.1-dev/include  -c -o src/rum_arr_utils.o src/rum_arr_utils.c1059rum-1.3> gcc -Wall -Wmissing-prototypes -Wpointer-arith -Wdeclaration-after-statement -Werror=vla -Wendif-labels -Wmissing-format-attribute -Wimplicit-fallthrough=3 -Wcast-function-type -Wshadow=compatible-local -Wformat-security -fno-strict-aliasing -fwrapv -fexcess-precision=standard -Wno-format-truncation -Wno-stringop-truncation -moutline-atomics -g -O2 -fPIC -fvisibility=hidden -shared -o rum.so src/rumsort.o src/rum_ts_utils.o src/rumtsquery.o src/rumbtree.o src/rumbulk.o src/rumdatapage.o src/rumentrypage.o src/rumget.o src/ruminsert.o src/rumscan.o src/rumutil.o src/rumvacuum.o src/rumvalidate.o src/btree_rum.o src/rum_arr_utils.o  -L/nix/store/j71vd8cq510zphc7wk56959mij4dfriv-postgresql-17_22-lib/lib    -L/nix/store/xjnvfcp3i347rp7zncsw5vdp7wgnpyaf-libxml2-2.15.4/lib -L/nix/store/yq0c2jhzc3877vagbkwxinm80wajlkh6-lz4-1.10.0-lib/lib -L/nix/store/i8f26lwk8i93hmiyrmsy752m6nwi4pmk-zstd-1.5.7/lib -Wl,--as-needed -Wl,-rpath,'/nix/store/j71vd8cq510zphc7wk56959mij4dfriv-postgresql-17_22-lib/lib',--enable-new-dtags -lm -fvisibility=hidden 1060rum-1.3> Running phase: installPhase1061rum-1.3> Running phase: fixupPhase1062rum-1.3> shrinking RPATHs of ELF executables and libraries in /nix/store/3qilhlxg9gwqjlinwhkph14af5gf42fd-rum-1.31063rum-1.3> shrinking /nix/store/3qilhlxg9gwqjlinwhkph14af5gf42fd-rum-1.3/lib/rum-1.3.so1064rum-1.3> checking for references to /build/ in /nix/store/3qilhlxg9gwqjlinwhkph14af5gf42fd-rum-1.3...1065rum-1.3> patching script interpreter paths in /nix/store/3qilhlxg9gwqjlinwhkph14af5gf42fd-rum-1.31066rum-1.3> stripping (with command strip and flags -S -p) in  /nix/store/3qilhlxg9gwqjlinwhkph14af5gf42fd-rum-1.3/lib1067building '/nix/store/h2b5c91pdy91a8jkhnkdqvsgm67pd4vx-wrappers-0.5.7.drv' on 'ssh-ng://nixbot-remote-build@78.232.36.247'1068building '/nix/store/h2b5c91pdy91a8jkhnkdqvsgm67pd4vx-wrappers-0.5.7.drv'1069wrappers-0.5.7> Running phase: unpackPhase1070wrappers-0.5.7> unpacking source archive /nix/store/mnzx3jg8q2gm3rgqx28sxyfn6s9nsyrf-source1071wrappers-0.5.7> source root is source1072wrappers-0.5.7> Executing cargoSetupPostUnpackHook1073wrappers-0.5.7> Finished cargoSetupPostUnpackHook1074wrappers-0.5.7> Running phase: patchPhase1075wrappers-0.5.7> Executing cargoSetupPostPatchHook1076wrappers-0.5.7> Validating consistency between /build/source/Cargo.lock and /build/cargo-vendor-dir/Cargo.lock1077wrappers-0.5.7> Finished cargoSetupPostPatchHook1078wrappers-0.5.7> Running phase: updateAutotoolsGnuConfigScriptsPhase1079wrappers-0.5.7> Running phase: configurePhase1080wrappers-0.5.7> {"success":"true"}1081wrappers-0.5.7> Running phase: buildPhase1082wrappers-0.5.7> Executing cargo-pgrx buildPhase1083wrappers-0.5.7>    Validating /nix/store/bc9327c6474vwmqmhkszkmiz86mba73s-postgresql-15.19/bin/pg_config1084wrappers-0.5.7>  Initializing data directory at /build/tmp.NWLlk5wNQW/data-151085wrappers-0.5.7> waiting for server to start....2026-10-27 13:07:34.643 GMT [74] LOG:  starting PostgreSQL 15.19 on aarch64-unknown-linux-gnu, compiled by gcc (GCC) 15.3.0, 64-bit1086wrappers-0.5.7> 2026-10-27 13:07:34.645 GMT [74] LOG:  listening on Unix socket "/build/tmp.8oSD2IlaHl/.s.PGSQL.5432"1087wrappers-0.5.7> 2026-10-27 13:07:34.653 GMT [77] LOG:  database system was shut down at 2026-10-27 13:07:34 GMT1088wrappers-0.5.7> 2026-10-27 13:07:34.659 GMT [74] LOG:  database system is ready to accept connections1089wrappers-0.5.7>  done1090wrappers-0.5.7> server started1091wrappers-0.5.7> createuser: error: connection to server at "localhost" (127.0.0.1), port 5432 failed: Connection refused1092wrappers-0.5.7> 	Is the server running on that host and accepting TCP/IP connections?1093wrappers-0.5.7> waiting for server to shut down....2026-10-27 13:07:34.728 GMT [74] LOG:  received fast shutdown request1094wrappers-0.5.7> 2026-10-27 13:07:34.732 GMT [74] LOG:  aborting any active transactions1095wrappers-0.5.7> 2026-10-27 13:07:34.737 GMT [74] LOG:  background worker "logical replication launcher" (PID 80) exited with exit code 11096wrappers-0.5.7> 2026-10-27 13:07:34.740 GMT [75] LOG:  shutting down1097wrappers-0.5.7> 2026-10-27 13:07:34.742 GMT [75] LOG:  checkpoint starting: shutdown immediate1098wrappers-0.5.7> 2026-10-27 13:07:34.760 GMT [75] LOG:  checkpoint complete: wrote 3 buffers (0.0%); 0 WAL file(s) added, 0 removed, 0 recycled; write=0.006 s, sync=0.004 s, total=0.020 s; sync files=2, longest=0.003 s, average=0.002 s; distance=0 kB, estimate=0 kB1099wrappers-0.5.7> 2026-10-27 13:07:34.766 GMT [74] LOG:  database system is shut down1100wrappers-0.5.7>  done1101wrappers-0.5.7> server stopped1102wrappers-0.5.7> /build/source/wrappers /build/source1103wrappers-0.5.7>        Using PgConfig("pg15") and `pg_config` from /nix/store/bc9327c6474vwmqmhkszkmiz86mba73s-postgresql-15.19/bin/pg_config1104wrappers-0.5.7>     Building extension with features helloworld_fdw all_fdws pg151105wrappers-0.5.7>      Running command "/nix/store/85z5yggqvc1ki1iqa5kxi62kv8987a3b-cargo-1.88.0-aarch64-unknown-linux-gnu/bin/cargo" "build" "--lib" "--release" "--features" "helloworld_fdw all_fdws pg15" "--no-default-features" "--message-format=json-render-diagnostics" "--frozen" "-j" "2"1106wrappers-0.5.7>    Compiling proc-macro2 v1.0.1031107wrappers-0.5.7>    Compiling quote v1.0.411108wrappers-0.5.7>    Compiling unicode-ident v1.0.201109wrappers-0.5.7>    Compiling libc v0.2.1771110wrappers-0.5.7>    Compiling syn v2.0.1081111wrappers-0.5.7>    Compiling cfg-if v1.0.41112wrappers-0.5.7>    Compiling serde_core v1.0.2281113wrappers-0.5.7>    Compiling serde v1.0.2281114wrappers-0.5.7>    Compiling version_check v0.9.51115wrappers-0.5.7>    Compiling serde_derive v1.0.2281116wrappers-0.5.7>    Compiling autocfg v1.5.01117wrappers-0.5.7>    Compiling memchr v2.7.61118wrappers-0.5.7>    Compiling shlex v1.3.01119wrappers-0.5.7>    Compiling jobserver v0.1.341120wrappers-0.5.7>    Compiling find-msvc-tools v0.1.41121wrappers-0.5.7>    Compiling cc v1.2.431122wrappers-0.5.7>    Compiling bytes v1.10.11123wrappers-0.5.7>    Compiling zeroize v1.8.21124wrappers-0.5.7>    Compiling allocator-api2 v0.2.211125wrappers-0.5.7>    Compiling equivalent v1.0.21126wrappers-0.5.7>    Compiling libm v0.2.151127wrappers-0.5.7>    Compiling pin-project-lite v0.2.161128wrappers-0.5.7>    Compiling smallvec v1.15.11129wrappers-0.5.7>    Compiling once_cell v1.21.31130wrappers-0.5.7>    Compiling num-traits v0.2.191131wrappers-0.5.7>    Compiling futures-core v0.3.311132wrappers-0.5.7>    Compiling foldhash v0.1.51133wrappers-0.5.7>    Compiling hashbrown v0.15.51134wrappers-0.5.7>    Compiling getrandom v0.2.161135wrappers-0.5.7>    Compiling log v0.4.281136wrappers-0.5.7>    Compiling typenum v1.19.01137wrappers-0.5.7>    Compiling subtle v2.6.11138wrappers-0.5.7>    Compiling futures-io v0.3.311139wrappers-0.5.7>    Compiling parking_lot_core v0.9.121140wrappers-0.5.7>    Compiling itoa v1.0.151141wrappers-0.5.7>    Compiling scopeguard v1.2.01142wrappers-0.5.7>    Compiling lock_api v0.4.141143wrappers-0.5.7>    Compiling anyhow v1.0.1001144wrappers-0.5.7>    Compiling parking_lot v0.12.51145wrappers-0.5.7>    Compiling generic-array v0.14.91146wrappers-0.5.7>    Compiling slab v0.4.111147wrappers-0.5.7>    Compiling tokio-macros v2.6.01148wrappers-0.5.7>    Compiling mio v1.1.01149wrappers-0.5.7>    Compiling socket2 v0.6.11150wrappers-0.5.7>    Compiling signal-hook-registry v1.4.61151wrappers-0.5.7>    Compiling foldhash v0.2.01152wrappers-0.5.7>    Compiling futures-sink v0.3.311153wrappers-0.5.7>    Compiling pin-utils v0.1.01154wrappers-0.5.7>    Compiling futures-channel v0.3.311155wrappers-0.5.7>    Compiling hashbrown v0.16.01156wrappers-0.5.7>    Compiling tokio v1.48.01157wrappers-0.5.7>    Compiling futures-macro v0.3.311158wrappers-0.5.7>    Compiling futures-task v0.3.311159wrappers-0.5.7>    Compiling futures-util v0.3.311160wrappers-0.5.7>    Compiling const-oid v0.9.61161wrappers-0.5.7>    Compiling indexmap v2.12.01162wrappers-0.5.7>    Compiling rand_core v0.6.41163wrappers-0.5.7>    Compiling synstructure v0.13.21164wrappers-0.5.7>    Compiling ryu v1.0.201165wrappers-0.5.7>    Compiling zerofrom-derive v0.1.61166wrappers-0.5.7>    Compiling crypto-common v0.1.61167wrappers-0.5.7>    Compiling bitflags v2.10.01168wrappers-0.5.7>    Compiling yoke-derive v0.8.11169wrappers-0.5.7>    Compiling num-integer v0.1.461170wrappers-0.5.7>    Compiling fnv v1.0.71171wrappers-0.5.7>    Compiling block-buffer v0.10.41172wrappers-0.5.7>    Compiling digest v0.10.71173wrappers-0.5.7>    Compiling zerovec-derive v0.11.21174wrappers-0.5.7>    Compiling zerocopy v0.8.271175wrappers-0.5.7>    Compiling tracing-core v0.1.341176wrappers-0.5.7>    Compiling zerocopy-derive v0.8.271177wrappers-0.5.7>    Compiling tracing-attributes v0.1.301178wrappers-0.5.7>    Compiling tracing v0.1.411179wrappers-0.5.7>    Compiling tokio-util v0.7.161180wrappers-0.5.7>    Compiling displaydoc v0.2.51181wrappers-0.5.7>    Compiling regex-syntax v0.8.81182wrappers-0.5.7>    Compiling pkg-config v0.3.321183wrappers-0.5.7>    Compiling getrandom v0.3.41184wrappers-0.5.7>    Compiling either v1.15.01185wrappers-0.5.7>    Compiling http v1.3.11186wrappers-0.5.7>    Compiling crc32fast v1.5.01187wrappers-0.5.7>    Compiling percent-encoding v2.3.21188wrappers-0.5.7>    Compiling http-body v1.0.11189wrappers-0.5.7>    Compiling aho-corasick v1.1.41190wrappers-0.5.7>    Compiling icu_properties_data v2.1.11191wrappers-0.5.7>    Compiling icu_normalizer_data v2.1.11192wrappers-0.5.7>    Compiling serde_json v1.0.1451193wrappers-0.5.7>    Compiling regex-automata v0.4.131194wrappers-0.5.7>    Compiling base64ct v1.8.01195wrappers-0.5.7>    Compiling regex v1.12.21196wrappers-0.5.7>    Compiling openssl-probe v0.1.61197wrappers-0.5.7>    Compiling ring v0.17.141198wrappers-0.5.7>    Compiling cpufeatures v0.2.171199wrappers-0.5.7>    Compiling hmac v0.12.11200wrappers-0.5.7>    Compiling httparse v1.10.11201wrappers-0.5.7>    Compiling tower-service v0.3.31202wrappers-0.5.7>    Compiling heck v0.5.01203wrappers-0.5.7>    Compiling try-lock v0.2.51204wrappers-0.5.7>    Compiling want v0.3.11205wrappers-0.5.7>    Compiling http-body-util v0.1.31206wrappers-0.5.7>    Compiling http v0.2.121207building '/nix/store/rr37ihfdyyp412bb8r795397m4b8plqz-postgis.drv' on 'ssh-ng://nixbot-remote-build@78.232.36.247'1208wrappers-0.5.7>    Compiling zerofrom v0.1.61209wrappers-0.5.7>    Compiling untrusted v0.9.01210wrappers-0.5.7>    Compiling base64 v0.22.11211building '/nix/store/rr37ihfdyyp412bb8r795397m4b8plqz-postgis.drv'1212postgis> structuredAttrs is enabled1213postgis> created 755 symlinks in user environment1214wrappers-0.5.7>    Compiling stable_deref_trait v1.2.11215wrappers-0.5.7>    Compiling atomic-waker v1.1.21216wrappers-0.5.7>    Compiling httpdate v1.0.31217wrappers-0.5.7>    Compiling yoke v0.8.11218wrappers-0.5.7>    Compiling sha2 v0.10.91219wrappers-0.5.7>    Compiling cmake v0.1.541220wrappers-0.5.7>    Compiling dunce v1.0.51221wrappers-0.5.7>    Compiling fs_extra v1.3.01222wrappers-0.5.7>    Compiling aws-lc-sys v0.32.31223wrappers-0.5.7>    Compiling zerovec v0.11.51224wrappers-0.5.7>    Compiling http-body v0.4.61225wrappers-0.5.7>    Compiling form_urlencoded v1.2.21226wrappers-0.5.7>    Compiling ppv-lite86 v0.2.211227wrappers-0.5.7>    Compiling rustls-pki-types v1.13.01228wrappers-0.5.7>    Compiling iana-time-zone v0.1.641229wrappers-0.5.7>    Compiling semver v1.0.271230wrappers-0.5.7>    Compiling chrono v0.4.421231wrappers-0.5.7>    Compiling aws-lc-rs v1.14.11232wrappers-0.5.7>    Compiling thiserror v1.0.691233wrappers-0.5.7>    Compiling crossbeam-utils v0.8.211234wrappers-0.5.7>    Compiling ipnet v2.11.01235wrappers-0.5.7>    Compiling vcpkg v0.2.151236wrappers-0.5.7>    Compiling tinystr v0.8.21237wrappers-0.5.7>    Compiling thiserror-impl v1.0.691238wrappers-0.5.7>    Compiling litemap v0.8.11239wrappers-0.5.7>    Compiling writeable v0.6.21240wrappers-0.5.7>    Compiling powerfmt v0.2.01241wrappers-0.5.7>    Compiling base64 v0.21.71242wrappers-0.5.7>    Compiling deranged v0.5.51243wrappers-0.5.7>    Compiling icu_locale_core v2.1.11244wrappers-0.5.7>    Compiling potential_utf v0.1.41245wrappers-0.5.7>    Compiling zerotrie v0.2.31246wrappers-0.5.7>    Compiling h2 v0.4.121247wrappers-0.5.7>    Compiling num_threads v0.1.71248wrappers-0.5.7>    Compiling time-core v0.1.61249wrappers-0.5.7>    Compiling num-conv v0.1.01250wrappers-0.5.7>    Compiling rustls v0.23.341251wrappers-0.5.7>    Compiling hex v0.4.31252wrappers-0.5.7>    Compiling time v0.3.441253wrappers-0.5.7>    Compiling hyper v1.7.01254wrappers-0.5.7>    Compiling icu_provider v2.1.11255wrappers-0.5.7>    Compiling icu_collections v2.1.11256wrappers-0.5.7>    Compiling num-bigint v0.4.61257wrappers-0.5.7>    Compiling num-iter v0.1.451258wrappers-0.5.7>    Compiling rustix v1.1.21259wrappers-0.5.7>    Compiling fastrand v2.3.01260wrappers-0.5.7>    Compiling hyper-util v0.1.171261wrappers-0.5.7>    Compiling rustc_version v0.4.11262wrappers-0.5.7>    Compiling crypto-bigint v0.5.51263wrappers-0.5.7>    Compiling outref v0.5.21264wrappers-0.5.7>    Compiling linux-raw-sys v0.11.01265wrappers-0.5.7>    Compiling vsimd v0.8.01266building '/nix/store/3ig5q2gzy2slavmiszby2zhdbc1fl51w-vector-0.8.0.drv' on 'ssh-ng://nixbot-remote-build@78.232.36.247'1267wrappers-0.5.7>    Compiling base64-simd v0.8.01268building '/nix/store/3ig5q2gzy2slavmiszby2zhdbc1fl51w-vector-0.8.0.drv'1269vector-0.8.0> Running phase: unpackPhase1270vector-0.8.0> unpacking source archive /nix/store/hjlmfy69f11l9rwqiw17g4ja4d1zk7bg-source1271vector-0.8.0> source root is source1272vector-0.8.0> Running phase: patchPhase1273vector-0.8.0> Running phase: updateAutotoolsGnuConfigScriptsPhase1274vector-0.8.0> Running phase: configurePhase1275vector-0.8.0> no configure script, doing nothing1276vector-0.8.0> Running phase: buildPhase1277vector-0.8.0> build flags: SHELL=/nix/store/pbjg9k27s3v1wp5s8c6pb23s0m69yjwz-bash-5.3p9/bin/bash1278vector-0.8.0> gcc -Wall -Wmissing-prototypes -Wpointer-arith -Wdeclaration-after-statement -Werror=vla -Wendif-labels -Wmissing-format-attribute -Wimplicit-fallthrough=3 -Wcast-function-type -Wshadow=compatible-local -Wformat-security -fno-strict-aliasing -fwrapv -fexcess-precision=standard -Wno-format-truncation -Wno-stringop-truncation -g -O2 -march=native -ftree-vectorize -fassociative-math -fno-signed-zeros -fno-trapping-math -fPIC -fvisibility=hidden -I. -I./ -I/nix/store/3jrlp8bmrlfal71jwaj244rjgdnngl81-postgresql-17.11/include/server -I/nix/store/3jrlp8bmrlfal71jwaj244rjgdnngl81-postgresql-17.11/include/internal -D_GNU_SOURCE  -I/nix/store/n8zb5iyyaqfrjmdgibap9j6a29y1cl41-libxml2-2.15.4-dev/include/libxml2 -I/nix/store/3gx080m9qfv8k0sff9bg5877n6zd9kv8-lz4-1.10.0-dev/include -I/nix/store/3y8mdshg1hkwpcnzhhd1q71p2wps47d4-zstd-1.5.7-dev/include -I/nix/store/qm179cq3lxwcmmm6lnkfghiw67zjbm3c-icu4c-75.1-dev/include  -c -o src/bitutils.o src/bitutils.c1279vector-0.8.0> warning: Skipping impure flag -march=native because NIX_ENFORCE_NO_NATIVE is set1280vector-0.8.0> gcc -Wall -Wmissing-prototypes -Wpointer-arith -Wdeclaration-after-statement -Werror=vla -Wendif-labels -Wmissing-format-attribute -Wimplicit-fallthrough=3 -Wcast-function-type -Wshadow=compatible-local -Wformat-security -fno-strict-aliasing -fwrapv -fexcess-precision=standard -Wno-format-truncation -Wno-stringop-truncation -g -O2 -march=native -ftree-vectorize -fassociative-math -fno-signed-zeros -fno-trapping-math -fPIC -fvisibility=hidden -I. -I./ -I/nix/store/3jrlp8bmrlfal71jwaj244rjgdnngl81-postgresql-17.11/include/server -I/nix/store/3jrlp8bmrlfal71jwaj244rjgdnngl81-postgresql-17.11/include/internal -D_GNU_SOURCE  -I/nix/store/n8zb5iyyaqfrjmdgibap9j6a29y1cl41-libxml2-2.15.4-dev/include/libxml2 -I/nix/store/3gx080m9qfv8k0sff9bg5877n6zd9kv8-lz4-1.10.0-dev/include -I/nix/store/3y8mdshg1hkwpcnzhhd1q71p2wps47d4-zstd-1.5.7-dev/include -I/nix/store/qm179cq3lxwcmmm6lnkfghiw67zjbm3c-icu4c-75.1-dev/include  -c -o src/bitvec.o src/bitvec.c1281vector-0.8.0> warning: Skipping impure flag -march=native because NIX_ENFORCE_NO_NATIVE is set1282vector-0.8.0> gcc -Wall -Wmissing-prototypes -Wpointer-arith -Wdeclaration-after-statement -Werror=vla -Wendif-labels -Wmissing-format-attribute -Wimplicit-fallthrough=3 -Wcast-function-type -Wshadow=compatible-local -Wformat-security -fno-strict-aliasing -fwrapv -fexcess-precision=standard -Wno-format-truncation -Wno-stringop-truncation -g -O2 -march=native -ftree-vectorize -fassociative-math -fno-signed-zeros -fno-trapping-math -fPIC -fvisibility=hidden -I. -I./ -I/nix/store/3jrlp8bmrlfal71jwaj244rjgdnngl81-postgresql-17.11/include/server -I/nix/store/3jrlp8bmrlfal71jwaj244rjgdnngl81-postgresql-17.11/include/internal -D_GNU_SOURCE  -I/nix/store/n8zb5iyyaqfrjmdgibap9j6a29y1cl41-libxml2-2.15.4-dev/include/libxml2 -I/nix/store/3gx080m9qfv8k0sff9bg5877n6zd9kv8-lz4-1.10.0-dev/include -I/nix/store/3y8mdshg1hkwpcnzhhd1q71p2wps47d4-zstd-1.5.7-dev/include -I/nix/store/qm179cq3lxwcmmm6lnkfghiw67zjbm3c-icu4c-75.1-dev/include  -c -o src/halfutils.o src/halfutils.c1283vector-0.8.0> warning: Skipping impure flag -march=native because NIX_ENFORCE_NO_NATIVE is set1284vector-0.8.0> gcc -Wall -Wmissing-prototypes -Wpointer-arith -Wdeclaration-after-statement -Werror=vla -Wendif-labels -Wmissing-format-attribute -Wimplicit-fallthrough=3 -Wcast-function-type -Wshadow=compatible-local -Wformat-security -fno-strict-aliasing -fwrapv -fexcess-precision=standard -Wno-format-truncation -Wno-stringop-truncation -g -O2 -march=native -ftree-vectorize -fassociative-math -fno-signed-zeros -fno-trapping-math -fPIC -fvisibility=hidden -I. -I./ -I/nix/store/3jrlp8bmrlfal71jwaj244rjgdnngl81-postgresql-17.11/include/server -I/nix/store/3jrlp8bmrlfal71jwaj244rjgdnngl81-postgresql-17.11/include/internal -D_GNU_SOURCE  -I/nix/store/n8zb5iyyaqfrjmdgibap9j6a29y1cl41-libxml2-2.15.4-dev/include/libxml2 -I/nix/store/3gx080m9qfv8k0sff9bg5877n6zd9kv8-lz4-1.10.0-dev/include -I/nix/store/3y8mdshg1hkwpcnzhhd1q71p2wps47d4-zstd-1.5.7-dev/include -I/nix/store/qm179cq3lxwcmmm6lnkfghiw67zjbm3c-icu4c-75.1-dev/include  -c -o src/halfvec.o src/halfvec.c1285vector-0.8.0> warning: Skipping impure flag -march=native because NIX_ENFORCE_NO_NATIVE is set1286vector-0.8.0> gcc -Wall -Wmissing-prototypes -Wpointer-arith -Wdeclaration-after-statement -Werror=vla -Wendif-labels -Wmissing-format-attribute -Wimplicit-fallthrough=3 -Wcast-function-type -Wshadow=compatible-local -Wformat-security -fno-strict-aliasing -fwrapv -fexcess-precision=standard -Wno-format-truncation -Wno-stringop-truncation -g -O2 -march=native -ftree-vectorize -fassociative-math -fno-signed-zeros -fno-trapping-math -fPIC -fvisibility=hidden -I. -I./ -I/nix/store/3jrlp8bmrlfal71jwaj244rjgdnngl81-postgresql-17.11/include/server -I/nix/store/3jrlp8bmrlfal71jwaj244rjgdnngl81-postgresql-17.11/include/internal -D_GNU_SOURCE  -I/nix/store/n8zb5iyyaqfrjmdgibap9j6a29y1cl41-libxml2-2.15.4-dev/include/libxml2 -I/nix/store/3gx080m9qfv8k0sff9bg5877n6zd9kv8-lz4-1.10.0-dev/include -I/nix/store/3y8mdshg1hkwpcnzhhd1q71p2wps47d4-zstd-1.5.7-dev/include -I/nix/store/qm179cq3lxwcmmm6lnkfghiw67zjbm3c-icu4c-75.1-dev/include  -c -o src/hnsw.o src/hnsw.c1287vector-0.8.0> warning: Skipping impure flag -march=native because NIX_ENFORCE_NO_NATIVE is set1288wrappers-0.5.7>    Compiling icu_normalizer v2.1.11289vector-0.8.0> gcc -Wall -Wmissing-prototypes -Wpointer-arith -Wdeclaration-after-statement -Werror=vla -Wendif-labels -Wmissing-format-attribute -Wimplicit-fallthrough=3 -Wcast-function-type -Wshadow=compatible-local -Wformat-security -fno-strict-aliasing -fwrapv -fexcess-precision=standard -Wno-format-truncation -Wno-stringop-truncation -g -O2 -march=native -ftree-vectorize -fassociative-math -fno-signed-zeros -fno-trapping-math -fPIC -fvisibility=hidden -I. -I./ -I/nix/store/3jrlp8bmrlfal71jwaj244rjgdnngl81-postgresql-17.11/include/server -I/nix/store/3jrlp8bmrlfal71jwaj244rjgdnngl81-postgresql-17.11/include/internal -D_GNU_SOURCE  -I/nix/store/n8zb5iyyaqfrjmdgibap9j6a29y1cl41-libxml2-2.15.4-dev/include/libxml2 -I/nix/store/3gx080m9qfv8k0sff9bg5877n6zd9kv8-lz4-1.10.0-dev/include -I/nix/store/3y8mdshg1hkwpcnzhhd1q71p2wps47d4-zstd-1.5.7-dev/include -I/nix/store/qm179cq3lxwcmmm6lnkfghiw67zjbm3c-icu4c-75.1-dev/include  -c -o src/hnswbuild.o src/hnswbuild.c1290vector-0.8.0> warning: Skipping impure flag -march=native because NIX_ENFORCE_NO_NATIVE is set1291vector-0.8.0> gcc -Wall -Wmissing-prototypes -Wpointer-arith -Wdeclaration-after-statement -Werror=vla -Wendif-labels -Wmissing-format-attribute -Wimplicit-fallthrough=3 -Wcast-function-type -Wshadow=compatible-local -Wformat-security -fno-strict-aliasing -fwrapv -fexcess-precision=standard -Wno-format-truncation -Wno-stringop-truncation -g -O2 -march=native -ftree-vectorize -fassociative-math -fno-signed-zeros -fno-trapping-math -fPIC -fvisibility=hidden -I. -I./ -I/nix/store/3jrlp8bmrlfal71jwaj244rjgdnngl81-postgresql-17.11/include/server -I/nix/store/3jrlp8bmrlfal71jwaj244rjgdnngl81-postgresql-17.11/include/internal -D_GNU_SOURCE  -I/nix/store/n8zb5iyyaqfrjmdgibap9j6a29y1cl41-libxml2-2.15.4-dev/include/libxml2 -I/nix/store/3gx080m9qfv8k0sff9bg5877n6zd9kv8-lz4-1.10.0-dev/include -I/nix/store/3y8mdshg1hkwpcnzhhd1q71p2wps47d4-zstd-1.5.7-dev/include -I/nix/store/qm179cq3lxwcmmm6lnkfghiw67zjbm3c-icu4c-75.1-dev/include  -c -o src/hnswinsert.o src/hnswinsert.c1292vector-0.8.0> warning: Skipping impure flag -march=native because NIX_ENFORCE_NO_NATIVE is set1293wrappers-0.5.7>    Compiling icu_properties v2.1.11294vector-0.8.0> gcc -Wall -Wmissing-prototypes -Wpointer-arith -Wdeclaration-after-statement -Werror=vla -Wendif-labels -Wmissing-format-attribute -Wimplicit-fallthrough=3 -Wcast-function-type -Wshadow=compatible-local -Wformat-security -fno-strict-aliasing -fwrapv -fexcess-precision=standard -Wno-format-truncation -Wno-stringop-truncation -g -O2 -march=native -ftree-vectorize -fassociative-math -fno-signed-zeros -fno-trapping-math -fPIC -fvisibility=hidden -I. -I./ -I/nix/store/3jrlp8bmrlfal71jwaj244rjgdnngl81-postgresql-17.11/include/server -I/nix/store/3jrlp8bmrlfal71jwaj244rjgdnngl81-postgresql-17.11/include/internal -D_GNU_SOURCE  -I/nix/store/n8zb5iyyaqfrjmdgibap9j6a29y1cl41-libxml2-2.15.4-dev/include/libxml2 -I/nix/store/3gx080m9qfv8k0sff9bg5877n6zd9kv8-lz4-1.10.0-dev/include -I/nix/store/3y8mdshg1hkwpcnzhhd1q71p2wps47d4-zstd-1.5.7-dev/include -I/nix/store/qm179cq3lxwcmmm6lnkfghiw67zjbm3c-icu4c-75.1-dev/include  -c -o src/hnswscan.o src/hnswscan.c1295vector-0.8.0> warning: Skipping impure flag -march=native because NIX_ENFORCE_NO_NATIVE is set1296vector-0.8.0> gcc -Wall -Wmissing-prototypes -Wpointer-arith -Wdeclaration-after-statement -Werror=vla -Wendif-labels -Wmissing-format-attribute -Wimplicit-fallthrough=3 -Wcast-function-type -Wshadow=compatible-local -Wformat-security -fno-strict-aliasing -fwrapv -fexcess-precision=standard -Wno-format-truncation -Wno-stringop-truncation -g -O2 -march=native -ftree-vectorize -fassociative-math -fno-signed-zeros -fno-trapping-math -fPIC -fvisibility=hidden -I. -I./ -I/nix/store/3jrlp8bmrlfal71jwaj244rjgdnngl81-postgresql-17.11/include/server -I/nix/store/3jrlp8bmrlfal71jwaj244rjgdnngl81-postgresql-17.11/include/internal -D_GNU_SOURCE  -I/nix/store/n8zb5iyyaqfrjmdgibap9j6a29y1cl41-libxml2-2.15.4-dev/include/libxml2 -I/nix/store/3gx080m9qfv8k0sff9bg5877n6zd9kv8-lz4-1.10.0-dev/include -I/nix/store/3y8mdshg1hkwpcnzhhd1q71p2wps47d4-zstd-1.5.7-dev/include -I/nix/store/qm179cq3lxwcmmm6lnkfghiw67zjbm3c-icu4c-75.1-dev/include  -c -o src/hnswutils.o src/hnswutils.c1297vector-0.8.0> warning: Skipping impure flag -march=native because NIX_ENFORCE_NO_NATIVE is set1298wrappers-0.5.7>    Compiling openssl-sys v0.9.1101299vector-0.8.0> gcc -Wall -Wmissing-prototypes -Wpointer-arith -Wdeclaration-after-statement -Werror=vla -Wendif-labels -Wmissing-format-attribute -Wimplicit-fallthrough=3 -Wcast-function-type -Wshadow=compatible-local -Wformat-security -fno-strict-aliasing -fwrapv -fexcess-precision=standard -Wno-format-truncation -Wno-stringop-truncation -g -O2 -march=native -ftree-vectorize -fassociative-math -fno-signed-zeros -fno-trapping-math -fPIC -fvisibility=hidden -I. -I./ -I/nix/store/3jrlp8bmrlfal71jwaj244rjgdnngl81-postgresql-17.11/include/server -I/nix/store/3jrlp8bmrlfal71jwaj244rjgdnngl81-postgresql-17.11/include/internal -D_GNU_SOURCE  -I/nix/store/n8zb5iyyaqfrjmdgibap9j6a29y1cl41-libxml2-2.15.4-dev/include/libxml2 -I/nix/store/3gx080m9qfv8k0sff9bg5877n6zd9kv8-lz4-1.10.0-dev/include -I/nix/store/3y8mdshg1hkwpcnzhhd1q71p2wps47d4-zstd-1.5.7-dev/include -I/nix/store/qm179cq3lxwcmmm6lnkfghiw67zjbm3c-icu4c-75.1-dev/include  -c -o src/hnswvacuum.o src/hnswvacuum.c1300vector-0.8.0> warning: Skipping impure flag -march=native because NIX_ENFORCE_NO_NATIVE is set1301vector-0.8.0> gcc -Wall -Wmissing-prototypes -Wpointer-arith -Wdeclaration-after-statement -Werror=vla -Wendif-labels -Wmissing-format-attribute -Wimplicit-fallthrough=3 -Wcast-function-type -Wshadow=compatible-local -Wformat-security -fno-strict-aliasing -fwrapv -fexcess-precision=standard -Wno-format-truncation -Wno-stringop-truncation -g -O2 -march=native -ftree-vectorize -fassociative-math -fno-signed-zeros -fno-trapping-math -fPIC -fvisibility=hidden -I. -I./ -I/nix/store/3jrlp8bmrlfal71jwaj244rjgdnngl81-postgresql-17.11/include/server -I/nix/store/3jrlp8bmrlfal71jwaj244rjgdnngl81-postgresql-17.11/include/internal -D_GNU_SOURCE  -I/nix/store/n8zb5iyyaqfrjmdgibap9j6a29y1cl41-libxml2-2.15.4-dev/include/libxml2 -I/nix/store/3gx080m9qfv8k0sff9bg5877n6zd9kv8-lz4-1.10.0-dev/include -I/nix/store/3y8mdshg1hkwpcnzhhd1q71p2wps47d4-zstd-1.5.7-dev/include -I/nix/store/qm179cq3lxwcmmm6lnkfghiw67zjbm3c-icu4c-75.1-dev/include  -c -o src/ivfbuild.o src/ivfbuild.c1302vector-0.8.0> warning: Skipping impure flag -march=native because NIX_ENFORCE_NO_NATIVE is set1303wrappers-0.5.7>    Compiling bytes-utils v0.1.41304wrappers-0.5.7>    Compiling tower-layer v0.3.31305vector-0.8.0> gcc -Wall -Wmissing-prototypes -Wpointer-arith -Wdeclaration-after-statement -Werror=vla -Wendif-labels -Wmissing-format-attribute -Wimplicit-fallthrough=3 -Wcast-function-type -Wshadow=compatible-local -Wformat-security -fno-strict-aliasing -fwrapv -fexcess-precision=standard -Wno-format-truncation -Wno-stringop-truncation -g -O2 -march=native -ftree-vectorize -fassociative-math -fno-signed-zeros -fno-trapping-math -fPIC -fvisibility=hidden -I. -I./ -I/nix/store/3jrlp8bmrlfal71jwaj244rjgdnngl81-postgresql-17.11/include/server -I/nix/store/3jrlp8bmrlfal71jwaj244rjgdnngl81-postgresql-17.11/include/internal -D_GNU_SOURCE  -I/nix/store/n8zb5iyyaqfrjmdgibap9j6a29y1cl41-libxml2-2.15.4-dev/include/libxml2 -I/nix/store/3gx080m9qfv8k0sff9bg5877n6zd9kv8-lz4-1.10.0-dev/include -I/nix/store/3y8mdshg1hkwpcnzhhd1q71p2wps47d4-zstd-1.5.7-dev/include -I/nix/store/qm179cq3lxwcmmm6lnkfghiw67zjbm3c-icu4c-75.1-dev/include  -c -o src/ivfflat.o src/ivfflat.c1306vector-0.8.0> warning: Skipping impure flag -march=native because NIX_ENFORCE_NO_NATIVE is set1307vector-0.8.0> gcc -Wall -Wmissing-prototypes -Wpointer-arith -Wdeclaration-after-statement -Werror=vla -Wendif-labels -Wmissing-format-attribute -Wimplicit-fallthrough=3 -Wcast-function-type -Wshadow=compatible-local -Wformat-security -fno-strict-aliasing -fwrapv -fexcess-precision=standard -Wno-format-truncation -Wno-stringop-truncation -g -O2 -march=native -ftree-vectorize -fassociative-math -fno-signed-zeros -fno-trapping-math -fPIC -fvisibility=hidden -I. -I./ -I/nix/store/3jrlp8bmrlfal71jwaj244rjgdnngl81-postgresql-17.11/include/server -I/nix/store/3jrlp8bmrlfal71jwaj244rjgdnngl81-postgresql-17.11/include/internal -D_GNU_SOURCE  -I/nix/store/n8zb5iyyaqfrjmdgibap9j6a29y1cl41-libxml2-2.15.4-dev/include/libxml2 -I/nix/store/3gx080m9qfv8k0sff9bg5877n6zd9kv8-lz4-1.10.0-dev/include -I/nix/store/3y8mdshg1hkwpcnzhhd1q71p2wps47d4-zstd-1.5.7-dev/include -I/nix/store/qm179cq3lxwcmmm6lnkfghiw67zjbm3c-icu4c-75.1-dev/include  -c -o src/ivfinsert.o src/ivfinsert.c1308vector-0.8.0> warning: Skipping impure flag -march=native because NIX_ENFORCE_NO_NATIVE is set1309vector-0.8.0> gcc -Wall -Wmissing-prototypes -Wpointer-arith -Wdeclaration-after-statement -Werror=vla -Wendif-labels -Wmissing-format-attribute -Wimplicit-fallthrough=3 -Wcast-function-type -Wshadow=compatible-local -Wformat-security -fno-strict-aliasing -fwrapv -fexcess-precision=standard -Wno-format-truncation -Wno-stringop-truncation -g -O2 -march=native -ftree-vectorize -fassociative-math -fno-signed-zeros -fno-trapping-math -fPIC -fvisibility=hidden -I. -I./ -I/nix/store/3jrlp8bmrlfal71jwaj244rjgdnngl81-postgresql-17.11/include/server -I/nix/store/3jrlp8bmrlfal71jwaj244rjgdnngl81-postgresql-17.11/include/internal -D_GNU_SOURCE  -I/nix/store/n8zb5iyyaqfrjmdgibap9j6a29y1cl41-libxml2-2.15.4-dev/include/libxml2 -I/nix/store/3gx080m9qfv8k0sff9bg5877n6zd9kv8-lz4-1.10.0-dev/include -I/nix/store/3y8mdshg1hkwpcnzhhd1q71p2wps47d4-zstd-1.5.7-dev/include -I/nix/store/qm179cq3lxwcmmm6lnkfghiw67zjbm3c-icu4c-75.1-dev/include  -c -o src/ivfkmeans.o src/ivfkmeans.c1310vector-0.8.0> warning: Skipping impure flag -march=native because NIX_ENFORCE_NO_NATIVE is set1311vector-0.8.0> gcc -Wall -Wmissing-prototypes -Wpointer-arith -Wdeclaration-after-statement -Werror=vla -Wendif-labels -Wmissing-format-attribute -Wimplicit-fallthrough=3 -Wcast-function-type -Wshadow=compatible-local -Wformat-security -fno-strict-aliasing -fwrapv -fexcess-precision=standard -Wno-format-truncation -Wno-stringop-truncation -g -O2 -march=native -ftree-vectorize -fassociative-math -fno-signed-zeros -fno-trapping-math -fPIC -fvisibility=hidden -I. -I./ -I/nix/store/3jrlp8bmrlfal71jwaj244rjgdnngl81-postgresql-17.11/include/server -I/nix/store/3jrlp8bmrlfal71jwaj244rjgdnngl81-postgresql-17.11/include/internal -D_GNU_SOURCE  -I/nix/store/n8zb5iyyaqfrjmdgibap9j6a29y1cl41-libxml2-2.15.4-dev/include/libxml2 -I/nix/store/3gx080m9qfv8k0sff9bg5877n6zd9kv8-lz4-1.10.0-dev/include -I/nix/store/3y8mdshg1hkwpcnzhhd1q71p2wps47d4-zstd-1.5.7-dev/include -I/nix/store/qm179cq3lxwcmmm6lnkfghiw67zjbm3c-icu4c-75.1-dev/include  -c -o src/ivfscan.o src/ivfscan.c1312vector-0.8.0> warning: Skipping impure flag -march=native because NIX_ENFORCE_NO_NATIVE is set1313vector-0.8.0> gcc -Wall -Wmissing-prototypes -Wpointer-arith -Wdeclaration-after-statement -Werror=vla -Wendif-labels -Wmissing-format-attribute -Wimplicit-fallthrough=3 -Wcast-function-type -Wshadow=compatible-local -Wformat-security -fno-strict-aliasing -fwrapv -fexcess-precision=standard -Wno-format-truncation -Wno-stringop-truncation -g -O2 -march=native -ftree-vectorize -fassociative-math -fno-signed-zeros -fno-trapping-math -fPIC -fvisibility=hidden -I. -I./ -I/nix/store/3jrlp8bmrlfal71jwaj244rjgdnngl81-postgresql-17.11/include/server -I/nix/store/3jrlp8bmrlfal71jwaj244rjgdnngl81-postgresql-17.11/include/internal -D_GNU_SOURCE  -I/nix/store/n8zb5iyyaqfrjmdgibap9j6a29y1cl41-libxml2-2.15.4-dev/include/libxml2 -I/nix/store/3gx080m9qfv8k0sff9bg5877n6zd9kv8-lz4-1.10.0-dev/include -I/nix/store/3y8mdshg1hkwpcnzhhd1q71p2wps47d4-zstd-1.5.7-dev/include -I/nix/store/qm179cq3lxwcmmm6lnkfghiw67zjbm3c-icu4c-75.1-dev/include  -c -o src/ivfutils.o src/ivfutils.c1314vector-0.8.0> warning: Skipping impure flag -march=native because NIX_ENFORCE_NO_NATIVE is set1315vector-0.8.0> gcc -Wall -Wmissing-prototypes -Wpointer-arith -Wdeclaration-after-statement -Werror=vla -Wendif-labels -Wmissing-format-attribute -Wimplicit-fallthrough=3 -Wcast-function-type -Wshadow=compatible-local -Wformat-security -fno-strict-aliasing -fwrapv -fexcess-precision=standard -Wno-format-truncation -Wno-stringop-truncation -g -O2 -march=native -ftree-vectorize -fassociative-math -fno-signed-zeros -fno-trapping-math -fPIC -fvisibility=hidden -I. -I./ -I/nix/store/3jrlp8bmrlfal71jwaj244rjgdnngl81-postgresql-17.11/include/server -I/nix/store/3jrlp8bmrlfal71jwaj244rjgdnngl81-postgresql-17.11/include/internal -D_GNU_SOURCE  -I/nix/store/n8zb5iyyaqfrjmdgibap9j6a29y1cl41-libxml2-2.15.4-dev/include/libxml2 -I/nix/store/3gx080m9qfv8k0sff9bg5877n6zd9kv8-lz4-1.10.0-dev/include -I/nix/store/3y8mdshg1hkwpcnzhhd1q71p2wps47d4-zstd-1.5.7-dev/include -I/nix/store/qm179cq3lxwcmmm6lnkfghiw67zjbm3c-icu4c-75.1-dev/include  -c -o src/ivfvacuum.o src/ivfvacuum.c1316vector-0.8.0> warning: Skipping impure flag -march=native because NIX_ENFORCE_NO_NATIVE is set1317vector-0.8.0> gcc -Wall -Wmissing-prototypes -Wpointer-arith -Wdeclaration-after-statement -Werror=vla -Wendif-labels -Wmissing-format-attribute -Wimplicit-fallthrough=3 -Wcast-function-type -Wshadow=compatible-local -Wformat-security -fno-strict-aliasing -fwrapv -fexcess-precision=standard -Wno-format-truncation -Wno-stringop-truncation -g -O2 -march=native -ftree-vectorize -fassociative-math -fno-signed-zeros -fno-trapping-math -fPIC -fvisibility=hidden -I. -I./ -I/nix/store/3jrlp8bmrlfal71jwaj244rjgdnngl81-postgresql-17.11/include/server -I/nix/store/3jrlp8bmrlfal71jwaj244rjgdnngl81-postgresql-17.11/include/internal -D_GNU_SOURCE  -I/nix/store/n8zb5iyyaqfrjmdgibap9j6a29y1cl41-libxml2-2.15.4-dev/include/libxml2 -I/nix/store/3gx080m9qfv8k0sff9bg5877n6zd9kv8-lz4-1.10.0-dev/include -I/nix/store/3y8mdshg1hkwpcnzhhd1q71p2wps47d4-zstd-1.5.7-dev/include -I/nix/store/qm179cq3lxwcmmm6lnkfghiw67zjbm3c-icu4c-75.1-dev/include  -c -o src/sparsevec.o src/sparsevec.c1318vector-0.8.0> warning: Skipping impure flag -march=native because NIX_ENFORCE_NO_NATIVE is set1319wrappers-0.5.7>    Compiling aws-smithy-types v1.3.31320vector-0.8.0> gcc -Wall -Wmissing-prototypes -Wpointer-arith -Wdeclaration-after-statement -Werror=vla -Wendif-labels -Wmissing-format-attribute -Wimplicit-fallthrough=3 -Wcast-function-type -Wshadow=compatible-local -Wformat-security -fno-strict-aliasing -fwrapv -fexcess-precision=standard -Wno-format-truncation -Wno-stringop-truncation -g -O2 -march=native -ftree-vectorize -fassociative-math -fno-signed-zeros -fno-trapping-math -fPIC -fvisibility=hidden -I. -I./ -I/nix/store/3jrlp8bmrlfal71jwaj244rjgdnngl81-postgresql-17.11/include/server -I/nix/store/3jrlp8bmrlfal71jwaj244rjgdnngl81-postgresql-17.11/include/internal -D_GNU_SOURCE  -I/nix/store/n8zb5iyyaqfrjmdgibap9j6a29y1cl41-libxml2-2.15.4-dev/include/libxml2 -I/nix/store/3gx080m9qfv8k0sff9bg5877n6zd9kv8-lz4-1.10.0-dev/include -I/nix/store/3y8mdshg1hkwpcnzhhd1q71p2wps47d4-zstd-1.5.7-dev/include -I/nix/store/qm179cq3lxwcmmm6lnkfghiw67zjbm3c-icu4c-75.1-dev/include  -c -o src/vector.o src/vector.c1321vector-0.8.0> warning: Skipping impure flag -march=native because NIX_ENFORCE_NO_NATIVE is set1322vector-0.8.0> gcc -Wall -Wmissing-prototypes -Wpointer-arith -Wdeclaration-after-statement -Werror=vla -Wendif-labels -Wmissing-format-attribute -Wimplicit-fallthrough=3 -Wcast-function-type -Wshadow=compatible-local -Wformat-security -fno-strict-aliasing -fwrapv -fexcess-precision=standard -Wno-format-truncation -Wno-stringop-truncation -g -O2 -march=native -ftree-vectorize -fassociative-math -fno-signed-zeros -fno-trapping-math -fPIC -fvisibility=hidden -shared -o vector.so src/bitutils.o src/bitvec.o src/halfutils.o src/halfvec.o src/hnsw.o src/hnswbuild.o src/hnswinsert.o src/hnswscan.o src/hnswutils.o src/hnswvacuum.o src/ivfbuild.o src/ivfflat.o src/ivfinsert.o src/ivfkmeans.o src/ivfscan.o src/ivfutils.o src/ivfvacuum.o src/sparsevec.o src/vector.o -L/nix/store/dpr85nhbv5igqis7gnaavv9x21sjbc0i-postgresql-17.11-lib/lib    -L/nix/store/xjnvfcp3i347rp7zncsw5vdp7wgnpyaf-libxml2-2.15.4/lib -L/nix/store/yq0c2jhzc3877vagbkwxinm80wajlkh6-lz4-1.10.0-lib/lib -L/nix/store/i8f26lwk8i93hmiyrmsy752m6nwi4pmk-zstd-1.5.7/lib -Wl,--as-needed -Wl,-rpath,'/nix/store/dpr85nhbv5igqis7gnaavv9x21sjbc0i-postgresql-17.11-lib/lib',--enable-new-dtags -fvisibility=hidden 1323vector-0.8.0> warning: Skipping impure flag -march=native because NIX_ENFORCE_NO_NATIVE is set1324vector-0.8.0> cp sql/vector.sql sql/vector--0.8.0.sql1325vector-0.8.0> Running phase: installPhase1326vector-0.8.0> Running phase: fixupPhase1327vector-0.8.0> shrinking RPATHs of ELF executables and libraries in /nix/store/lq1ym2v6ma152d1pns5p2gcw9yqxr3n6-vector-0.8.01328vector-0.8.0> shrinking /nix/store/lq1ym2v6ma152d1pns5p2gcw9yqxr3n6-vector-0.8.0/lib/vector-0.8.0.so1329vector-0.8.0> checking for references to /build/ in /nix/store/lq1ym2v6ma152d1pns5p2gcw9yqxr3n6-vector-0.8.0...1330vector-0.8.0> patching script interpreter paths in /nix/store/lq1ym2v6ma152d1pns5p2gcw9yqxr3n6-vector-0.8.01331vector-0.8.0> stripping (with command strip and flags -S -p) in  /nix/store/lq1ym2v6ma152d1pns5p2gcw9yqxr3n6-vector-0.8.0/lib1332wrappers-0.5.7>    Compiling idna_adapter v1.2.11333wrappers-0.5.7>    Compiling rustls-native-certs v0.8.21334wrappers-0.5.7>    Compiling utf8_iter v1.0.41335wrappers-0.5.7>    Compiling idna v1.1.01336wrappers-0.5.7>    Compiling num-rational v0.4.21337wrappers-0.5.7>    Compiling webpki-roots v1.0.31338wrappers-0.5.7>    Compiling num-complex v0.4.61339wrappers-0.5.7>    Compiling sync_wrapper v1.0.21340wrappers-0.5.7>    Compiling tower v0.5.21341wrappers-0.5.7>    Compiling num v0.4.31342wrappers-0.5.7>    Compiling url v2.5.71343wrappers-0.5.7>    Compiling rand_chacha v0.3.11344wrappers-0.5.7>    Compiling pem-rfc7468 v0.7.01345wrappers-0.5.7>    Compiling itertools v0.12.11346wrappers-0.5.7>    Compiling socket2 v0.5.101347wrappers-0.5.7>    Compiling openssl v0.10.741348wrappers-0.5.7>    Compiling foreign-types-shared v0.1.11349wrappers-0.5.7>    Compiling thiserror v2.0.171350wrappers-0.5.7>    Compiling foreign-types v0.3.21351wrappers-0.5.7>    Compiling prost-derive v0.12.61352wrappers-0.5.7>    Compiling der v0.7.101353wrappers-0.5.7>    Compiling rand v0.8.51354wrappers-0.5.7>    Compiling concurrent-queue v2.5.01355wrappers-0.5.7>    Compiling h2 v0.3.271356wrappers-0.5.7>    Compiling uuid v1.18.11357wrappers-0.5.7>    Compiling aws-smithy-async v1.2.61358wrappers-0.5.7>    Compiling uncased v0.9.101359wrappers-0.5.7>    Compiling openssl-macros v0.1.11360wrappers-0.5.7>    Compiling native-tls v0.2.141361wrappers-0.5.7>    Compiling aws-smithy-runtime-api v1.9.11362wrappers-0.5.7>    Compiling hyper v0.14.321363wrappers-0.5.7>    Compiling rustls-webpki v0.103.81364wrappers-0.5.7>    Compiling spki v0.7.31365wrappers-0.5.7>    Compiling async-trait v0.1.891366wrappers-0.5.7>    Compiling thiserror-impl v2.0.171367wrappers-0.5.7>    Compiling parking v2.2.11368wrappers-0.5.7>    Compiling prettyplease v0.2.371369wrappers-0.5.7>    Compiling byteorder v1.5.01370wrappers-0.5.7>    Compiling tokio-rustls v0.26.41371wrappers-0.5.7>    Compiling hyper-rustls v0.27.71372wrappers-0.5.7>    Compiling pkcs8 v0.10.21373wrappers-0.5.7>    Compiling rustls-pemfile v1.0.41374wrappers-0.5.7>    Compiling half v2.7.11375wrappers-0.5.7>    Compiling der v0.6.11376wrappers-0.5.7>    Compiling ahash v0.8.121377wrappers-0.5.7>    Compiling ident_case v1.0.11378wrappers-0.5.7>    Compiling strsim v0.11.11379wrappers-0.5.7>    Compiling tempfile v3.23.01380wrappers-0.5.7>    Compiling spki v0.6.01381wrappers-0.5.7>    Compiling arrow-buffer v55.2.01382wrappers-0.5.7>    Compiling prost v0.12.61383wrappers-0.5.7>    Compiling arrow-schema v55.2.01384wrappers-0.5.7>    Compiling rustls v0.21.121385wrappers-0.5.7>    Compiling multimap v0.10.11386wrappers-0.5.7>    Compiling arrow-data v55.2.01387wrappers-0.5.7>    Compiling prost-types v0.12.61388wrappers-0.5.7>    Compiling pkcs8 v0.9.01389wrappers-0.5.7>    Compiling sct v0.7.11390wrappers-0.5.7>    Compiling rustls-webpki v0.101.71391wrappers-0.5.7>    Compiling hkdf v0.12.41392wrappers-0.5.7>    Compiling ff v0.12.11393wrappers-0.5.7>    Compiling crypto-bigint v0.4.91394wrappers-0.5.7>    Compiling unicode-width v0.2.21395wrappers-0.5.7>    Compiling base16ct v0.1.11396wrappers-0.5.7>    Compiling sec1 v0.3.01397wrappers-0.5.7>    Compiling group v0.12.11398wrappers-0.5.7>    Compiling arrow-array v55.2.01399wrappers-0.5.7>    Compiling tokio-native-tls v0.3.11400wrappers-0.5.7>    Compiling aws-smithy-eventstream v0.60.121401wrappers-0.5.7>    Compiling ff v0.13.11402wrappers-0.5.7>    Compiling eyre v0.6.121403wrappers-0.5.7>    Compiling base16ct v0.2.01404wrappers-0.5.7>    Compiling syn v1.0.1091405wrappers-0.5.7>    Compiling sec1 v0.7.31406wrappers-0.5.7>    Compiling group v0.13.01407wrappers-0.5.7>    Compiling aws-smithy-http v0.62.41408wrappers-0.5.7>    Compiling tokio-rustls v0.24.11409wrappers-0.5.7>    Compiling elliptic-curve v0.12.31410wrappers-0.5.7>    Compiling rfc6979 v0.3.11411wrappers-0.5.7>    Compiling rustls-native-certs v0.6.31412wrappers-0.5.7>    Compiling event-listener v5.4.11413wrappers-0.5.7>    Compiling serde_urlencoded v0.7.11414wrappers-0.5.7>    Compiling signature v2.2.01415wrappers-0.5.7>    Compiling signature v1.6.41416wrappers-0.5.7>    Compiling encoding_rs v0.8.351417wrappers-0.5.7>    Compiling simd-adler32 v0.3.71418wrappers-0.5.7>    Compiling lexical-util v1.0.71419wrappers-0.5.7>    Compiling beef v0.5.21420wrappers-0.5.7>    Compiling rustversion v1.0.221421wrappers-0.5.7>    Compiling adler2 v2.0.11422wrappers-0.5.7>    Compiling zlib-rs v0.5.21423wrappers-0.5.7>    Compiling unicase v2.8.11424wrappers-0.5.7>    Compiling lazy_static v1.5.01425wrappers-0.5.7>    Compiling siphasher v1.0.11426wrappers-0.5.7>    Compiling crunchy v0.2.41427wrappers-0.5.7>    Compiling phf_shared v0.11.31428wrappers-0.5.7>    Compiling logos-codegen v0.14.41429wrappers-0.5.7>    Compiling libz-rs-sys v0.5.21430wrappers-0.5.7>    Compiling miniz_oxide v0.8.91431wrappers-0.5.7>    Compiling ecdsa v0.14.81432wrappers-0.5.7>    Compiling event-listener-strategy v0.5.41433wrappers-0.5.7>    Compiling hyper-rustls v0.24.21434wrappers-0.5.7>    Compiling elliptic-curve v0.13.81435wrappers-0.5.7>    Compiling aws-credential-types v1.2.81436wrappers-0.5.7>    Compiling aws-types v1.3.91437wrappers-0.5.7>    Compiling regex-lite v0.1.81438wrappers-0.5.7>    Compiling mime v0.3.171439wrappers-0.5.7>    Compiling cranelift-srcgen v0.119.11440wrappers-0.5.7>    Compiling fixedbitset v0.4.21441wrappers-0.5.7>    Compiling tiny-keccak v2.0.21442wrappers-0.5.7>    Compiling fixedbitset v0.5.71443wrappers-0.5.7>    Compiling petgraph v0.6.51444wrappers-0.5.7>    Compiling cranelift-assembler-x64-meta v0.119.11445wrappers-0.5.7>    Compiling aws-smithy-http-client v1.1.31446wrappers-0.5.7>    Compiling p256 v0.11.11447wrappers-0.5.7>    Compiling logos-derive v0.14.41448wrappers-0.5.7>    Compiling flate2 v1.1.51449wrappers-0.5.7>    Compiling aws-smithy-observability v0.1.41450wrappers-0.5.7>    Compiling rfc6979 v0.4.01451wrappers-0.5.7>    Compiling sha1 v0.10.61452wrappers-0.5.7>    Compiling itertools v0.11.01453wrappers-0.5.7>    Compiling itertools v0.14.01454wrappers-0.5.7>    Compiling miette-derive v7.6.01455wrappers-0.5.7>    Compiling event-listener v2.5.31456wrappers-0.5.7>    Compiling glob v0.3.31457wrappers-0.5.7>    Compiling unicode-width v0.1.141458wrappers-0.5.7>    Compiling heck v0.4.11459wrappers-0.5.7>    Compiling spin v0.9.81460wrappers-0.5.7>    Compiling bitflags v1.3.21461wrappers-0.5.7>    Compiling pbjson-build v0.6.21462wrappers-0.5.7>    Compiling miette v7.6.01463wrappers-0.5.7>    Compiling clang-sys v1.8.11464wrappers-0.5.7>    Compiling prost-derive v0.13.51465wrappers-0.5.7>    Compiling ecdsa v0.16.91466wrappers-0.5.7>    Compiling aws-smithy-runtime v1.9.31467wrappers-0.5.7>    Compiling logos v0.14.41468wrappers-0.5.7>    Compiling strum_macros v0.26.41469wrappers-0.5.7>    Compiling aws-sigv4 v1.3.51470wrappers-0.5.7>    Compiling phf_generator v0.11.31471wrappers-0.5.7>    Compiling prost-build v0.12.61472wrappers-0.5.7>    Compiling lexical-write-integer v1.0.61473wrappers-0.5.7>    Compiling lexical-parse-integer v1.0.61474wrappers-0.5.7>    Compiling arrow-select v55.2.01475wrappers-0.5.7>    Compiling darling_core v0.21.31476wrappers-0.5.7>    Compiling futures-executor v0.3.311477wrappers-0.5.7>    Compiling bumpalo v3.19.01478wrappers-0.5.7>    Compiling strum v0.26.31479wrappers-0.5.7>    Compiling toml_datetime v0.6.111480wrappers-0.5.7>    Compiling indenter v0.3.41481wrappers-0.5.7>    Compiling winnow v0.5.401482wrappers-0.5.7>    Compiling static_assertions v1.1.01483wrappers-0.5.7>    Compiling winnow v0.7.131484wrappers-0.5.7>    Compiling toml_parser v1.0.41485wrappers-0.5.7>    Compiling toml_edit v0.19.151486wrappers-0.5.7>    Compiling futures v0.3.311487wrappers-0.5.7>    Compiling const-random-macro v0.1.161488wrappers-0.5.7>    Compiling darling_macro v0.21.31489wrappers-0.5.7>    Compiling lexical-parse-float v1.0.61490wrappers-0.5.7>    Compiling lexical-write-float v1.0.61491wrappers-0.5.7>    Compiling phf_codegen v0.11.31492wrappers-0.5.7>    Compiling aws-runtime v1.5.121493wrappers-0.5.7>    Compiling primeorder v0.13.61494wrappers-0.5.7>    Compiling phf v0.11.31495wrappers-0.5.7>    Compiling aws-smithy-json v0.61.61496wrappers-0.5.7>    Compiling parse-zoneinfo v0.3.11497wrappers-0.5.7>    Compiling zstd-sys v2.0.16+zstd.1.5.71498wrappers-0.5.7>    Compiling serde_spanned v1.0.31499wrappers-0.5.7>    Compiling toml_datetime v0.7.31500wrappers-0.5.7>    Compiling cranelift-bitset v0.119.11501wrappers-0.5.7>    Compiling owo-colors v4.2.31502wrappers-0.5.7>    Compiling toml_writer v1.0.41503wrappers-0.5.7>    Compiling minimal-lexical v0.2.11504wrappers-0.5.7>    Compiling iri-string v0.7.81505wrappers-0.5.7>    Compiling is_ci v1.2.01506wrappers-0.5.7>    Compiling leb128fmt v0.1.01507wrappers-0.5.7>    Compiling fastrand v1.9.01508wrappers-0.5.7>    Compiling waker-fn v1.2.01509wrappers-0.5.7>    Compiling cranelift-isle v0.119.11510wrappers-0.5.7>    Compiling pulley-interpreter v32.0.11511wrappers-0.5.7>    Compiling futures-lite v1.13.01512wrappers-0.5.7>    Compiling supports-color v3.0.21513wrappers-0.5.7>    Compiling tower-http v0.6.61514wrappers-0.5.7>    Compiling nom v7.1.31515wrappers-0.5.7>    Compiling toml v0.9.81516wrappers-0.5.7>    Compiling lexical-core v1.0.61517wrappers-0.5.7>    Compiling darling v0.21.31518wrappers-0.5.7>    Compiling protox-parse v0.6.11519wrappers-0.5.7>    Compiling const-random v0.1.181520wrappers-0.5.7>    Compiling proc-macro-crate v1.3.11521wrappers-0.5.7>    Compiling comfy-table v7.1.21522wrappers-0.5.7>    Compiling prost-reflect v0.13.11523wrappers-0.5.7>    Compiling zvariant_utils v1.0.11524wrappers-0.5.7>    Compiling hyper-tls v0.6.01525wrappers-0.5.7>    Compiling darling_core v0.20.111526wrappers-0.5.7>    Compiling libloading v0.8.91527wrappers-0.5.7>    Compiling atoi v2.0.01528wrappers-0.5.7>    Compiling ordered-float v2.10.11529wrappers-0.5.7>    Compiling enumflags2_derive v0.7.121530wrappers-0.5.7>    Compiling num_cpus v1.17.01531wrappers-0.5.7>    Compiling cranelift-codegen-shared v0.119.11532wrappers-0.5.7>    Compiling leb128 v0.2.51533wrappers-0.5.7>    Compiling io-lifetimes v1.0.111534wrappers-0.5.7>    Compiling pulldown-cmark v0.12.21535wrappers-0.5.7>    Compiling arrayvec v0.7.61536wrappers-0.5.7>    Compiling bindgen v0.71.11537wrappers-0.5.7>    Compiling anstyle v1.0.131538wrappers-0.5.7>    Compiling target-lexicon v0.13.31539wrappers-0.5.7>    Compiling annotate-snippets v0.11.51540wrappers-0.5.7>    Compiling cranelift-codegen-meta v0.119.11541wrappers-0.5.7>    Compiling enumflags2 v0.7.121542wrappers-0.5.7>    Compiling arrow-cast v55.2.01543wrappers-0.5.7>    Compiling darling_macro v0.20.111544wrappers-0.5.7>    Compiling reqwest v0.12.241545wrappers-0.5.7>    Compiling protox v0.6.11546wrappers-0.5.7>    Compiling dlv-list v0.5.21547wrappers-0.5.7>    Compiling serde_with_macros v3.15.11548wrappers-0.5.7>    Compiling cargo_toml v0.22.31549wrappers-0.5.7>    Compiling cexpr v0.6.01550wrappers-0.5.7>    Compiling cranelift-entity v0.119.11551wrappers-0.5.7>    Compiling p256 v0.13.21552wrappers-0.5.7>    Compiling pbjson-types v0.6.01553wrappers-0.5.7>    Compiling cranelift-assembler-x64 v0.119.11554wrappers-0.5.7>    Compiling flatbuffers v25.9.231555wrappers-0.5.7>    Compiling crossbeam-epoch v0.9.181556wrappers-0.5.7>    Compiling itertools v0.13.01557wrappers-0.5.7>    Compiling pathsearch v0.2.01558wrappers-0.5.7>    Compiling block-padding v0.3.31559wrappers-0.5.7>    Compiling futures-lite v2.6.11560wrappers-0.5.7>    Compiling polling v2.8.01561wrappers-0.5.7>    Compiling memoffset v0.7.11562wrappers-0.5.7>    Compiling serde_repr v0.1.201563wrappers-0.5.7>    Compiling alloc-no-stdlib v2.0.41564wrappers-0.5.7>    Compiling rustc-hash v2.1.11565wrappers-0.5.7>    Compiling zstd-safe v7.2.41566wrappers-0.5.7>    Compiling rust_decimal v1.39.01567wrappers-0.5.7>    Compiling rustix v0.37.281568wrappers-0.5.7>    Compiling same-file v1.0.61569wrappers-0.5.7>    Compiling hashbrown v0.14.51570wrappers-0.5.7>    Compiling async-task v4.7.11571wrappers-0.5.7>    Compiling getrandom v0.1.161572wrappers-0.5.7>    Compiling ordered-multimap v0.7.31573wrappers-0.5.7>    Compiling walkdir v2.5.01574wrappers-0.5.7>    Compiling alloc-stdlib v0.2.21575wrappers-0.5.7>    Compiling inout v0.1.41576wrappers-0.5.7>    Compiling pgrx-pg-config v0.16.11577wrappers-0.5.7>    Compiling cranelift-codegen v0.119.11578wrappers-0.5.7>    Compiling serde_with v3.15.11579wrappers-0.5.7>    Compiling warg-protobuf v0.7.01580wrappers-0.5.7>    Compiling darling v0.20.111581wrappers-0.5.7>    Compiling zvariant_derive v3.15.21582wrappers-0.5.7>    Compiling prost v0.13.51583wrappers-0.5.7>    Compiling async-lock v2.8.01584wrappers-0.5.7>    Compiling wasmparser v0.121.21585wrappers-0.5.7>    Compiling async-channel v2.5.01586wrappers-0.5.7>    Compiling crc32c v0.6.81587wrappers-0.5.7>    Compiling piper v0.2.41588wrappers-0.5.7>    Compiling crossbeam-channel v0.5.151589wrappers-0.5.7>    Compiling pbjson v0.6.01590wrappers-0.5.7>    Compiling md-5 v0.10.61591wrappers-0.5.7>    Compiling gimli v0.31.11592wrappers-0.5.7>    Compiling wasmtime-math v32.0.11593wrappers-0.5.7>    Compiling secrecy v0.8.01594wrappers-0.5.7>    Compiling core2 v0.4.01595wrappers-0.5.7>    Compiling bigdecimal v0.4.91596wrappers-0.5.7>    Compiling async-fs v1.6.01597wrappers-0.5.7>    Compiling async-io v1.13.01598wrappers-0.5.7>    Compiling linux-raw-sys v0.3.81599wrappers-0.5.7>    Compiling wasmparser v0.228.01600wrappers-0.5.7>    Compiling snap v1.1.11601wrappers-0.5.7>    Compiling portable-atomic v1.11.11602wrappers-0.5.7>    Compiling arbitrary v1.4.21603wrappers-0.5.7>    Compiling rle-decode-fast v1.0.31604wrappers-0.5.7>    Compiling paste v1.0.151605wrappers-0.5.7>    Compiling wasm-encoder v0.240.01606wrappers-0.5.7>    Compiling lexical-core v0.7.61607wrappers-0.5.7>    Compiling unicode-segmentation v1.12.01608wrappers-0.5.7>    Compiling regalloc2 v0.11.21609wrappers-0.5.7>    Compiling convert_case v0.8.01610wrappers-0.5.7>    Compiling libflate_lz77 v2.2.01611wrappers-0.5.7>    Compiling cranelift-control v0.119.11612wrappers-0.5.7>    Compiling warg-crypto v0.7.01613wrappers-0.5.7>    Compiling blocking v1.6.21614wrappers-0.5.7>    Compiling zvariant v3.15.21615wrappers-0.5.7>    Compiling prost-types v0.13.51616wrappers-0.5.7>    Compiling pulldown-cmark-to-cmark v20.0.11617wrappers-0.5.7>    Compiling derive_builder_core v0.20.21618wrappers-0.5.7>    Compiling pgrx-bindgen v0.16.11619wrappers-0.5.7>    Compiling cipher v0.4.41620wrappers-0.5.7>    Compiling petgraph v0.8.31621wrappers-0.5.7>    Compiling brotli-decompressor v5.0.01622wrappers-0.5.7>    Compiling rust-ini v0.21.31623wrappers-0.5.7>    Compiling cranelift-bforest v0.119.11624wrappers-0.5.7>    Compiling threadpool v1.8.11625wrappers-0.5.7>    Compiling arrow-ord v55.2.01626wrappers-0.5.7>    Compiling arrow-string v55.2.01627wrappers-0.5.7>    Compiling petgraph v0.7.11628wrappers-0.5.7>    Compiling mime_guess v2.0.51629wrappers-0.5.7>    Compiling arrow-arith v55.2.01630wrappers-0.5.7>    Compiling xattr v1.6.11631wrappers-0.5.7>    Compiling rustls-pemfile v2.2.01632wrappers-0.5.7>    Compiling strum_macros v0.27.21633wrappers-0.5.7>    Compiling rand_core v0.9.31634wrappers-0.5.7>    Compiling filetime v0.2.261635wrappers-0.5.7>    Compiling quick-xml v0.37.51636wrappers-0.5.7>    Compiling cee-scape v0.2.01637wrappers-0.5.7>    Compiling indexmap v1.9.31638wrappers-0.5.7>    Compiling nom v5.1.31639wrappers-0.5.7>    Compiling pin-project-internal v1.1.101640wrappers-0.5.7>    Compiling typed-builder-macro v0.19.11641wrappers-0.5.7>    Compiling socket2 v0.4.101642wrappers-0.5.7>    Compiling dary_heap v0.3.81643wrappers-0.5.7>    Compiling object v0.36.71644wrappers-0.5.7>    Compiling integer-encoding v3.0.41645wrappers-0.5.7>    Compiling wasm-encoder v0.228.01646wrappers-0.5.7>    Compiling home v0.5.121647wrappers-0.5.7>    Compiling simdutf8 v0.1.51648wrappers-0.5.7>    Compiling moka v0.12.111649wrappers-0.5.7>    Compiling adler32 v1.2.01650wrappers-0.5.7>    Compiling radium v0.7.01651wrappers-0.5.7>    Compiling compression-core v0.4.291652wrappers-0.5.7>    Compiling arrayvec v0.5.21653wrappers-0.5.7>    Compiling xmlparser v0.13.61654wrappers-0.5.7>    Compiling twox-hash v2.1.21655wrappers-0.5.7>    Compiling unescape v0.1.01656wrappers-0.5.7>    Compiling utf8parse v0.2.21657wrappers-0.5.7>    Compiling num-bigint-dig v0.8.41658wrappers-0.5.7>    Compiling anstyle-parse v0.2.71659wrappers-0.5.7>    Compiling pgrx-sql-entity-graph v0.16.11660wrappers-0.5.7>    Compiling aws-smithy-xml v0.60.111661wrappers-0.5.7>    Compiling lz4_flex v0.11.51662wrappers-0.5.7>    Compiling compression-codecs v0.4.311663wrappers-0.5.7>    Compiling libflate v2.2.01664wrappers-0.5.7>    Compiling reqsign v0.16.51665wrappers-0.5.7>    Compiling thrift v0.17.01666wrappers-0.5.7>    Compiling typed-builder v0.19.11667wrappers-0.5.7>    Compiling pin-project v1.1.101668wrappers-0.5.7>    Compiling tar v0.4.441669wrappers-0.5.7>    Compiling strum v0.27.21670wrappers-0.5.7>    Compiling rand_chacha v0.9.01671wrappers-0.5.7>    Compiling prost-build v0.13.51672wrappers-0.5.7>    Compiling rand_core v0.5.11673wrappers-0.5.7>    Compiling brotli v8.0.21674wrappers-0.5.7>    Compiling nix v0.26.41675wrappers-0.5.7>    Compiling pgrx-pg-sys v0.16.11676wrappers-0.5.7>    Compiling arrow-ipc v55.2.01677wrappers-0.5.7>    Compiling derive_builder_macro v0.20.21678wrappers-0.5.7>    Compiling zstd v0.13.31679wrappers-0.5.7>    Compiling zbus_names v2.6.11680wrappers-0.5.7>    Compiling async-executor v1.13.31681wrappers-0.5.7>    Compiling zbus_macros v3.15.21682wrappers-0.5.7>    Compiling chrono-tz-build v0.2.11683wrappers-0.5.7>    Compiling cobs v0.3.01684wrappers-0.5.7>    Compiling async-broadcast v0.5.11685wrappers-0.5.7>    Compiling derivative v2.2.01686wrappers-0.5.7>    Compiling async-lock v3.4.11687wrappers-0.5.7>    Compiling backon v1.6.01688wrappers-0.5.7>    Compiling bzip2-sys v0.1.13+1.0.81689wrappers-0.5.7>    Compiling lzma-sys v0.1.201690wrappers-0.5.7>    Compiling bitmaps v2.1.01691wrappers-0.5.7>    Compiling num-traits v0.1.431692wrappers-0.5.7>    Compiling ordered-stream v0.2.01693wrappers-0.5.7>    Compiling quick-xml v0.38.31694wrappers-0.5.7>    Compiling lz4-sys v1.11.1+lz4-1.10.01695wrappers-0.5.7>    Compiling im-rc v15.1.01696wrappers-0.5.7>    Compiling typed-builder-macro v0.20.11697wrappers-0.5.7>    Compiling async-recursion v1.1.11698wrappers-0.5.7>    Compiling wasmtime-versioned-export-macros v32.0.11699wrappers-0.5.7>    Compiling serde_bytes v0.11.191700wrappers-0.5.7>    Compiling xdg-home v1.3.01701wrappers-0.5.7>    Compiling hashbrown v0.12.31702wrappers-0.5.7>    Compiling seq-macro v0.3.61703wrappers-0.5.7>    Compiling tap v1.0.11704wrappers-0.5.7>    Compiling anstyle-query v1.1.41705wrappers-0.5.7>    Compiling colorchoice v1.0.41706wrappers-0.5.7>    Compiling is_terminal_polyfill v1.70.21707wrappers-0.5.7>    Compiling id-arena v2.2.11708wrappers-0.5.7>    Compiling urlencoding v2.1.31709wrappers-0.5.7>    Compiling dissimilar v1.0.101710wrappers-0.5.7>    Compiling crc-catalog v2.4.01711wrappers-0.5.7>    Compiling unicode-xid v0.2.61712wrappers-0.5.7>    Compiling tagptr v0.2.01713wrappers-0.5.7>    Compiling termcolor v1.4.11714wrappers-0.5.7>    Compiling linked-hash-map v0.5.61715wrappers-0.5.7>    Compiling serde v0.8.231716wrappers-0.5.7>    Compiling bytemuck v1.24.01717wrappers-0.5.7>    Compiling seahash v4.1.01718wrappers-0.5.7>    Compiling serde-hjson v0.9.11719wrappers-0.5.7>    Compiling roaring v0.10.121720wrappers-0.5.7>    Compiling anstream v0.6.211721wrappers-0.5.7>    Compiling yaml-rust v0.4.51722wrappers-0.5.7>    Compiling wasmprinter v0.228.01723wrappers-0.5.7>    Compiling wit-parser v0.228.01724wrappers-0.5.7>    Compiling expect-test v1.5.11725wrappers-0.5.7>    Compiling crc v3.3.01726wrappers-0.5.7>    Compiling aws-smithy-query v0.60.81727wrappers-0.5.7>    Compiling parquet v55.2.01728wrappers-0.5.7>    Compiling wyz v0.5.11729wrappers-0.5.7>    Compiling apache-avro v0.17.01730wrappers-0.5.7>    Compiling zbus v3.15.21731wrappers-0.5.7>    Compiling typed-builder v0.20.11732wrappers-0.5.7>    Compiling opendal v0.54.1