nixbot

builds

cancelled checks.aarch64-linux.psql_17 build #473 · raw · eval 14 ms · 685.9 KiB allocated · ·

1these 333 derivations will be built:2  /nix/store/0f5pzsjk75ly0y0s40zfnnqfhx4s1q8a-vector-0.7.0.drv3  /nix/store/0z269aqlj6wp74wx7ypqpzxnmn93sa5l-vector-0.8.0.drv4  /nix/store/140k8r00jrq7xm8prgybddiygv6y0myn-vector-0.6.2.drv5  /nix/store/1wc4a57d8m7763d1jcfkn303m8ghyc0x-vector-0.7.4.drv6  /nix/store/95l3xg1ym6cfxngl2bsl0p0734r5xqc6-vector-0.4.0.drv7  /nix/store/asrym2b7yfhyy87fk0lnpvjfhhcc7cnc-vector-0.8.2.drv8  /nix/store/gh6pr0kp8y1lpb0vyzx4665jn0nrkbnc-vector-0.5.1.drv9  /nix/store/q20ycljk94izdvymf6z375m5a978vk5r-vector-0.6.0.drv10  /nix/store/00a351w2k8wd2l61bac5wg50qa2hm4ai-vector.drv11  /nix/store/08q581ngf8fx9v62wa4aq8glcsy37vby-pgtap-1.3.3.drv12  /nix/store/0b70ch8iwvqnkj155y23a8h7z400l16p-wrappers-0.5.5.drv13  /nix/store/1csyswpxgzzcag63281b3r27i9hdg7ah-safeupdate-1.4.drv14  /nix/store/0bmxfmf46m1r9w1q5wjl1xzi9r1qgirr-safeupdate.drv15  /nix/store/9qbbl3p7wsh5iwdd0i1h377h1yfxmrnv-pgaudit-17.0.drv16  /nix/store/l7hi6y6xyq3l68bwzn23gaqyl4n49vh5-pgaudit-17.1.drv17  /nix/store/0l3z4sjlwvcpzd3va4pvdkcnrk4a6yy8-pgaudit.drv18  /nix/store/0m5cns76lj96dm62z2v5ql10fixdv8mj-rum-1.3.drv19  /nix/store/0qxnj9sgg8pvaksv11lb8ln5va31cr19-pg_net-0.19.5.drv20  /nix/store/0vhnhv1n5jxdxy2w1hmdx1920b193x71-hypopg.drv21  /nix/store/ww3lr1f9yndzli35jbdb4jwjhwr0xf4c-http-1.6.1.drv22  /nix/store/0x83lnqlq23i6r05cwgqacz1sl49alls-http.drv23  /nix/store/0y65h6h65q03gl3f1rp1n8xhf9sm8gv0-plan_filter-0.1.drv24  /nix/store/ayylscr3rnv7b8jy573xavslwjm34xs9-pg_repack-1.4.8.drv25  /nix/store/cq3zf8jvw7zr6j79aw564kg4pxlg867b-pg_repack-1.5.2.drv26  /nix/store/cw8ra9zgx6ayvfhrhyadxfxcamyvsf28-pg_repack-1.5.0.drv27  /nix/store/lzmdgd9l5f5mwja1z9p5bnmik9ys5y6w-pg_repack-1.5.1.drv28  /nix/store/0zh9s9wzhk71bsx6ccilskmggziyapg0-pg_repack.drv29  /nix/store/2nmbfmbwc4r46n5rn3fwvf4vhxv75s5c-pg_net-0.14.0.drv30  /nix/store/5mhpaw68bks5sq6951xgyqxwjd8xmxfr-pg_net-0.20.4.drv31  /nix/store/6j3j8z0x0vpvcf74xp7p8ffjby8b7mp5-pg_net-0.7.1.drv32  /nix/store/9hcgh425487agi7v1yayivzsm8ivl63p-pg_net-0.8.0.drv33  /nix/store/b8nk9jbsbrp1c3hj20f91b2fanydpffb-pg_net-0.11.0.drv34  /nix/store/gs3bfrd6w8j2sfwpxlvmbvb23r9wayrq-pg_net-0.20.0.drv35  /nix/store/n27q4jzly9s78m7fcbc1h37gg65qc323-pg_net-0.2.drv36  /nix/store/n58pcf9bsll99r6q9l5xf50x8m96aak3-pg_net-0.20.3.drv37  /nix/store/pmsb2cipa3sh5b1x9spv779xvc86ngxl-pg_net-0.7.drv38  /nix/store/rdk6gks8iag5485lr0xsw5j2yd3kpfxh-pg_net-0.13.0.drv39  /nix/store/rvy95m7q01mivcqyd9jmgk1gnvchnmfa-pg_net-0.6.drv40  /nix/store/15x2ylh2r836kylraz00gar8r64z9c3v-pg_net.drv41  /nix/store/1825w5xw6bcknsyx4q8dg88h75k4dq36-pg_graphql-1.5.11.drv42  /nix/store/1bqw77gimsw66f829hpgj9kaaahr4c7g-pg_net-0.19.5.drv43  /nix/store/1ihmwiy45rq4b1q45hw9s8pqz6fhcd73-pg_net-0.20.4.drv44  /nix/store/1rd6xhwknbkvzb45ilzj5kwpzk9qgswd-pg_stat_monitor.drv45  /nix/store/1v40zf8d32al19dn5vcc7f495l3kizph-pgsodium-3.1.7.drv46  /nix/store/26fn0rb3qzxawci6lpsi0rvkhlarm5mw-pg_graphql-1.6.1.drv47  /nix/store/i4bvf139s4nqq5yamskvd2sfygkb7r2k-wal2json-2.6.drv48  /nix/store/2r99g6gmckbndmgkw98973paxahqzq8m-wal2json.drv49  /nix/store/34w595ii74k9ppmp32xyvvny84d39fsw-pg_partman.drv50  /nix/store/7qhs8rqz8knar5ifs37ykzf05a0cv9rv-pg_repack-1.4.8.drv51  /nix/store/gn5yzpcf5idlnszdamlwbx3rbym6malx-pg_repack-1.5.0.drv52  /nix/store/i84kdpgpsm2j9754nnclgli4wxaiyig2-pg_repack-1.5.2.drv53  /nix/store/nljyfikjf5clwah60mjp8m3g0ha68x8c-pg_repack-1.5.1.drv54  /nix/store/3wrrr0m5rl3v1jlvv45mcjc3cij9nhwg-pg_repack.drv55  /nix/store/41ibpqvx5lwdrx1gwrqfakkf39j4pjq1-pgaudit-17.0.drv56  /nix/store/gqwnscrk1fsz3h1avfb46sk68amz6li1-pgaudit-17.1.drv57  /nix/store/617sgsfb1kg2wwhv7xd11pjbdp08wvc4-pgaudit.drv58  /nix/store/4flmjbrnrzwd3dj4wqgwichbdj3gm9vg-pgroonga-3.2.5.drv59  /nix/store/cpvvl9hggasr03685wxkllbj9y06zfih-pgroonga.drv60  /nix/store/d0jzfq6zy19wzl9kkfqkm6zr1mbj1j11-pgmq-1.5.1.drv61  /nix/store/d55x9w0jd2ibiirmyk8hayyg9xv7pl4s-pgmq.drv62  /nix/store/di7w3jzyj5wi4xq4k1sikj269nm165dk-supautils.drv63  /nix/store/3ra23mgj1jkgphixmzf7zkniprr8m1v7-wrappers-0.5.3.drv64  /nix/store/a71dcdl4iv0s4pdi3nc95vdxpqwgymz4-wrappers-0.5.0.drv65  /nix/store/al9zb9hrs5d3qhl7shpmz1yisaxam4wi-wrappers-0.6.3.drv66  /nix/store/fwy32lzzw8464lgwlfcjgazid27fy0b3-wrappers-0.6.2.drv67  /nix/store/g462mkwai8ngjkwcw7k2qiiwbamjpj2w-wrappers-0.5.4.drv68  /nix/store/jsza7phkrfyi7rbl8liym55dvrzb8fzz-wrappers-0.4.4.drv69  /nix/store/nsdbbzm3d5yjrnnsas26qgxc817y41r2-wrappers-0.4.6.drv70  /nix/store/p9rsvpqr2yi8qki844y50z0nf9aqr408-wrappers-0.5.6.drv71  /nix/store/rbkdj2w2jznvc5xv0c3d2qmzz0dglagf-wrappers-0.5.7.drv72  /nix/store/wbys69cj2n7n4yq5ym7l7b8z66fvkkfq-wrappers-0.6.1.drv73  /nix/store/zi5xbr6jpdy7b3x3slhi5477ngrfv95s-wrappers-0.4.5.drv74  /nix/store/zj2d4614hmbns41qw2pz982kbzialvyv-wrappers-0.6.0.drv75  /nix/store/fc6n41k2w3wbdbl5l6mn0hqvwm0kcpfg-wrappers.drv76  /nix/store/7lycdzfnvgkw1f7lna5s8c1njsgah1hq-pg_tle-1.0.4.drv77  /nix/store/83lnjslzha8b2a10izi9cr1p6cgk1wfm-pg_tle-1.4.0.drv78  /nix/store/y8cw2d463r1lw5r4ml9jfda6ayz8ilk6-pg_tle-1.3.0.drv79  /nix/store/fcfb8xbl5kvx3m6icj6ncxk1bnkmmvxr-pg_tle.drv80  /nix/store/fbwjcxn85q138dkds5hkfj1b1ya3r5j2-pg_hashids-1.3.0-cd0e1b31d52b394a0df64079406a14a4f7387cd6.drv81  /nix/store/jn7fznj63vd9g2aqfl7xfipmh0c67gdn-pg_hashids.drv82  /nix/store/7zp57l5f9k6fyx8c2jgbmb3xs6rixcd4-pgrouting-3.4.1.drv83  /nix/store/jvb65k2k3rbimz0phb6mpp3jvzamky34-pgrouting.drv84  /nix/store/3ig5q2gzy2slavmiszby2zhdbc1fl51w-vector-0.8.0.drv85  /nix/store/4qd0mrrxj10cys1ia7qyhfykiig1l3g3-vector-0.7.4.drv86  /nix/store/8kijw5d8mxlmnirmywrihf297y8zv1ys-vector-0.5.1.drv87  /nix/store/bcig0ch6nx8c9v49470amjh5lh0mb7fs-vector-0.6.2.drv88  /nix/store/bx8i72mqp6dx8m7wkdvp7jfyc0vldbn3-vector-0.7.0.drv89  /nix/store/gsr1iv3zisa8pm2nyib4abqy7qn4kia0-vector-0.6.0.drv90  /nix/store/igbfxbpkpj708sllvfv7cni5dvlqp1zi-vector-0.8.2.drv91  /nix/store/kgc8r6gxk7mwrj7v250xqjxgasmgfq39-vector.drv92  /nix/store/5fhpy9zjwqq7ddpik2bxkf2w0dpyswp2-pg_net-0.20.3.drv93  /nix/store/adh4mcpp5xpvccs1lb9h2yxsxnsx1yki-pg_net-0.14.0.drv94  /nix/store/aj6g6xamdg369wpqfwyd70z3i1qnfdqq-pg_net-0.11.0.drv95  /nix/store/idn2icvvirzwp2wv92fp1xm1w0rfz28p-pg_net-0.19.5.drv96  /nix/store/s4zrcj6vh69fk10vrni21s240rgikah0-pg_net-0.20.0.drv97  /nix/store/yf2bi43b51ga6m8q3mhcb0rvacb0qw9s-pg_net-0.13.0.drv98  /nix/store/kvs292wck9hlpzy1yl7bh9j9w5hg7dbw-pg_net.drv99  /nix/store/x1nagg4mf8qh475y5npjqycz6rg413fd-safeupdate-1.4.drv100  /nix/store/l9xb7zxch6hwhp309ikdp19r37i245m9-safeupdate.drv101  /nix/store/8nq5kffdbw07v8bvalc93gy4jh9yl012-supabase_vault-0.3.1.drv102  /nix/store/ix4p0pamicpal8pzmf6gh6vvdvjk3q2m-supabase_vault-0.2.8.drv103  /nix/store/lgdxj8jfg7gjzka1mm5q0vr6hq8mbm83-supabase_vault.drv104  /nix/store/b969bk5wq13fd7gx3nssbqi3nykmxqc7-pg_cron-1.6.4.drv105  /nix/store/lq44ynk7kmbwnvfl7adlmpz9bdlmk1yg-pg_cron.drv106  /nix/store/9aj3kjr4xsfzj152ds53g1f6v9s4zhzk-pgsodium-3.0.4.drv107  /nix/store/i5gbk2dkga52y12nifmgw4yai5s0vjp3-pgsodium-3.1.8.drv108  /nix/store/w6lpmp7a1raizb2rbl817rwy73j9v81w-pgsodium-3.1.5.drv109  /nix/store/zxciqwidzr9a32ga5zvsk9k288ik84lb-pgsodium-3.1.6.drv110  /nix/store/p4p4bbpp28h6hj0a6kk3s5kjhz1j97is-pgsodium.drv111  /nix/store/3lnsfq42g59dcv6izyrkm2gngm74p2cs-pg_graphql-1.6.1.drv112  /nix/store/61mvnpi4a66dffaphz77pymqyxij3m2z-pg_graphql-1.5.9.drv113  /nix/store/s76s3s72y8srwfdnkbzng326n2zilc4i-pg_graphql-1.6.2.drv114  /nix/store/pdbh8xq7fp4wwx79pgb22dwkh6spwnsh-pg_graphql.drv115  /nix/store/phyxfqmnc31py5a14b53q3wiiav32ldl-plan_filter.drv116  /nix/store/pp8p5ph74pd3bf8afvp5nn3msvqybf7p-plpgsql_check-2.7.drv117  /nix/store/qmxp5zj9iq03hrchykmqdnarm9rhyn12-plpgsql_check-2.8.drv118  /nix/store/pw797x71ggpb0mpnbx2xdg0n9anrgmxb-plpgsql_check.drv119  /nix/store/gamh0pnvb0bjz17p9i80rb8rvdvzb1kv-pgtap-1.3.3.drv120  /nix/store/k9ks00ccwblb86rzfl0xs8ml78nzl9ph-pgtap-1.3.1.drv121  /nix/store/qmq0jk586xdwxbcw2h5imrs4jkn6fwfg-pgtap.drv122  /nix/store/khbaryz92a9p43isj0ffvyqpas6a5asv-sfcgal-2.2.0.drv123  /nix/store/yzjmajka8ainv2rs9hr4b5nsnrbz8647-gdal-3.8.5.drv124  /nix/store/mcgccpm3blzlkfrdv994hyxz1h23m0df-postgis-3.3.7.drv125  /nix/store/rr37ihfdyyp412bb8r795397m4b8plqz-postgis.drv126  /nix/store/vhg6ghpirk2wddxi5a4g4qd0lcvk0p97-rum.drv127  /nix/store/fh3wjmw2iqabi3ph2vnckix0ns8y22kf-pg_jsonschema-0.3.3.drv128  /nix/store/xh9j8wvdlk1376dw8vv3dzvv7wrng9qj-pg_jsonschema.drv129  /nix/store/rl5c2d3qsm2ays55vdgfjv401b18y5qy-index_advisor-0.2.0.drv130  /nix/store/sy4iy1inmn39iv88fh2vvjzvq8m3vxkb-index_advisor-0.2.1.drv131  /nix/store/zzcwq74h6271fs0f0icwklh1kn1ldyr2-index_advisor.drv132  /nix/store/90552xhrcnnsf3agdz2v68gfxs92qfza-postgresql-and-plugins-17.11.drv133  /nix/store/94a9ir29mhwfz32f9pxapxi3p1pmnrqc-receipt.drv134  /nix/store/274vlsv715gpqpwl4llbx72fpgz5n14g-postgresql-and-plugins-17.11.drv135  /nix/store/4aisqki8njs0zq654vfkqmqzh4wbp7ik-pg_repack-1.5.2.drv136  /nix/store/4as5ixpyb6x7g5px1asmyy1qpfqnlpjz-pg_repack-1.4.8.drv137  /nix/store/ld03dq33rx5laq5qm2dfi0hp3g7hh5cy-pg_repack-1.5.1.drv138  /nix/store/snm0dxhxqmmgq9c03gqhmrafngb6y9rz-pg_repack-1.5.0.drv139  /nix/store/2bffnv3kpqb0ds37awxn31id57wbnfww-pg_repack.drv140  /nix/store/2d97540fv1lpdpivdzphhy8am2dyr8r4-pg_graphql-1.2.3.drv141  /nix/store/vcrgvyc2b3jdd6p98dydnpsdlmai6mpd-pgmq-1.5.1.drv142  /nix/store/2x8sr5sknccg4n323ipk8a1pg73lvvi7-pgmq.drv143  /nix/store/75l9jfbjnp69lc9mcwf4j3zas5723chv-vector-0.7.4.drv144  /nix/store/gipwzai2smrmdhwsi9505ppncc4zm57d-vector-0.8.2.drv145  /nix/store/gw4c6w7kwjsswxvkygk3jfrj5s3qjwp9-vector-0.5.1.drv146  /nix/store/h7jpn72v4bwp2pm1zpv55mb94wfmyj8c-vector-0.6.2.drv147  /nix/store/r7296bf6s0hlvf6k6kz81ng3admk19y7-vector-0.8.0.drv148  /nix/store/rsdbh6ys9jjfhfr04bg169jdly24cvsq-vector-0.6.0.drv149  /nix/store/z6aryaxgd01s3csz3pg904g22a9hw3sl-vector-0.7.0.drv150  /nix/store/2yvqixdhzdr3dzvfg32dy0zclmn7ryg6-vector.drv151  /nix/store/487l8bxzd9r33nq5skgxdk7zcspl3cnr-pg_partman.drv152  /nix/store/9704wcydniirzcxl7ll7ci5mkphn49vg-pgrouting-3.4.1.drv153  /nix/store/7zd796d6i7g9jxgz202yw7wzwwqm0xbs-pgrouting.drv154  /nix/store/f9mc0bplrplvfsbanvgp7nz93lqk6j6s-http-1.6.1.drv155  /nix/store/8zmg1yajhqyhr59qc52afc27sn9xamza-http.drv156  /nix/store/vvv1d3w15mgambbb6qscdjb74gg6ayn6-pg_jsonschema-0.3.3.drv157  /nix/store/b25cdmcmamk34wxy8mzybc014khpb1b0-pg_jsonschema.drv158  /nix/store/cz6hmpzzi2cjrl8gj9w0xa6z9y507f8b-plpgsql_check-2.8.drv159  /nix/store/z1x46azyys6zij15vg5iqllm0sagqny1-plpgsql_check-2.7.drv160  /nix/store/bsrcjjdd8b3x6d0y6ihcr9xpxig2hvg9-plpgsql_check.drv161  /nix/store/dplk4s5apvvz4971q1q1m4y51djkfm5x-pg_tle-1.3.0.drv162  /nix/store/l83vxccsaw64g3j0ss4ykjxf34wdjccp-pg_tle-1.4.0.drv163  /nix/store/bx18r50hmm16y4d5ssy72ghd61a7g8wr-pg_tle.drv164  /nix/store/4vlh1x1x3zsnl2rhadkw211dsjc6hzpa-pgtap-1.3.3.drv165  /nix/store/h7rd17i7f96dn0dwimj5dmikwz5m61qx-pgtap.drv166  /nix/store/9n2d04gq5l0985p9203b74gxj94qwqmx-gdal-3.8.5.drv167  /nix/store/ba7h61cwss8j5wxmkam96qqay9s2hn6p-postgis-3.3.7.drv168  /nix/store/ipsgs1l5vflyv185q7vnvan30m0lwhlw-postgis.drv169  /nix/store/nbx721l1sslrmcgl6jylp0fd4q66z4fx-pgroonga-3.2.5.drv170  /nix/store/ivwjjb86w84sfpwqkh9jid0j3rrcqkyh-pgroonga.drv171  /nix/store/70a99c51n78cfwcjb3lngqsj9ja5bpki-plan_filter-0.1.drv172  /nix/store/k2w7q47azl2fj1z1171gxy9jp737r033-plan_filter.drv173  /nix/store/khfhym4c19mncms93kh6lpd39696wb9n-supautils.drv174  /nix/store/kj0nlh6274lwff18mavjbn1jbxscbm9n-hypopg.drv175  /nix/store/kpx5pd9dd3gwbkihghpki2ql7xsrg1gn-pg_stat_monitor-2.1.drv176  /nix/store/n7x3apbqi8b3m6h6qfgismnz9bf64vlw-pg_stat_monitor.drv177  /nix/store/k7mk7qm3n65cnv2srxi1gsq3jgk25r66-pg_hashids-1.2.1.drv178  /nix/store/wldajgac1n6fv74bshfrz42jmbnxlbp0-pg_hashids-1.3.0-cd0e1b31d52b394a0df64079406a14a4f7387cd6.drv179  /nix/store/nrfcw9vgmvdkidh7111a36rg3w7z9h01-pg_hashids.drv180  /nix/store/fgdcm9higmw7ck1msnzcs4p4vir4a5dc-index_advisor-0.2.0.drv181  /nix/store/j1k1yh41g9ch0g3gf8n38hx61iw9rs5k-index_advisor-0.2.1.drv182  /nix/store/nsycjsaa5pmc6qjc4r946w9pxkf56zzp-index_advisor.drv183  /nix/store/2g7vgzxilw1jrqvk2nww87l24i8vk9vh-pg_net-0.20.4.drv184  /nix/store/3mkvaj0lc4v67fqm59s9wr9hwm96nw9i-pg_net-0.20.0.drv185  /nix/store/9aj9m31w0h7hcmnbx1fqd9mxwrl5s032-pg_net-0.14.0.drv186  /nix/store/c9xviq5dbvilsrxfvslac23vl0as7v92-pg_net-0.20.3.drv187  /nix/store/hrn5qdnhv0rg4w1pfa6v2s9vvy3080wi-pg_net-0.13.0.drv188  /nix/store/x8jxs7agbcvam007ylcrk766l7fgazhi-pg_net-0.11.0.drv189  /nix/store/p35j8v78nfl29idwgryfglw2v3bgz23a-pg_net.drv190  /nix/store/532l8m1dinlkszwsnxp2hpkzwr4dr28y-pgsodium-3.1.5.drv191  /nix/store/75r64nj0181nzpg27s0313skc3mx131d-pgsodium-3.1.7.drv192  /nix/store/g0dk6x8l9gx4w1819qqvl9prfbsh0hgj-pgsodium-3.0.4.drv193  /nix/store/r5hp5f9c95dkrndhshzr0dahkh24rg3s-pgsodium-3.1.8.drv194  /nix/store/wpc1ifwmcccqlvdv1h53n1hxlxiplnvi-pgsodium-3.1.6.drv195  /nix/store/qsk74cca9wjx5ycndn8693p3dy3q4z0l-pgsodium.drv196  /nix/store/mdd0pfpi2f85x21gwpzi39qvbjnhmb7x-safeupdate-1.4.drv197  /nix/store/qyrrixcnp2yzmh40p2zggfm94glf3x7c-safeupdate.drv198  /nix/store/37xdkyaqphcf3i6dpxcp8smxn8hy9vl4-wrappers-0.5.4.drv199  /nix/store/84q99xbv6apn51c071wp9qg6mfjfh2q2-wrappers-0.6.3.drv200  /nix/store/94ryxzpyr22il8f2r1qkz68a46y1lbr6-wrappers-0.5.5.drv201  /nix/store/952jv6j7mhgdl8kqs2mn0hhqh11441zm-wrappers-0.5.7.drv202  /nix/store/gavzcx5iy39h881gh7gpnmn1d17jmkv1-wrappers-0.4.6.drv203  /nix/store/hg97zp6nhihsyd3fpirlsqasaq0zn0yl-wrappers-0.5.6.drv204  /nix/store/mb0yvdyb04f03g5naiix5n91zwj4y47m-wrappers-0.4.5.drv205  /nix/store/mwglp67vwpr2h4g05v2g02mc7900x8wx-wrappers-0.6.0.drv206  /nix/store/nr8birdqgagjjskmsfgkxlb6nkphc62f-wrappers-0.4.4.drv207  /nix/store/pc21nynd9x3zm74mpdnhvhkzyfi0zsq2-wrappers-0.5.3.drv208  /nix/store/vivfb7i24njkf3d8zvp6ykkr50s4axg5-wrappers-0.6.2.drv209  /nix/store/w0mk2x2jviysijn6yw82g02dmi6f787j-wrappers-0.5.0.drv210  /nix/store/w52n2n970pxzgai4pwh1kzl3ik9lxwxh-wrappers-0.6.1.drv211  /nix/store/s0psr9aqch7zss333q8p0y1kpica6b5z-wrappers.drv212  /nix/store/vsqdadm69v4w8yb0fggryzvb87z70y6g-rum-1.3.drv213  /nix/store/s2ilv35s7h13kcf9azskpxhgw1ivhf8i-rum.drv214  /nix/store/kyvlc6436f3y1x4026nryjvlpm8xzd1s-supabase_vault-0.2.8.drv215  /nix/store/l5p7gbxxcczv5lwqnyql8awzk2878pdi-supabase_vault-0.3.1.drv216  /nix/store/sw5wvsvc9j6wa8wwnisz0pm2y8z96lvm-supabase_vault.drv217  /nix/store/63hyl8xsljb5f5xkcj9ijm0gnahrm1xj-pg_graphql-1.6.1.drv218  /nix/store/b9dmsdagjh34saxi45wgawgq389csdyi-pg_graphql-1.5.11.drv219  /nix/store/c2zk9rycmw0vwa3qq1pyplnh513fkq9j-pg_graphql-1.5.9.drv220  /nix/store/w0bpwzz5zdfm8qnhwz483r3slpilmb0x-pg_graphql-1.6.2.drv221  /nix/store/v28ahsirc4vmfn1l07kihqgjph3lrj4m-pg_graphql.drv222  /nix/store/8ang9rmqys1aclwfhiisk2754znkm80j-wal2json-2.6.drv223  /nix/store/ykkdshr554q95a76ym6nfaqp2grj9wfb-wal2json.drv224  /nix/store/mxwlby61q216yh9wcyllplwig6pkrq4p-pg_cron-1.6.4.drv225  /nix/store/zdgxm3yzl3rc46xjhngzmznzazw0yz47-pg_cron.drv226  /nix/store/8rkq0v0vzd8qxj9hxs92krannjx3wp14-postgresql-and-plugins-17_22.drv227  /nix/store/agk970fwy2pw0skxp73jk3g83z766h5b-receipt.drv228  /nix/store/2qhy0xjz2dnxg8xdlcgbjaczrwfqhqsn-postgresql-and-plugins-17_22.drv229  /nix/store/7rqv622yy14bn825jwj32n7lhbcvs16a-pgmq-1.5.1.drv230  /nix/store/ydshamqx75gbawn4839946c91fm5alf7-pgmq-1.4.4.drv231  /nix/store/3f6k95m95wdg530hab7f0ngc3ar2zdjf-pgmq.drv232  /nix/store/a1zw6badsj7lgfj8mqmjgmnc68h7d8ni-supabase_vault-0.3.1.drv233  /nix/store/vy7aannkny9c9pfw6dazd3vc7311zf37-supabase_vault-0.2.8.drv234  /nix/store/3izndgbsw5399ixbgb7nkw13r0sl4qaw-supabase_vault.drv235  /nix/store/iyqgynqsv64k0b3hr6i9cvwp4qbxqcd5-index_advisor-0.2.0.drv236  /nix/store/mfix33qj69lhgb2bvr1j62xcdp1h1y4c-hypopg.drv237  /nix/store/zxajzalkdm0rv11mvd0hiy2qr8sfw8rl-index_advisor-0.2.1.drv238  /nix/store/5ynhxa9wdzb913f1q808gavswplsdwl9-index_advisor.drv239  /nix/store/3j3p0qwydls7hpdxmbrcsxps2vz6jbfn-timescaledb-2.9.1.drv240  /nix/store/nd5k960wh12rpxcxr07h1mvqkm5ix8h5-timescaledb-2.16.1.drv241  /nix/store/6xllrrwdmkiyf76ynhcij4qbbldmh71d-timescaledb.drv242  /nix/store/4dy6capyaxx9jiw2hnh62i8d899zvbl7-pg_jsonschema-0.3.1.drv243  /nix/store/mbhrh171hpvkid8lyawpisf1nizqx5ix-pg_jsonschema-0.2.0.drv244  /nix/store/mf581vfc3rays5n33yifqg8wsdyc7xqn-pg_jsonschema-0.3.3.drv245  /nix/store/9a7a0bmdxpajkl7kmyf6pq6wj03kq2ib-pg_jsonschema.drv246  /nix/store/b67h42v24f8q0qbair995ybn3px7fr6k-pgrouting-3.4.1.drv247  /nix/store/9vym4yi5inj4rrl74m47lbxs2712pfm3-pgrouting.drv248  /nix/store/gbp83irwcnykdjpfxsjk182xznmiddjq-plpgsql_check-2.7.drv249  /nix/store/n5ghj3gi3w0gavymiarnsxi5sg5w8cfb-plpgsql_check-2.2.drv250  /nix/store/ylkf1hkzyiah1gkxknnd94z72j4grb6g-plpgsql_check-2.8.drv251  /nix/store/a62giqbh1z7xjy4bf6bqf1v06bwb19dn-plpgsql_check.drv252  /nix/store/bfqnks8xwkan5n18b2cswrmn4zlrs7dw-supautils.drv253  /nix/store/2iwlyh3a087d6md5grmwdivmp9k7pi5x-wrappers-0.4.2.drv254  /nix/store/54c61xamz0agmbkpq968r93qly3fwm7q-wrappers-0.5.3.drv255  /nix/store/5m3nn42qqsazch0knlsfsjk1dw6djzj4-wrappers-0.6.1.drv256  /nix/store/7553w2rln4dj9nlc38vd5fs47lgg3s08-wrappers-0.5.5.drv257  /nix/store/7ph8kw32w5m73l9a3v44mbp9mfxg6d8j-wrappers-0.4.5.drv258  /nix/store/cjwl8n3gpyfqmq4az906qncljlgmcp6d-wrappers-0.6.3.drv259  /nix/store/dj4z29qgd138hzqkls9sfnbdr17zcsc5-wrappers-0.6.0.drv260  /nix/store/fxbk433nnvzhaj2pml7asvh2zr0nc8q6-wrappers-0.4.3.drv261  /nix/store/h2b5c91pdy91a8jkhnkdqvsgm67pd4vx-wrappers-0.5.7.drv262  /nix/store/hg7gkclsf3kx46r64mm9m3dnsilnx9w8-wrappers-0.6.2.drv263  /nix/store/hxchhwq08wvp1yvcmsgx6d7ylh489cz5-wrappers-0.3.0.drv264  /nix/store/jj6kipi10p2l7kwja706kfy3zakh3yv7-wrappers-0.5.0.drv265  /nix/store/kya2awmbbzfjb51wwps36h9sv4h2wm3i-wrappers-0.4.6.drv266  /nix/store/nkmm23lcwh0v6v7x8ja0k0x47whvb92h-wrappers-0.5.4.drv267  /nix/store/qcaqqjzk1achv1zq8yrgx7zqnaq5mikl-wrappers-0.5.6.drv268  /nix/store/w0bw3gynjlmrzqc8xpgy1371ssl2ada2-wrappers-0.4.4.drv269  /nix/store/yqljly15yz1jlghvrahb42zavk2si5fp-wrappers-0.4.1.drv270  /nix/store/cm4ichkr1v3ksqfszvqpa08hjsgbjq56-wrappers.drv271  /nix/store/xpa5s1m4sw7w7faln7cggjv5ysg3ghc6-plan_filter-0.1.drv272  /nix/store/f76w7hkdj29qvj3c6fmahn46qc53cq1k-plan_filter.drv273  /nix/store/fs27zx1ly6ywxagh4vr0d239wxyf651q-pgtap.drv274  /nix/store/a50ky6hkds7pwp82kgm70j8pf9f3f4xm-pg_cron-1.5.2.drv275  /nix/store/isjw82mxvhs9sw30dh7mq44whp7hgr5w-pg_cron-1.6.4.drv276  /nix/store/hwn4k8izpb3xw6f2wi4nlnahmvb3bxzh-pg_cron.drv277  /nix/store/xi9yfl6p5mmgjfj2zv2qc14z668yk2f7-wal2json-2.6.drv278  /nix/store/jbr4aikfg14920d88j5mm4g6qgk8i23f-wal2json.drv279  /nix/store/pbmzq25by7fg0df56r901zz16w0xvpiz-pg_stat_monitor-2.1.drv280  /nix/store/jrrwpv2291afz3688c5rjiwsjlwg15mv-pg_stat_monitor.drv281  /nix/store/2z6acyjswb75mgpalfgxd1f54d0yrx00-plv8-3.1.5.drv282  /nix/store/ikyw1h0ls2j6fryx71yis05nirwbm6cp-plv8-3.1.10.drv283  /nix/store/lgqsnf165p7zbawa6xskmhzmp50zy4xr-plv8-3.1.4.drv284  /nix/store/jwqaj0bkc43h74x9aghhk58k24gbc8dd-plv8.drv285  /nix/store/bxqdc2m723vsr1p81pvqj4k4zy20mc1l-pg_tle-1.3.0.drv286  /nix/store/pyfrmdskarsk92in9a4pr31kz8gw43gv-pg_tle-1.0.4.drv287  /nix/store/v2xb010kwcfxdk90cz21yf1m4h6sqj7l-pg_tle-1.4.0.drv288  /nix/store/lhvwsvmv7gpzr9n30xd486j9m8v34hvk-pg_tle.drv289  /nix/store/a4m1lflk6vjw0lzdcpb1gbf0bmcfqrv0-pg_hashids-1.2.1.drv290  /nix/store/qpwlqdcvdbzr6pd7q3rwkdq4hisipbqq-pg_hashids-1.3.0-cd0e1b31d52b394a0df64079406a14a4f7387cd6.drv291  /nix/store/mgma5yd04lqb71b1x8q8absvvjib6ayv-pg_hashids.drv292  /nix/store/2rq7ss3x1rfdljra4pnv6qryp4hndym8-rum-1.3.drv293  /nix/store/mvswxgb3q1swkkh16yi0yarw56gqrm00-rum.drv294  /nix/store/l5lq63gk5bp7j4lrc73lh8vwl8zpyism-pgaudit-1.7.1.drv295  /nix/store/mv3i0cbzpapid9bgfrnyg5yjlixjdc0r-pgaudit-1.7.0.drv296  /nix/store/s2cikfjvjq2m137lkrk0py2x5vpq6jny-pgaudit.drv297  /nix/store/zs4jhmljjjqlziakcw6misqgla085g93-http-1.6.1.drv298  /nix/store/wjslhyw34hv6i5grih3j3sbb62q6zr9a-http.drv299  /nix/store/5j6b9h5d66cbvy2bspsdynapmifryys2-pgsodium-3.1.7.drv300  /nix/store/6kpm9wiza85lwn3zygnnhhiwcx0jwc03-pgsodium-3.1.5.drv301  /nix/store/gkhcj9h87qg9q5rg5y1ly2d8sl71jj3v-pgsodium-3.0.4.drv302  /nix/store/rjlqx38lhgj70l65ly405q8mw8vaxvad-pgsodium-3.1.8.drv303  /nix/store/x98girz0pj5bxyxri9d0sabi5s0hpwl0-pgsodium-3.1.6.drv304  /nix/store/xzfbz414rlcnlfp43mbr7cwmgqw6dd0x-pgsodium.drv305  /nix/store/y0r8wl6xdnl4jqkngg6m2av9ml9mmhqs-pg_partman.drv306  /nix/store/wmahr2aakhg9718j8qjsk8dgxhqxycpb-gdal-3.8.5.drv307  /nix/store/m3vbcrddsbypghx41llhs3fw3dxzyh6l-postgis-3.3.2.drv308  /nix/store/ybqij8lx2nad5957wl7ifssgfvi7bg4f-postgis.drv309  /nix/store/s1ibllsfjmz3kvcgfcv4cd31gvq98r9b-pgroonga-3.2.5.drv310  /nix/store/w0d5frbwa5dd26dr5r3azrj6s358i4g0-pgroonga-3.0.7.drv311  /nix/store/zhpgxwrcm88brf5lpmw0bw40r5875qhr-pgroonga.drv312  /nix/store/325yf3yfi8jx2ndmpa95c4n06xisghdk-pg_graphql-1.0.2.drv313  /nix/store/4c051z9bv4diia0jv8mwf0pqa32rn086-pg_graphql-1.5.1.drv314  /nix/store/95b1rzgciqh5xy8inalxq7370hn2f2m8-pg_graphql-1.1.0.drv315  /nix/store/9f94yvgw5hrz2jjzagd543lykidi76w5-pg_graphql-1.4.2.drv316  /nix/store/a496hwlnv3r89dkv60fmmwbff5i3zqc7-pg_graphql-1.5.11.drv317  /nix/store/bqap5yqr48aznl3j1h5k2yhvc99d9c33-pg_graphql-1.5.7.drv318  /nix/store/d3cd2aihrx4q64wgsy0a7pxbsrgzcmh8-pg_graphql-1.4.4.drv319  /nix/store/fhmf2803z73lv6ryzq1427gyk0098k16-pg_graphql-1.2.0.drv320  /nix/store/fzkqqymhxyrwzcgg3lvq18yn2j5mf9im-pg_graphql-1.5.1-mergeless.drv321  /nix/store/mp5hrhajad9d1lrli35zybq5klawxb48-pg_graphql-1.4.1.drv322  /nix/store/p0gbqi8bspd8xh2gk8dvfjphn624pyh3-pg_graphql-1.2.2.drv323  /nix/store/v7sa7kywvzvxis2c7b76w4jc0arcbp0m-pg_graphql-1.5.6.drv324  /nix/store/ybg01jvqbvnpgrazcnnhyfrgalk9mvyz-pg_graphql-1.6.2.drv325  /nix/store/yda6awhhivif3n8jn8arql4k0glg560m-pg_graphql-1.5.4.drv326  /nix/store/ykzk834jbir2cayjcnrr4m5wiam80kr8-pg_graphql-1.5.0.drv327  /nix/store/zj90anjy23060h6p64ycs0ldx4wpja5z-pg_graphql-1.5.9.drv328  /nix/store/zv2isif0w19crf4rq24mqq2f282x1cl6-pg_graphql.drv329  /nix/store/aicf8lxqn9gbjzjismqhmil6hss9pjzv-postgresql-and-plugins-15.19.drv330  /nix/store/c861x06gw6mchb269icdg1zgax79gs79-receipt.drv331  /nix/store/9mfbc7x1y40li9wy8bkgzd236b7cas43-postgresql-and-plugins-15.19.drv332  /nix/store/7f8i8fnp9gbbxpks3gczhisj0ivq3f9q-start-postgres-server-test.drv333  /nix/store/mxchrs6j73sb9a70xp3cndqhnzcn65qq-postgres-17-check-harness.drv334  /nix/store/2dk56xdqb3x2i66xj89pfi9mzl6g3g6f-run-check-harness-psql-17.drv335building '/nix/store/5ynhxa9wdzb913f1q808gavswplsdwl9-index_advisor.drv' on 'ssh-ng://nixbot-remote-build@78.232.36.247'336building '/nix/store/5ynhxa9wdzb913f1q808gavswplsdwl9-index_advisor.drv'337index_advisor> structuredAttrs is enabled338index_advisor> created 19 symlinks in user environment339building '/nix/store/bqap5yqr48aznl3j1h5k2yhvc99d9c33-pg_graphql-1.5.7.drv' on 'ssh-ng://nixbot-remote-build@78.232.36.247'340building '/nix/store/bqap5yqr48aznl3j1h5k2yhvc99d9c33-pg_graphql-1.5.7.drv'341pg_graphql-1.5.7> Running phase: unpackPhase342pg_graphql-1.5.7> unpacking source archive /nix/store/xa9wvdjyx82vx6s8k5ld2n6qwbscg9sq-source343pg_graphql-1.5.7> source root is source344pg_graphql-1.5.7> Executing cargoSetupPostUnpackHook345pg_graphql-1.5.7> Finished cargoSetupPostUnpackHook346pg_graphql-1.5.7> Running phase: patchPhase347pg_graphql-1.5.7> Executing cargoSetupPostPatchHook348pg_graphql-1.5.7> Validating consistency between /build/source/Cargo.lock and /build/cargo-vendor-dir/Cargo.lock349pg_graphql-1.5.7> Finished cargoSetupPostPatchHook350pg_graphql-1.5.7> Running phase: updateAutotoolsGnuConfigScriptsPhase351pg_graphql-1.5.7> Running phase: configurePhase352pg_graphql-1.5.7> Running phase: buildPhase353pg_graphql-1.5.7> Executing cargo-pgrx buildPhase354pg_graphql-1.5.7>    Validating /nix/store/bc9327c6474vwmqmhkszkmiz86mba73s-postgresql-15.19/bin/pg_config355pg_graphql-1.5.7>  Initializing data directory at /build/tmp.yShOd6KhwP/data-15356pg_graphql-1.5.7> waiting for server to start....2026-10-27 12:45:02.724 GMT [87] LOG:  starting PostgreSQL 15.19 on aarch64-unknown-linux-gnu, compiled by gcc (GCC) 15.3.0, 64-bit357pg_graphql-1.5.7> 2026-10-27 12:45:02.727 GMT [87] LOG:  listening on Unix socket "/build/tmp.wrrJuuQ1Rj/.s.PGSQL.5432"358pg_graphql-1.5.7> 2026-10-27 12:45:02.735 GMT [90] LOG:  database system was shut down at 2026-10-27 12:45:02 GMT359pg_graphql-1.5.7> 2026-10-27 12:45:02.741 GMT [87] LOG:  database system is ready to accept connections360pg_graphql-1.5.7>  done361pg_graphql-1.5.7> server started362pg_graphql-1.5.7> createuser: error: connection to server at "localhost" (127.0.0.1), port 5432 failed: Connection refused363pg_graphql-1.5.7> 	Is the server running on that host and accepting TCP/IP connections?364pg_graphql-1.5.7> waiting for server to shut down....2026-10-27 12:45:02.811 GMT [87] LOG:  received fast shutdown request365pg_graphql-1.5.7> 2026-10-27 12:45:02.813 GMT [87] LOG:  aborting any active transactions366pg_graphql-1.5.7> 2026-10-27 12:45:02.817 GMT [87] LOG:  background worker "logical replication launcher" (PID 93) exited with exit code 1367pg_graphql-1.5.7> 2026-10-27 12:45:02.822 GMT [88] LOG:  shutting down368pg_graphql-1.5.7> 2026-10-27 12:45:02.831 GMT [88] LOG:  checkpoint starting: shutdown immediate369pg_graphql-1.5.7> 2026-10-27 12:45:02.947 GMT [88] LOG:  checkpoint complete: wrote 3 buffers (0.0%); 0 WAL file(s) added, 0 removed, 0 recycled; write=0.045 s, sync=0.013 s, total=0.125 s; sync files=2, longest=0.008 s, average=0.007 s; distance=0 kB, estimate=0 kB370pg_graphql-1.5.7> 2026-10-27 12:45:02.953 GMT [87] LOG:  database system is shut down371pg_graphql-1.5.7>  done372pg_graphql-1.5.7> server stopped373pg_graphql-1.5.7> warning: `/build/source/.cargo/config` is deprecated in favor of `config.toml`374pg_graphql-1.5.7> note: if you need to support cargo 1.38 or earlier, you can symlink `config` to `config.toml`375pg_graphql-1.5.7>        Using PgConfig("pg15") and `pg_config` from /nix/store/bc9327c6474vwmqmhkszkmiz86mba73s-postgresql-15.19/bin/pg_config376pg_graphql-1.5.7>     Building extension with features  pg15377pg_graphql-1.5.7>      Running command "/nix/store/q54i6bawc9nl2yxwqid82dglaajzg265-rust-default-1.85.1/bin/cargo" "build" "--release" "--features" " pg15" "--no-default-features" "--message-format=json-render-diagnostics" "--frozen" "-j" "2"378pg_graphql-1.5.7> warning: `/build/source/.cargo/config` is deprecated in favor of `config.toml`379pg_graphql-1.5.7> note: if you need to support cargo 1.38 or earlier, you can symlink `config` to `config.toml`380pg_graphql-1.5.7>    Compiling proc-macro2 v1.0.79381pg_graphql-1.5.7>    Compiling unicode-ident v1.0.12382pg_graphql-1.5.7>    Compiling libc v0.2.153383pg_graphql-1.5.7>    Compiling syn v1.0.109384pg_graphql-1.5.7>    Compiling thiserror v1.0.58385pg_graphql-1.5.7>    Compiling quote v1.0.36386pg_graphql-1.5.7>    Compiling syn v2.0.58387pg_graphql-1.5.7>    Compiling memchr v2.7.2388pg_graphql-1.5.7>    Compiling serde v1.0.197389pg_graphql-1.5.7>    Compiling eyre v0.6.12390pg_graphql-1.5.7>    Compiling hashbrown v0.14.3391pg_graphql-1.5.7>    Compiling equivalent v1.0.1392pg_graphql-1.5.7>    Compiling indexmap v2.2.6393pg_graphql-1.5.7>    Compiling serde_derive v1.0.197394pg_graphql-1.5.7>    Compiling thiserror-impl v1.0.58395pg_graphql-1.5.7>    Compiling tinyvec_macros v0.1.1396pg_graphql-1.5.7>    Compiling glob v0.3.1397pg_graphql-1.5.7>    Compiling cfg-if v1.0.0398pg_graphql-1.5.7>    Compiling serde_json v1.0.115399pg_graphql-1.5.7>    Compiling clang-sys v1.7.0400pg_graphql-1.5.7>    Compiling tinyvec v1.6.0401pg_graphql-1.5.7>    Compiling serde_spanned v0.6.5402pg_graphql-1.5.7>    Compiling toml_datetime v0.6.5403pg_graphql-1.5.7>    Compiling ucd-trie v0.1.6404pg_graphql-1.5.7>    Compiling winnow v0.6.5405pg_graphql-1.5.7>    Compiling anyhow v1.0.82406pg_graphql-1.5.7>    Compiling once_cell v1.19.0407pg_graphql-1.5.7>    Compiling indenter v0.3.3408pg_graphql-1.5.7>    Compiling pest v2.7.9409pg_graphql-1.5.7>    Compiling toml_edit v0.22.9410pg_graphql-1.5.7>    Compiling unicode-normalization v0.1.23411pg_graphql-1.5.7>    Compiling regex-syntax v0.8.3412pg_graphql-1.5.7>    Compiling unicode-bidi v0.3.15413pg_graphql-1.5.7>    Compiling option-ext v0.2.0414pg_graphql-1.5.7>    Compiling minimal-lexical v0.2.1415pg_graphql-1.5.7>    Compiling semver v1.0.22416pg_graphql-1.5.7>    Compiling percent-encoding v2.3.1417pg_graphql-1.5.7>    Compiling nom v7.1.3418pg_graphql-1.5.7>    Compiling form_urlencoded v1.2.1419pg_graphql-1.5.7>    Compiling idna v0.5.0420pg_graphql-1.5.7>    Compiling dirs-sys v0.4.1421pg_graphql-1.5.7>    Compiling libloading v0.8.3422pg_graphql-1.5.7>    Compiling regex-automata v0.4.6423pg_graphql-1.5.7>    Compiling toml v0.8.12424pg_graphql-1.5.7>    Compiling semver-parser v0.10.2425pg_graphql-1.5.7>    Compiling either v1.10.0426pg_graphql-1.5.7>    Compiling ryu v1.0.17427pg_graphql-1.5.7>    Compiling bindgen v0.69.4428pg_graphql-1.5.7>    Compiling itoa v1.0.11429pg_graphql-1.5.7>    Compiling itertools v0.12.1430pg_graphql-1.5.7>    Compiling pathsearch v0.2.0431pg_graphql-1.5.7>    Compiling semver v0.11.0432pg_graphql-1.5.7>    Compiling regex v1.10.4433pg_graphql-1.5.7>    Compiling cargo_toml v0.16.3434pg_graphql-1.5.7>    Compiling cexpr v0.6.0435pg_graphql-1.5.7>    Compiling dirs v5.0.1436pg_graphql-1.5.7>    Compiling url v2.5.0437pg_graphql-1.5.7>    Compiling getrandom v0.2.14438pg_graphql-1.5.7>    Compiling lazycell v1.3.0439pg_graphql-1.5.7>    Compiling byteorder v1.5.0440pg_graphql-1.5.7>    Compiling bitflags v2.5.0441pg_graphql-1.5.7>    Compiling fixedbitset v0.4.2442pg_graphql-1.5.7>    Compiling autocfg v1.2.0443pg_graphql-1.5.7>    Compiling owo-colors v3.5.0444pg_graphql-1.5.7>    Compiling ident_case v1.0.1445pg_graphql-1.5.7>    Compiling unicode-segmentation v1.11.0446pg_graphql-1.5.7>    Compiling rustc-hash v1.1.0447pg_graphql-1.5.7>    Compiling fnv v1.0.7448pg_graphql-1.5.7>    Compiling shlex v1.3.0449pg_graphql-1.5.7>    Compiling strsim v0.10.0450pg_graphql-1.5.7>    Compiling same-file v1.0.6451pg_graphql-1.5.7>    Compiling lazy_static v1.4.0452pg_graphql-1.5.7>    Compiling walkdir v2.5.0453pg_graphql-1.5.7>    Compiling darling_core v0.14.4454pg_graphql-1.5.7>    Compiling pgrx-pg-config v0.11.3455pg_graphql-1.5.7>    Compiling convert_case v0.6.0456pg_graphql-1.5.7>    Compiling memoffset v0.9.1457pg_graphql-1.5.7>    Compiling petgraph v0.6.4458pg_graphql-1.5.7>    Compiling rustc_version v0.4.0459pg_graphql-1.5.7>    Compiling rustc_version v0.3.3460pg_graphql-1.5.7>    Compiling unescape v0.1.0461pg_graphql-1.5.7>    Compiling radium v0.7.0462pg_graphql-1.5.7>    Compiling pgrx-sql-entity-graph v0.11.3463pg_graphql-1.5.7>    Compiling atomic-traits v0.3.0464pg_graphql-1.5.7>    Compiling pgrx-pg-sys v0.11.3465pg_graphql-1.5.7>    Compiling heapless v0.7.17466pg_graphql-1.5.7>    Compiling darling_macro v0.14.4467pg_graphql-1.5.7>    Compiling void v1.0.2468pg_graphql-1.5.7>    Compiling tap v1.0.1469pg_graphql-1.5.7>    Compiling wyz v0.5.1470pg_graphql-1.5.7>    Compiling unreachable v1.0.0471pg_graphql-1.5.7>    Compiling darling v0.14.4472pg_graphql-1.5.7>    Compiling pgrx-macros v0.11.3473pg_graphql-1.5.7>    Compiling hash32 v0.2.1474pg_graphql-1.5.7>    Compiling rand_core v0.6.4475pg_graphql-1.5.7>    Compiling enum-map-derive v0.17.0476pg_graphql-1.5.7>    Compiling half v1.8.3477pg_graphql-1.5.7>    Compiling sptr v0.3.2478pg_graphql-1.5.7>    Compiling ppv-lite86 v0.2.17479pg_graphql-1.5.7>    Compiling stable_deref_trait v1.2.0480pg_graphql-1.5.7>    Compiling ascii v0.9.3481pg_graphql-1.5.7>    Compiling funty v2.0.0482pg_graphql-1.5.7>    Compiling bitvec v1.0.1483pg_graphql-1.5.7>    Compiling combine v3.8.1484pg_graphql-1.5.7>    Compiling rand_chacha v0.3.1485pg_graphql-1.5.7>    Compiling serde_cbor v0.11.2486pg_graphql-1.5.7>    Compiling enum-map v2.7.3487pg_graphql-1.5.7>    Compiling cached_proc_macro v0.18.1488pg_graphql-1.5.7>    Compiling uuid v1.8.0489pg_graphql-1.5.7>    Compiling instant v0.1.12490pg_graphql-1.5.7>    Compiling seahash v4.1.0491pg_graphql-1.5.7>    Compiling cached_proc_macro_types v0.1.1492pg_graphql-1.5.7>    Compiling seq-macro v0.3.5493pg_graphql-1.5.7>    Compiling cached v0.46.1494pg_graphql-1.5.7>    Compiling rand v0.8.5495pg_graphql-1.5.7>    Compiling graphql-parser v0.4.0496pg_graphql-1.5.7>    Compiling pgrx v0.11.3497pg_graphql-1.5.7>    Compiling itertools v0.10.5498pg_graphql-1.5.7>    Compiling bimap v0.6.3499pg_graphql-1.5.7>    Compiling base64 v0.13.1500pg_graphql-1.5.7>    Compiling pg_graphql v1.5.7 (/build/source)501pg_graphql-1.5.7> warning: unexpected `cfg` condition value: `pg11`502pg_graphql-1.5.7>   --> src/lib.rs:18:1503pg_graphql-1.5.7>    |504pg_graphql-1.5.7> 18 | pg_module_magic!();505pg_graphql-1.5.7>    | ^^^^^^^^^^^^^^^^^^506pg_graphql-1.5.7>    |507pg_graphql-1.5.7>    = note: expected values for `feature` are: `default`, `pg14`, `pg15`, `pg16`, and `pg_test`508pg_graphql-1.5.7>    = note: using a cfg inside a macro will use the cfgs from the destination crate and not the ones from the defining crate509pg_graphql-1.5.7>    = help: try referring to `$crate::pg_magic_func` crate for guidance on how handle this unexpected cfg510pg_graphql-1.5.7>    = help: the macro `$crate::pg_magic_func` may come from an old version of the `pgrx` crate, try updating your dependency with `cargo update -p pgrx`511pg_graphql-1.5.7>    = note: see <https://doc.rust-lang.org/nightly/rustc/check-cfg/cargo-specifics.html> for more information about checking conditional configuration512pg_graphql-1.5.7>    = note: `#[warn(unexpected_cfgs)]` on by default513pg_graphql-1.5.7>    = note: this warning originates in the macro `$crate::pg_magic_func` which comes from the expansion of the macro `pg_module_magic` (in Nightly builds, run with -Z macro-backtrace for more info)514pg_graphql-1.5.7> 515pg_graphql-1.5.7> warning: unexpected `cfg` condition value: `pg12`516pg_graphql-1.5.7>   --> src/lib.rs:18:1517pg_graphql-1.5.7>    |518pg_graphql-1.5.7> 18 | pg_module_magic!();519pg_graphql-1.5.7>    | ^^^^^^^^^^^^^^^^^^520pg_graphql-1.5.7>    |521pg_graphql-1.5.7>    = note: expected values for `feature` are: `default`, `pg14`, `pg15`, `pg16`, and `pg_test`522pg_graphql-1.5.7>    = note: using a cfg inside a macro will use the cfgs from the destination crate and not the ones from the defining crate523pg_graphql-1.5.7>    = help: try referring to `$crate::pg_magic_func` crate for guidance on how handle this unexpected cfg524pg_graphql-1.5.7>    = help: the macro `$crate::pg_magic_func` may come from an old version of the `pgrx` crate, try updating your dependency with `cargo update -p pgrx`525pg_graphql-1.5.7>    = note: see <https://doc.rust-lang.org/nightly/rustc/check-cfg/cargo-specifics.html> for more information about checking conditional configuration526pg_graphql-1.5.7>    = note: this warning originates in the macro `$crate::pg_magic_func` which comes from the expansion of the macro `pg_module_magic` (in Nightly builds, run with -Z macro-backtrace for more info)527pg_graphql-1.5.7> 528pg_graphql-1.5.7> warning: unexpected `cfg` condition value: `pg13`529pg_graphql-1.5.7>   --> src/lib.rs:18:1530pg_graphql-1.5.7>    |531pg_graphql-1.5.7> 18 | pg_module_magic!();532pg_graphql-1.5.7>    | ^^^^^^^^^^^^^^^^^^533pg_graphql-1.5.7>    |534pg_graphql-1.5.7>    = note: expected values for `feature` are: `default`, `pg14`, `pg15`, `pg16`, and `pg_test`535pg_graphql-1.5.7>    = note: using a cfg inside a macro will use the cfgs from the destination crate and not the ones from the defining crate536pg_graphql-1.5.7>    = help: try referring to `$crate::pg_magic_func` crate for guidance on how handle this unexpected cfg537pg_graphql-1.5.7>    = help: the macro `$crate::pg_magic_func` may come from an old version of the `pgrx` crate, try updating your dependency with `cargo update -p pgrx`538pg_graphql-1.5.7>    = note: see <https://doc.rust-lang.org/nightly/rustc/check-cfg/cargo-specifics.html> for more information about checking conditional configuration539pg_graphql-1.5.7>    = note: this warning originates in the macro `$crate::pg_magic_func` which comes from the expansion of the macro `pg_module_magic` (in Nightly builds, run with -Z macro-backtrace for more info)540pg_graphql-1.5.7> 541pg_graphql-1.5.7> warning: field `alias` is never read542pg_graphql-1.5.7>   --> src/builder.rs:15:9543pg_graphql-1.5.7>    |544pg_graphql-1.5.7> 14 | pub struct InsertBuilder {545pg_graphql-1.5.7>    |            ------------- field in this struct546pg_graphql-1.5.7> 15 |     pub alias: String,547pg_graphql-1.5.7>    |         ^^^^^548pg_graphql-1.5.7>    |549pg_graphql-1.5.7>    = note: `InsertBuilder` has derived impls for the traits `Debug` and `Clone`, but these are intentionally ignored during dead code analysis550pg_graphql-1.5.7>    = note: `#[warn(dead_code)]` on by default551pg_graphql-1.5.7> 552pg_graphql-1.5.7> warning: field `alias` is never read553pg_graphql-1.5.7>    --> src/builder.rs:338:9554pg_graphql-1.5.7>     |555pg_graphql-1.5.7> 337 | pub struct UpdateBuilder {556pg_graphql-1.5.7>     |            ------------- field in this struct557pg_graphql-1.5.7> 338 |     pub alias: String,558pg_graphql-1.5.7>     |         ^^^^^559pg_graphql-1.5.7>     |560pg_graphql-1.5.7>     = note: `UpdateBuilder` has derived impls for the traits `Debug` and `Clone`, but these are intentionally ignored during dead code analysis561pg_graphql-1.5.7> 562pg_graphql-1.5.7> warning: field `alias` is never read563pg_graphql-1.5.7>    --> src/builder.rs:510:9564pg_graphql-1.5.7>     |565pg_graphql-1.5.7> 509 | pub struct DeleteBuilder {566pg_graphql-1.5.7>     |            ------------- field in this struct567pg_graphql-1.5.7> 510 |     pub alias: String,568pg_graphql-1.5.7>     |         ^^^^^569pg_graphql-1.5.7>     |570pg_graphql-1.5.7>     = note: `DeleteBuilder` has derived impls for the traits `Debug` and `Clone`, but these are intentionally ignored during dead code analysis571pg_graphql-1.5.7> 572pg_graphql-1.5.7> warning: field `alias` is never read573pg_graphql-1.5.7>    --> src/builder.rs:612:9574pg_graphql-1.5.7>     |575pg_graphql-1.5.7> 611 | pub struct FunctionCallBuilder {576pg_graphql-1.5.7>     |            ------------------- field in this struct577pg_graphql-1.5.7> 612 |     pub alias: String,578pg_graphql-1.5.7>     |         ^^^^^579pg_graphql-1.5.7> 580pg_graphql-1.5.7> warning: field `schema` is never read581pg_graphql-1.5.7>     --> src/builder.rs:1980:9582pg_graphql-1.5.7>      |583pg_graphql-1.5.7> 1979 | pub struct __SchemaBuilder {584pg_graphql-1.5.7>      |            --------------- field in this struct585pg_graphql-1.5.7> 1980 |     pub schema: __Schema,586pg_graphql-1.5.7>      |         ^^^^^^587pg_graphql-1.5.7>      |588pg_graphql-1.5.7>      = note: `__SchemaBuilder` has a derived impl for the trait `Clone`, but this is intentionally ignored during dead code analysis589pg_graphql-1.5.7> 590pg_graphql-1.5.7> warning: method `arg_map` is never used591pg_graphql-1.5.7>    --> src/graphql.rs:349:8592pg_graphql-1.5.7>     |593pg_graphql-1.5.7> 325 | pub trait ___Field {594pg_graphql-1.5.7>     |           -------- method in this trait595pg_graphql-1.5.7> ...596pg_graphql-1.5.7> 349 |     fn arg_map(&self) -> HashMap<String, __InputValue> {597pg_graphql-1.5.7>     |        ^^^^^^^598pg_graphql-1.5.7> 599pg_graphql-1.5.7> warning: `pg_graphql` (lib) generated 9 warnings600pg_graphql-1.5.7>     Finished `release` profile [optimized] target(s) in 6m 49s601pg_graphql-1.5.7>   Installing extension602pg_graphql-1.5.7>      Copying control file to /nix/store/wi2ag7mkw2qx7w6lg3xy8v48i7h3p8xq-pg_graphql-1.5.7/nix/store/bc9327c6474vwmqmhkszkmiz86mba73s-postgresql-15.19/share/postgresql/extension/pg_graphql.control603pg_graphql-1.5.7>      Copying shared library to /nix/store/wi2ag7mkw2qx7w6lg3xy8v48i7h3p8xq-pg_graphql-1.5.7/nix/store/bs8w2qsyhnqirvhchz9fnvf86y7j6xyf-postgresql-15.19-lib/lib/pg_graphql.so604pg_graphql-1.5.7>  Discovering SQL entities605building '/nix/store/c2zk9rycmw0vwa3qq1pyplnh513fkq9j-pg_graphql-1.5.9.drv' on 'ssh-ng://nixbot-remote-build@78.232.36.247'606pg_graphql-1.5.7>   Discovered 5 SQL entities: 0 schemas (0 unique), 1 functions, 0 types, 0 enums, 4 sqls, 0 ords, 0 hashes, 0 aggregates, 0 triggers607pg_graphql-1.5.7>      Writing SQL entities to /nix/store/wi2ag7mkw2qx7w6lg3xy8v48i7h3p8xq-pg_graphql-1.5.7/nix/store/bc9327c6474vwmqmhkszkmiz86mba73s-postgresql-15.19/share/postgresql/extension/pg_graphql--1.5.7.sql608pg_graphql-1.5.7>     Finished installing pg_graphql609pg_graphql-1.5.7> buildPhase completed in 7 minutes 4 seconds610pg_graphql-1.5.7> Running phase: checkPhase611pg_graphql-1.5.7>    Validating /nix/store/bc9327c6474vwmqmhkszkmiz86mba73s-postgresql-15.19/bin/pg_config612pg_graphql-1.5.7>  Initializing data directory at /build/tmp.cZ1nRLrVzC/data-15613building '/nix/store/c2zk9rycmw0vwa3qq1pyplnh513fkq9j-pg_graphql-1.5.9.drv'614pg_graphql-1.5.9> Running phase: unpackPhase615pg_graphql-1.5.9> unpacking source archive /nix/store/35k52w6qmay5vi6qhfy8cpfz0bwldvr5-source616pg_graphql-1.5.9> source root is source617pg_graphql-1.5.9> Executing cargoSetupPostUnpackHook618pg_graphql-1.5.7> waiting for server to start....2026-10-27 12:52:06.451 GMT [2426] LOG:  starting PostgreSQL 15.19 on aarch64-unknown-linux-gnu, compiled by gcc (GCC) 15.3.0, 64-bit619pg_graphql-1.5.7> 2026-10-27 12:52:06.459 GMT [2426] LOG:  listening on Unix socket "/build/tmp.Vgeq7bbIOh/.s.PGSQL.5432"620pg_graphql-1.5.7> 2026-10-27 12:52:06.469 GMT [2429] LOG:  database system was shut down at 2026-10-27 12:52:06 GMT621pg_graphql-1.5.7> 2026-10-27 12:52:06.476 GMT [2426] LOG:  database system is ready to accept connections622pg_graphql-1.5.7>  done623pg_graphql-1.5.7> server started624pg_graphql-1.5.7> createuser: error: connection to server at "localhost" (127.0.0.1), port 5432 failed: Connection refused625pg_graphql-1.5.7> 	Is the server running on that host and accepting TCP/IP connections?626pg_graphql-1.5.7> waiting for server to shut down....2026-10-27 12:52:06.526 GMT [2426] LOG:  received fast shutdown request627pg_graphql-1.5.7> 2026-10-27 12:52:06.535 GMT [2426] LOG:  aborting any active transactions628pg_graphql-1.5.7> 2026-10-27 12:52:06.537 GMT [2426] LOG:  background worker "logical replication launcher" (PID 2432) exited with exit code 1629pg_graphql-1.5.7> 2026-10-27 12:52:06.539 GMT [2427] LOG:  shutting down630pg_graphql-1.5.7> 2026-10-27 12:52:06.543 GMT [2427] LOG:  checkpoint starting: shutdown immediate631pg_graphql-1.5.7> 2026-10-27 12:52:06.569 GMT [2427] LOG:  checkpoint complete: wrote 3 buffers (0.0%); 0 WAL file(s) added, 0 removed, 0 recycled; write=0.010 s, sync=0.002 s, total=0.030 s; sync files=2, longest=0.002 s, average=0.001 s; distance=0 kB, estimate=0 kB632pg_graphql-1.5.7> 2026-10-27 12:52:06.575 GMT [2426] LOG:  database system is shut down633pg_graphql-1.5.7>  done634pg_graphql-1.5.7> server stopped635pg_graphql-1.5.7> warning: `/build/source/.cargo/config` is deprecated in favor of `config.toml`636pg_graphql-1.5.7> note: if you need to support cargo 1.38 or earlier, you can symlink `config` to `config.toml`637pg_graphql-1.5.7>    Validating /build/tmp.MYl0csIydo/15/bin/pg_config638pg_graphql-1.5.7>  Initializing data directory at /build/tmp.MYl0csIydo/data-15639pg_graphql-1.5.9> Finished cargoSetupPostUnpackHook640pg_graphql-1.5.9> Running phase: patchPhase641pg_graphql-1.5.9> Executing cargoSetupPostPatchHook642pg_graphql-1.5.9> Validating consistency between /build/source/Cargo.lock and /build/cargo-vendor-dir/Cargo.lock643pg_graphql-1.5.9> Finished cargoSetupPostPatchHook644pg_graphql-1.5.9> Running phase: updateAutotoolsGnuConfigScriptsPhase645pg_graphql-1.5.9> Running phase: configurePhase646pg_graphql-1.5.9> Running phase: buildPhase647pg_graphql-1.5.9> Executing cargo-pgrx buildPhase648pg_graphql-1.5.9>    Validating /nix/store/pmaflmk45425rq04ajcb4yhm58w6hq3p-postgresql-17_22/bin/pg_config649pg_graphql-1.5.9>  Initializing data directory at /build/tmp.xylhde9QnC/data-17650pg_graphql-1.5.7> warning: `/build/source/.cargo/config` is deprecated in favor of `config.toml`651pg_graphql-1.5.7> note: if you need to support cargo 1.38 or earlier, you can symlink `config` to `config.toml`652pg_graphql-1.5.7>        Using PgConfig("pg15") and `pg_config` from /build/tmp.MYl0csIydo/15/bin/pg_config653pg_graphql-1.5.7>     Building extension with features pg15654pg_graphql-1.5.7>      Running command "/nix/store/q54i6bawc9nl2yxwqid82dglaajzg265-rust-default-1.85.1/bin/cargo" "build" "--release" "--features" "pg15" "--no-default-features" "--message-format=json-render-diagnostics" "--frozen" "-j" "2"655pg_graphql-1.5.7> warning: `/build/source/.cargo/config` is deprecated in favor of `config.toml`656pg_graphql-1.5.7> note: if you need to support cargo 1.38 or earlier, you can symlink `config` to `config.toml`657pg_graphql-1.5.7> warning: unexpected `cfg` condition value: `pg11`658pg_graphql-1.5.7>   --> src/lib.rs:18:1659pg_graphql-1.5.7>    |660pg_graphql-1.5.7> 18 | pg_module_magic!();661pg_graphql-1.5.7>    | ^^^^^^^^^^^^^^^^^^662pg_graphql-1.5.7>    |663pg_graphql-1.5.7>    = note: expected values for `feature` are: `default`, `pg14`, `pg15`, `pg16`, and `pg_test`664pg_graphql-1.5.7>    = note: using a cfg inside a macro will use the cfgs from the destination crate and not the ones from the defining crate665pg_graphql-1.5.7>    = help: try referring to `$crate::pg_magic_func` crate for guidance on how handle this unexpected cfg666pg_graphql-1.5.7>    = help: the macro `$crate::pg_magic_func` may come from an old version of the `pgrx` crate, try updating your dependency with `cargo update -p pgrx`667pg_graphql-1.5.7>    = note: see <https://doc.rust-lang.org/nightly/rustc/check-cfg/cargo-specifics.html> for more information about checking conditional configuration668pg_graphql-1.5.7>    = note: `#[warn(unexpected_cfgs)]` on by default669pg_graphql-1.5.7>    = note: this warning originates in the macro `$crate::pg_magic_func` which comes from the expansion of the macro `pg_module_magic` (in Nightly builds, run with -Z macro-backtrace for more info)670pg_graphql-1.5.7> 671pg_graphql-1.5.7> warning: unexpected `cfg` condition value: `pg12`672pg_graphql-1.5.7>   --> src/lib.rs:18:1673pg_graphql-1.5.7>    |674pg_graphql-1.5.7> 18 | pg_module_magic!();675pg_graphql-1.5.7>    | ^^^^^^^^^^^^^^^^^^676pg_graphql-1.5.7>    |677pg_graphql-1.5.7>    = note: expected values for `feature` are: `default`, `pg14`, `pg15`, `pg16`, and `pg_test`678pg_graphql-1.5.7>    = note: using a cfg inside a macro will use the cfgs from the destination crate and not the ones from the defining crate679pg_graphql-1.5.7>    = help: try referring to `$crate::pg_magic_func` crate for guidance on how handle this unexpected cfg680pg_graphql-1.5.7>    = help: the macro `$crate::pg_magic_func` may come from an old version of the `pgrx` crate, try updating your dependency with `cargo update -p pgrx`681pg_graphql-1.5.7>    = note: see <https://doc.rust-lang.org/nightly/rustc/check-cfg/cargo-specifics.html> for more information about checking conditional configuration682pg_graphql-1.5.7>    = note: this warning originates in the macro `$crate::pg_magic_func` which comes from the expansion of the macro `pg_module_magic` (in Nightly builds, run with -Z macro-backtrace for more info)683pg_graphql-1.5.7> 684pg_graphql-1.5.7> warning: unexpected `cfg` condition value: `pg13`685pg_graphql-1.5.7>   --> src/lib.rs:18:1686pg_graphql-1.5.7>    |687pg_graphql-1.5.7> 18 | pg_module_magic!();688pg_graphql-1.5.7>    | ^^^^^^^^^^^^^^^^^^689pg_graphql-1.5.7>    |690pg_graphql-1.5.7>    = note: expected values for `feature` are: `default`, `pg14`, `pg15`, `pg16`, and `pg_test`691pg_graphql-1.5.7>    = note: using a cfg inside a macro will use the cfgs from the destination crate and not the ones from the defining crate692pg_graphql-1.5.7>    = help: try referring to `$crate::pg_magic_func` crate for guidance on how handle this unexpected cfg693pg_graphql-1.5.7>    = help: the macro `$crate::pg_magic_func` may come from an old version of the `pgrx` crate, try updating your dependency with `cargo update -p pgrx`694pg_graphql-1.5.7>    = note: see <https://doc.rust-lang.org/nightly/rustc/check-cfg/cargo-specifics.html> for more information about checking conditional configuration695pg_graphql-1.5.7>    = note: this warning originates in the macro `$crate::pg_magic_func` which comes from the expansion of the macro `pg_module_magic` (in Nightly builds, run with -Z macro-backtrace for more info)696pg_graphql-1.5.7> 697pg_graphql-1.5.7> warning: field `alias` is never read698pg_graphql-1.5.7>   --> src/builder.rs:15:9699pg_graphql-1.5.7>    |700pg_graphql-1.5.7> 14 | pub struct InsertBuilder {701pg_graphql-1.5.7>    |            ------------- field in this struct702pg_graphql-1.5.7> 15 |     pub alias: String,703pg_graphql-1.5.7>    |         ^^^^^704pg_graphql-1.5.7>    |705pg_graphql-1.5.7>    = note: `InsertBuilder` has derived impls for the traits `Debug` and `Clone`, but these are intentionally ignored during dead code analysis706pg_graphql-1.5.7>    = note: `#[warn(dead_code)]` on by default707pg_graphql-1.5.7> 708pg_graphql-1.5.7> warning: field `alias` is never read709pg_graphql-1.5.7>    --> src/builder.rs:338:9710pg_graphql-1.5.7>     |711pg_graphql-1.5.7> 337 | pub struct UpdateBuilder {712pg_graphql-1.5.7>     |            ------------- field in this struct713pg_graphql-1.5.7> 338 |     pub alias: String,714pg_graphql-1.5.7>     |         ^^^^^715pg_graphql-1.5.7>     |716pg_graphql-1.5.7>     = note: `UpdateBuilder` has derived impls for the traits `Debug` and `Clone`, but these are intentionally ignored during dead code analysis717pg_graphql-1.5.7> 718pg_graphql-1.5.7> warning: field `alias` is never read719pg_graphql-1.5.7>    --> src/builder.rs:510:9720pg_graphql-1.5.7>     |721pg_graphql-1.5.7> 509 | pub struct DeleteBuilder {722pg_graphql-1.5.7>     |            ------------- field in this struct723pg_graphql-1.5.7> 510 |     pub alias: String,724pg_graphql-1.5.7>     |         ^^^^^725pg_graphql-1.5.7>     |726pg_graphql-1.5.7>     = note: `DeleteBuilder` has derived impls for the traits `Debug` and `Clone`, but these are intentionally ignored during dead code analysis727pg_graphql-1.5.7> 728pg_graphql-1.5.7> warning: field `alias` is never read729pg_graphql-1.5.7>    --> src/builder.rs:612:9730pg_graphql-1.5.7>     |731pg_graphql-1.5.7> 611 | pub struct FunctionCallBuilder {732pg_graphql-1.5.7>     |            ------------------- field in this struct733pg_graphql-1.5.7> 612 |     pub alias: String,734pg_graphql-1.5.7>     |         ^^^^^735pg_graphql-1.5.7> 736pg_graphql-1.5.7> warning: field `schema` is never read737pg_graphql-1.5.7>     --> src/builder.rs:1980:9738pg_graphql-1.5.7>      |739pg_graphql-1.5.7> 1979 | pub struct __SchemaBuilder {740pg_graphql-1.5.7>      |            --------------- field in this struct741pg_graphql-1.5.7> 1980 |     pub schema: __Schema,742pg_graphql-1.5.7>      |         ^^^^^^743pg_graphql-1.5.7>      |744pg_graphql-1.5.7>      = note: `__SchemaBuilder` has a derived impl for the trait `Clone`, but this is intentionally ignored during dead code analysis745pg_graphql-1.5.7> 746pg_graphql-1.5.7> warning: method `arg_map` is never used747pg_graphql-1.5.7>    --> src/graphql.rs:349:8748pg_graphql-1.5.7>     |749pg_graphql-1.5.7> 325 | pub trait ___Field {750pg_graphql-1.5.7>     |           -------- method in this trait751pg_graphql-1.5.7> ...752pg_graphql-1.5.7> 349 |     fn arg_map(&self) -> HashMap<String, __InputValue> {753pg_graphql-1.5.7>     |        ^^^^^^^754pg_graphql-1.5.7> 755pg_graphql-1.5.7> warning: `pg_graphql` (lib) generated 9 warnings756pg_graphql-1.5.7>     Finished `release` profile [optimized] target(s) in 0.12s757pg_graphql-1.5.7>   Installing extension758pg_graphql-1.5.7>      Copying control file to /build/tmp.MYl0csIydo/15/share/postgresql/extension/pg_graphql.control759pg_graphql-1.5.9> waiting for server to start....2026-10-27 12:52:08.128 GMT [73] LOG:  starting PostgreSQL 17.11 on aarch64-unknown-linux-gnu, compiled by gcc (GCC) 15.3.0, 64-bit760pg_graphql-1.5.9> 2026-10-27 12:52:08.130 GMT [73] LOG:  listening on Unix socket "/build/tmp.Rj7jX8lrA8/.s.PGSQL.5432"761pg_graphql-1.5.9> 2026-10-27 12:52:08.138 GMT [76] LOG:  database system was shut down at 2026-10-27 12:52:07 GMT762pg_graphql-1.5.9> 2026-10-27 12:52:08.143 GMT [73] LOG:  database system is ready to accept connections763pg_graphql-1.5.9>  done764pg_graphql-1.5.9> server started765pg_graphql-1.5.9> createuser: error: connection to server at "localhost" (127.0.0.1), port 5432 failed: Connection refused766pg_graphql-1.5.9> 	Is the server running on that host and accepting TCP/IP connections?767pg_graphql-1.5.9> waiting for server to shut down....2026-10-27 12:52:08.211 GMT [73] LOG:  received fast shutdown request768pg_graphql-1.5.9> 2026-10-27 12:52:08.213 GMT [73] LOG:  aborting any active transactions769pg_graphql-1.5.9> 2026-10-27 12:52:08.215 GMT [73] LOG:  background worker "logical replication launcher" (PID 79) exited with exit code 1770pg_graphql-1.5.9> 2026-10-27 12:52:08.217 GMT [74] LOG:  shutting down771pg_graphql-1.5.9> 2026-10-27 12:52:08.219 GMT [74] LOG:  checkpoint starting: shutdown immediate772pg_graphql-1.5.7>      Copying shared library to /build/tmp.MYl0csIydo/15/lib/pg_graphql.so773pg_graphql-1.5.9> 2026-10-27 12:52:08.251 GMT [74] LOG:  checkpoint complete: wrote 3 buffers (0.0%); 0 WAL file(s) added, 0 removed, 0 recycled; write=0.004 s, sync=0.002 s, total=0.035 s; sync files=2, longest=0.001 s, average=0.001 s; distance=0 kB, estimate=0 kB; lsn=0/14EC910, redo lsn=0/14EC910774pg_graphql-1.5.9> 2026-10-27 12:52:08.258 GMT [73] LOG:  database system is shut down775pg_graphql-1.5.7>  Discovering SQL entities776pg_graphql-1.5.9>  done777pg_graphql-1.5.9> server stopped778pg_graphql-1.5.9>        Using PgConfig("pg17") and `pg_config` from /nix/store/pmaflmk45425rq04ajcb4yhm58w6hq3p-postgresql-17_22/bin/pg_config779pg_graphql-1.5.9>     Building extension with features  pg17780pg_graphql-1.5.9>      Running command "/nix/store/ymh217xdvqvnxz3qijbg3mnqz44xl73f-rust-default-1.81.0/bin/cargo" "build" "--lib" "--release" "--features" " pg17" "--no-default-features" "--message-format=json-render-diagnostics" "--frozen" "-j" "2"781pg_graphql-1.5.9>    Compiling proc-macro2 v1.0.79782pg_graphql-1.5.9>    Compiling unicode-ident v1.0.12783pg_graphql-1.5.9>    Compiling libc v0.2.153784pg_graphql-1.5.9>    Compiling thiserror v1.0.58785pg_graphql-1.5.9>    Compiling memchr v2.7.2786pg_graphql-1.5.9>    Compiling quote v1.0.36787pg_graphql-1.5.9>    Compiling serde v1.0.197788pg_graphql-1.5.9>    Compiling syn v2.0.58789pg_graphql-1.5.9>    Compiling eyre v0.6.12790pg_graphql-1.5.9>    Compiling equivalent v1.0.1791pg_graphql-1.5.9>    Compiling hashbrown v0.14.3792pg_graphql-1.5.9>    Compiling indexmap v2.2.6793pg_graphql-1.5.9>    Compiling serde_json v1.0.115794pg_graphql-1.5.9>    Compiling tinyvec_macros v0.1.1795pg_graphql-1.5.9>    Compiling glob v0.3.1796pg_graphql-1.5.9>    Compiling clang-sys v1.7.0797pg_graphql-1.5.9>    Compiling tinyvec v1.6.0798pg_graphql-1.5.9>    Compiling is_ci v1.2.0799pg_graphql-1.5.9>    Compiling indenter v0.3.3800pg_graphql-1.5.9>    Compiling winnow v0.6.5801pg_graphql-1.5.7>   Discovered 5 SQL entities: 0 schemas (0 unique), 1 functions, 0 types, 0 enums, 4 sqls, 0 ords, 0 hashes, 0 aggregates, 0 triggers802pg_graphql-1.5.7>      Writing SQL entities to /build/tmp.MYl0csIydo/15/share/postgresql/extension/pg_graphql--1.5.7.sql803pg_graphql-1.5.7>     Finished installing pg_graphql804pg_graphql-1.5.7> ++ mktemp -d805pg_graphql-1.5.7> + TMPDIR=/build/tmp.XVBFW2RSov806pg_graphql-1.5.7> + export PGDATA=/build/tmp.XVBFW2RSov807pg_graphql-1.5.7> + PGDATA=/build/tmp.XVBFW2RSov808pg_graphql-1.5.7> + export PGHOST=/build/tmp.XVBFW2RSov809pg_graphql-1.5.7> + PGHOST=/build/tmp.XVBFW2RSov810pg_graphql-1.5.7> + export PGUSER=postgres811pg_graphql-1.5.7> + PGUSER=postgres812pg_graphql-1.5.7> + export PGDATABASE=postgres813pg_graphql-1.5.7> + PGDATABASE=postgres814pg_graphql-1.5.7> + export PGTZ=UTC815pg_graphql-1.5.7> + PGTZ=UTC816pg_graphql-1.5.7> + export PG_COLOR=auto817pg_graphql-1.5.7> + PG_COLOR=auto818pg_graphql-1.5.7> + trap 'pg_ctl stop -m i' sigint sigterm exit819pg_graphql-1.5.7> + rm -rf /build/tmp.XVBFW2RSov820pg_graphql-1.5.7> + initdb --no-locale --encoding=UTF8 --nosync -U postgres821pg_graphql-1.5.7> The files belonging to this database system will be owned by user "nixbld".822pg_graphql-1.5.7> This user must also own the server process.823pg_graphql-1.5.7> 824pg_graphql-1.5.7> The database cluster will be initialized with locale "C".825pg_graphql-1.5.7> The default text search configuration will be set to "english".826pg_graphql-1.5.7> 827pg_graphql-1.5.7> Data page checksums are disabled.828pg_graphql-1.5.7> 829pg_graphql-1.5.7> creating directory /build/tmp.XVBFW2RSov ... ok830pg_graphql-1.5.7> creating subdirectories ... ok831pg_graphql-1.5.7> selecting dynamic shared memory implementation ... posix832pg_graphql-1.5.7> selecting default max_connections ... 100833pg_graphql-1.5.7> selecting default shared_buffers ... 128MB834pg_graphql-1.5.7> selecting default time zone ... UTC835pg_graphql-1.5.7> creating configuration files ... ok836pg_graphql-1.5.7> running bootstrap script ... ok837pg_graphql-1.5.7> performing post-bootstrap initialization ... ok838pg_graphql-1.5.7> 839pg_graphql-1.5.7> Sync to disk skipped.840pg_graphql-1.5.7> The data directory might become corrupt if the operating system crashes.841pg_graphql-1.5.7> 842pg_graphql-1.5.7> initdb: warning: enabling "trust" authentication for local connections843pg_graphql-1.5.7> initdb: hint: You can change this by editing pg_hba.conf or using the option -A, or --auth-local and --auth-host, the next time you run initdb.844pg_graphql-1.5.7> 845pg_graphql-1.5.7> Success. You can now start the database server using:846pg_graphql-1.5.7> 847pg_graphql-1.5.7>     /build/tmp.MYl0csIydo/15/bin/pg_ctl -D /build/tmp.XVBFW2RSov -l logfile start848pg_graphql-1.5.7> 849pg_graphql-1.5.7> + pg_ctl start -o '-F -c listen_addresses="" -c log_min_messages=WARNING -k /build/tmp.XVBFW2RSov'850pg_graphql-1.5.7> waiting for server to start....2026-10-27 12:52:21.430 UTC [2530] LOG:  starting PostgreSQL 15.19 on aarch64-unknown-linux-gnu, compiled by gcc (GCC) 15.3.0, 64-bit851pg_graphql-1.5.7> 2026-10-27 12:52:21.430 UTC [2530] LOG:  listening on Unix socket "/build/tmp.XVBFW2RSov/.s.PGSQL.5432"852pg_graphql-1.5.7> 2026-10-27 12:52:21.433 UTC [2533] LOG:  database system was shut down at 2026-10-27 12:52:21 UTC853pg_graphql-1.5.7> 2026-10-27 12:52:21.437 UTC [2530] LOG:  database system is ready to accept connections854pg_graphql-1.5.7>  done855pg_graphql-1.5.7> server started856pg_graphql-1.5.7> + createdb contrib_regression857pg_graphql-1.5.7> + TESTDIR=test858pg_graphql-1.5.7> +++ pg_config --pgxs859pg_graphql-1.5.7> ++ dirname /nix/store/bc9327c6474vwmqmhkszkmiz86mba73s-postgresql-15.19/lib/pgxs/src/makefiles/pgxs.mk860pg_graphql-1.5.7> + PGXS=/nix/store/bc9327c6474vwmqmhkszkmiz86mba73s-postgresql-15.19/lib/pgxs/src/makefiles861pg_graphql-1.5.7> + REGRESS=/nix/store/bc9327c6474vwmqmhkszkmiz86mba73s-postgresql-15.19/lib/pgxs/src/makefiles/../test/regress/pg_regress862pg_graphql-1.5.7> + '[' 0 -ne 0 ']'863pg_graphql-1.5.7> ++ ls test/sql864pg_graphql-1.5.7> ++ sed -e 's/\..*$//'865pg_graphql-1.5.7> ++ sort866pg_graphql-1.5.7> + TESTS=$'aliases\nallow_camel_names\narray_args_and_return_types\nbigint_is_string\nbuiltin_directives\ncomment_directive\ncomment_directive_description\ncompound_filters\nempty_mutations\nenum_mappings\nextend_type_with_function\nextend_type_with_function_relation\nextend_type_with_generated_column\nfilter_by_node_id\nfragment_on_mutation\nfragment_on_query\nfunction_calls\nfunction_calls_default_args\nfunction_calls_unsupported\nfunction_return_row_is_selectable\nfunction_return_view_has_pkey\ninflection_fields\ninflection_function\ninflection_relationships\ninflection_types\nissue_163\nissue_170\nissue_225\nissue_237_field_merging\nissue_237_field_merging_mismatched\nissue_300\nissue_306\nissue_312\nissue_334_ambiguous_function\nissue_337\nissue_339_function_return_json\nissue_339_function_return_table\nissue_353_too_many_fields\nissue_370_citext_as_string\nissue_373\nissue_377_enum_search_path\nissue_409_fkey_rls_nullability\nissue_444\nissue_463\nissue_511\nissue_533\nissue_542_partial_unique\nissue_fragment_spread_cycles\njson_is_stringified\nmax_page_size\nmax_rows_directive\nmulti_column_primary_key\nmultiple_mutations\nmultiple_queries\nmutation_delete\nmutation_delete_variable\nmutation_insert\nmutation_update\nnull_argument\nomit_exotic_types\nomit_weird_names\noperation_name\noverride_enum_name\noverride_field_name\noverride_func_field_name\noverride_relationship_field_name\noverride_type_name\npage_info\npermissions_connection_column\npermissions_functions\npermissions_node_column\npermissions_table_level\npermissions_types\nprimary_key_is_required\nrelationship_one_to_one\nresolve___schema\nresolve___type\nresolve___typename\nresolve_array_type\nresolve_connection_filter\nresolve_connection_named\nresolve_connection_order_by\nresolve_connection_pagination_args\nresolve_connection_to_conn\nresolve_connection_to_node\nresolve_error_connection_edge_no_field\nresolve_error_connection_edge_node_no_field\nresolve_error_connection_no_field\nresolve_error_from_parser\nresolve_error_mutation_no_field\nresolve_error_node_no_field\nresolve_error_query_no_field\nresolve_fragment\nresolve_graphiql_schema\nresolve_one\nroundtrip_types\nrow_level_security\nsqli_connection\nstring_filters\ntest_error_anon_and_named_operations\ntest_error_invalid_offset\ntest_error_multiple_anon_operations\ntest_error_mutation_transpilation\ntest_error_operation_name_not_found\ntest_error_operation_names_not_unique\ntest_error_parsing\ntest_error_query_transpilation\ntest_error_subscription\ntest_query__type\ntotal_count\ntype_bigfloat\ntype_modifier_max_length\ntype_opaque\nvariable_default\nviews_integration'867pg_graphql-1.5.7> + psql -v ON_ERROR_STOP=1 -f test/fixtures.sql -d contrib_regression868pg_graphql-1.5.7> psql:test/fixtures.sql:1: NOTICE:  extension "pg_graphql" does not exist, skipping869pg_graphql-1.5.7> DROP EXTENSION870pg_graphql-1.5.7> CREATE EXTENSION871pg_graphql-1.5.7> COMMENT872pg_graphql-1.5.7> CREATE FUNCTION873pg_graphql-1.5.7> + /nix/store/bc9327c6474vwmqmhkszkmiz86mba73s-postgresql-15.19/lib/pgxs/src/makefiles/../test/regress/pg_regress --use-existing --dbname=contrib_regression --inputdir=test aliases allow_camel_names array_args_and_return_types bigint_is_string builtin_directives comment_directive comment_directive_description compound_filters empty_mutations enum_mappings extend_type_with_function extend_type_with_function_relation extend_type_with_generated_column filter_by_node_id fragment_on_mutation fragment_on_query function_calls function_calls_default_args function_calls_unsupported function_return_row_is_selectable function_return_view_has_pkey inflection_fields inflection_function inflection_relationships inflection_types issue_163 issue_170 issue_225 issue_237_field_merging issue_237_field_merging_mismatched issue_300 issue_306 issue_312 issue_334_ambiguous_function issue_337 issue_339_function_return_json issue_339_function_return_table issue_353_too_many_fields issue_370_citext_as_string issue_373 issue_377_enum_search_path issue_409_fkey_rls_nullability issue_444 issue_463 issue_511 issue_533 issue_542_partial_unique issue_fragment_spread_cycles json_is_stringified max_page_size max_rows_directive multi_column_primary_key multiple_mutations multiple_queries mutation_delete mutation_delete_variable mutation_insert mutation_update null_argument omit_exotic_types omit_weird_names operation_name override_enum_name override_field_name override_func_field_name override_relationship_field_name override_type_name page_info permissions_connection_column permissions_functions permissions_node_column permissions_table_level permissions_types primary_key_is_required relationship_one_to_one resolve___schema resolve___type resolve___typename resolve_array_type resolve_connection_filter resolve_connection_named resolve_connection_order_by resolve_connection_pagination_args resolve_connection_to_conn resolve_connection_to_node resolve_error_connection_edge_no_field resolve_error_connection_edge_node_no_field resolve_error_connection_no_field resolve_error_from_parser resolve_error_mutation_no_field resolve_error_node_no_field resolve_error_query_no_field resolve_fragment resolve_graphiql_schema resolve_one roundtrip_types row_level_security sqli_connection string_filters test_error_anon_and_named_operations test_error_invalid_offset test_error_multiple_anon_operations test_error_mutation_transpilation test_error_operation_name_not_found test_error_operation_names_not_unique test_error_parsing test_error_query_transpilation test_error_subscription test_query__type total_count type_bigfloat type_modifier_max_length type_opaque variable_default views_integration874pg_graphql-1.5.7> (using postmaster on /build/tmp.XVBFW2RSov, default port)875pg_graphql-1.5.7> ============== running regression test queries        ==============876pg_graphql-1.5.7> test aliases                      ... ok           61 ms877pg_graphql-1.5.7> test allow_camel_names            ... ok           64 ms878pg_graphql-1.5.9>    Compiling anyhow v1.0.82879pg_graphql-1.5.9>    Compiling once_cell v1.19.0880pg_graphql-1.5.9>    Compiling cfg-if v1.0.0881pg_graphql-1.5.7> test array_args_and_return_types  ... ok         1516 ms882pg_graphql-1.5.7> test bigint_is_string             ... ok           56 ms883pg_graphql-1.5.7> test builtin_directives           ... ok           62 ms884pg_graphql-1.5.7> test comment_directive            ... ok           10 ms885pg_graphql-1.5.9>    Compiling thiserror-impl v1.0.58886pg_graphql-1.5.7> test comment_directive_description ... ok           52 ms887pg_graphql-1.5.7> test compound_filters             ... ok          268 ms888pg_graphql-1.5.7> test empty_mutations              ... ok           54 ms889pg_graphql-1.5.7> test enum_mappings                ... ok           61 ms890pg_graphql-1.5.9>    Compiling serde_derive v1.0.197891pg_graphql-1.5.7> test extend_type_with_function    ... ok           59 ms892pg_graphql-1.5.7> test extend_type_with_function_relation ... ok          148 ms893pg_graphql-1.5.7> test extend_type_with_generated_column ... ok           51 ms894pg_graphql-1.5.7> test filter_by_node_id            ... ok           57 ms895pg_graphql-1.5.7> test fragment_on_mutation         ... ok           53 ms896pg_graphql-1.5.7> test fragment_on_query            ... ok           65 ms897pg_graphql-1.5.7> test function_calls               ... ok         1303 ms898pg_graphql-1.5.7> test function_calls_default_args  ... ok          101 ms899pg_graphql-1.5.7> test function_calls_unsupported   ... ok          301 ms900pg_graphql-1.5.7> test function_return_row_is_selectable ... ok           92 ms901pg_graphql-1.5.7> test function_return_view_has_pkey ... ok           83 ms902pg_graphql-1.5.7> test inflection_fields            ... ok          124 ms903pg_graphql-1.5.7> test inflection_function          ... ok          127 ms904pg_graphql-1.5.7> test inflection_relationships     ... ok          199 ms905pg_graphql-1.5.7> test inflection_types             ... ok          154 ms906pg_graphql-1.5.7> test issue_163                    ... ok           53 ms907pg_graphql-1.5.7> test issue_170                    ... ok           51 ms908pg_graphql-1.5.7> test issue_225                    ... ok           59 ms909pg_graphql-1.5.7> test issue_237_field_merging      ... ok           97 ms910pg_graphql-1.5.7> test issue_237_field_merging_mismatched ... ok           91 ms911pg_graphql-1.5.7> test issue_300                    ... ok           56 ms912pg_graphql-1.5.7> test issue_306                    ... ok           58 ms913pg_graphql-1.5.7> test issue_312                    ... ok           59 ms914pg_graphql-1.5.7> test issue_334_ambiguous_function ... ok           63 ms915pg_graphql-1.5.7> test issue_337                    ... ok           88 ms916pg_graphql-1.5.7> test issue_339_function_return_json ... ok           50 ms917pg_graphql-1.5.7> test issue_339_function_return_table ... ok           53 ms918pg_graphql-1.5.7> test issue_353_too_many_fields    ... ok           61 ms919pg_graphql-1.5.9>    Compiling unicode-normalization v0.1.23920pg_graphql-1.5.7> test issue_370_citext_as_string   ... ok           69 ms921pg_graphql-1.5.7> test issue_373                    ... ok           57 ms922pg_graphql-1.5.7> test issue_377_enum_search_path   ... ok           78 ms923pg_graphql-1.5.7> test issue_409_fkey_rls_nullability ... ok          108 ms924pg_graphql-1.5.7> test issue_444                    ... ok           46 ms925pg_graphql-1.5.7> test issue_463                    ... ok           56 ms926pg_graphql-1.5.7> test issue_511                    ... ok           61 ms927pg_graphql-1.5.7> test issue_533                    ... ok          103 ms928pg_graphql-1.5.7> test issue_542_partial_unique     ... ok           83 ms929pg_graphql-1.5.9>    Compiling is-terminal v0.4.13930pg_graphql-1.5.7> test issue_fragment_spread_cycles ... ok          224 ms931pg_graphql-1.5.7> test json_is_stringified          ... ok           55 ms932pg_graphql-1.5.9>    Compiling owo-colors v4.1.0933pg_graphql-1.5.7> test max_page_size                ... ok           50 ms934pg_graphql-1.5.7> test max_rows_directive           ... ok          108 ms935pg_graphql-1.5.7> test multi_column_primary_key     ... ok           63 ms936pg_graphql-1.5.9>    Compiling unicode-bidi v0.3.15937pg_graphql-1.5.7> test multiple_mutations           ... ok           54 ms938pg_graphql-1.5.7> test multiple_queries             ... ok           53 ms939pg_graphql-1.5.7> test mutation_delete              ... ok           64 ms940pg_graphql-1.5.7> test mutation_delete_variable     ... ok           52 ms941pg_graphql-1.5.7> test mutation_insert              ... ok           64 ms942pg_graphql-1.5.7> test mutation_update              ... ok           69 ms943pg_graphql-1.5.7> test null_argument                ... ok           68 ms944pg_graphql-1.5.7> test omit_exotic_types            ... ok           59 ms945pg_graphql-1.5.7> test omit_weird_names             ... ok           79 ms946pg_graphql-1.5.7> test operation_name               ... ok           53 ms947pg_graphql-1.5.7> test override_enum_name           ... ok           47 ms948pg_graphql-1.5.7> test override_field_name          ... ok           51 ms949pg_graphql-1.5.7> test override_func_field_name     ... ok           52 ms950pg_graphql-1.5.7> test override_relationship_field_name ... ok           58 ms951pg_graphql-1.5.7> test override_type_name           ... ok           50 ms952pg_graphql-1.5.7> test page_info                    ... ok           73 ms953pg_graphql-1.5.7> test permissions_connection_column ... ok           85 ms954pg_graphql-1.5.7> test permissions_functions        ... ok           76 ms955pg_graphql-1.5.7> test permissions_node_column      ... ok           87 ms956pg_graphql-1.5.9>    Compiling minimal-lexical v0.2.1957pg_graphql-1.5.7> test permissions_table_level      ... ok          177 ms958pg_graphql-1.5.7> test permissions_types            ... ok          101 ms959pg_graphql-1.5.7> test primary_key_is_required      ... ok           83 ms960pg_graphql-1.5.9>    Compiling regex-syntax v0.8.3961pg_graphql-1.5.7> test relationship_one_to_one      ... ok           59 ms962pg_graphql-1.5.7> test resolve___schema             ... ok           63 ms963pg_graphql-1.5.7> test resolve___type               ... ok           54 ms964pg_graphql-1.5.7> test resolve___typename           ... ok           60 ms965pg_graphql-1.5.7> test resolve_array_type           ... ok           61 ms966pg_graphql-1.5.7> test resolve_connection_filter    ... ok          119 ms967pg_graphql-1.5.7> test resolve_connection_named     ... ok           53 ms968pg_graphql-1.5.7> test resolve_connection_order_by  ... ok           83 ms969pg_graphql-1.5.7> test resolve_connection_pagination_args ... ok          102 ms970pg_graphql-1.5.7> test resolve_connection_to_conn   ... ok           57 ms971pg_graphql-1.5.7> test resolve_connection_to_node   ... ok           61 ms972pg_graphql-1.5.7> test resolve_error_connection_edge_no_field ... ok           55 ms973pg_graphql-1.5.7> test resolve_error_connection_edge_node_no_field ... ok           57 ms974pg_graphql-1.5.7> test resolve_error_connection_no_field ... ok          150 ms975pg_graphql-1.5.7> test resolve_error_from_parser    ... ok           13 ms976pg_graphql-1.5.7> test resolve_error_mutation_no_field ... ok           55 ms977pg_graphql-1.5.7> test resolve_error_node_no_field  ... ok           62 ms978pg_graphql-1.5.7> test resolve_error_query_no_field ... ok           55 ms979pg_graphql-1.5.7> test resolve_fragment             ... ok           52 ms980pg_graphql-1.5.7> test resolve_graphiql_schema      ... ok          114 ms981pg_graphql-1.5.7> test resolve_one                  ... ok           90 ms982pg_graphql-1.5.7> test roundtrip_types              ... ok           68 ms983pg_graphql-1.5.7> test row_level_security           ... ok           55 ms984pg_graphql-1.5.7> test sqli_connection              ... ok           63 ms985pg_graphql-1.5.7> test string_filters               ... ok           62 ms986pg_graphql-1.5.7> test test_error_anon_and_named_operations ... ok           51 ms987pg_graphql-1.5.7> test test_error_invalid_offset    ... ok           81 ms988pg_graphql-1.5.7> test test_error_multiple_anon_operations ... ok           44 ms989pg_graphql-1.5.7> test test_error_mutation_transpilation ... ok           64 ms990pg_graphql-1.5.7> test test_error_operation_name_not_found ... ok           47 ms991pg_graphql-1.5.7> test test_error_operation_names_not_unique ... ok           50 ms992pg_graphql-1.5.7> test test_error_parsing           ... ok           15 ms993pg_graphql-1.5.7> test test_error_query_transpilation ... ok           53 ms994pg_graphql-1.5.7> test test_error_subscription      ... ok           46 ms995pg_graphql-1.5.7> test test_query__type             ... ok           49 ms996pg_graphql-1.5.7> test total_count                  ... ok           79 ms997pg_graphql-1.5.7> test type_bigfloat                ... ok           57 ms998pg_graphql-1.5.7> test type_modifier_max_length     ... ok           54 ms999pg_graphql-1.5.7> test type_opaque                  ... ok           55 ms1000pg_graphql-1.5.7> test variable_default             ... ok           54 ms1001pg_graphql-1.5.7> test views_integration            ... ok          172 ms1002pg_graphql-1.5.7> 1003pg_graphql-1.5.7> =======================1004pg_graphql-1.5.7>  All 115 tests passed. 1005pg_graphql-1.5.7> =======================1006pg_graphql-1.5.7> 1007pg_graphql-1.5.7> + pg_ctl stop -m i1008pg_graphql-1.5.7> waiting for server to shut down....2026-10-27 12:52:33.207 UTC [2530] LOG:  received immediate shutdown request1009pg_graphql-1.5.7> 2026-10-27 12:52:33.216 UTC [2530] LOG:  database system is shut down1010pg_graphql-1.5.7>  done1011pg_graphql-1.5.7> server stopped1012pg_graphql-1.5.7> Running phase: installPhase1013pg_graphql-1.5.7> Executing buildPgrxExtension install1014pg_graphql-1.5.7> Running phase: fixupPhase1015pg_graphql-1.5.7> shrinking RPATHs of ELF executables and libraries in /nix/store/wi2ag7mkw2qx7w6lg3xy8v48i7h3p8xq-pg_graphql-1.5.71016pg_graphql-1.5.7> shrinking /nix/store/wi2ag7mkw2qx7w6lg3xy8v48i7h3p8xq-pg_graphql-1.5.7/lib/pg_graphql-1.5.7.so1017pg_graphql-1.5.7> checking for references to /build/ in /nix/store/wi2ag7mkw2qx7w6lg3xy8v48i7h3p8xq-pg_graphql-1.5.7...1018pg_graphql-1.5.7> patching script interpreter paths in /nix/store/wi2ag7mkw2qx7w6lg3xy8v48i7h3p8xq-pg_graphql-1.5.71019pg_graphql-1.5.7> stripping (with command strip and flags -S -p) in  /nix/store/wi2ag7mkw2qx7w6lg3xy8v48i7h3p8xq-pg_graphql-1.5.7/lib1020pg_graphql-1.5.9>    Compiling ucd-trie v0.1.61021pg_graphql-1.5.9>    Compiling percent-encoding v2.3.11022pg_graphql-1.5.9>    Compiling cc v1.0.921023pg_graphql-1.5.9>    Compiling serde_spanned v0.6.51024pg_graphql-1.5.9>    Compiling toml_datetime v0.6.51025pg_graphql-1.5.9>    Compiling toml_edit v0.22.91026pg_graphql-1.5.9>    Compiling form_urlencoded v1.2.11027pg_graphql-1.5.9>    Compiling pest v2.7.91028pg_graphql-1.5.9>    Compiling toml v0.8.121029pg_graphql-1.5.9>    Compiling regex-automata v0.4.61030pg_graphql-1.5.9>    Compiling nom v7.1.31031pg_graphql-1.5.9>    Compiling idna v0.5.01032pg_graphql-1.5.9>    Compiling libloading v0.8.31033pg_graphql-1.5.9>    Compiling supports-color v2.1.01034pg_graphql-1.5.9>    Compiling supports-color v3.0.11035pg_graphql-1.5.9>    Compiling ryu v1.0.171036pg_graphql-1.5.9>    Compiling bindgen v0.70.11037pg_graphql-1.5.9>    Compiling syn v1.0.1091038pg_graphql-1.5.9>    Compiling either v1.10.01039pg_graphql-1.5.9>    Compiling unicode-width v0.1.141040pg_graphql-1.5.9>    Compiling itoa v1.0.111041pg_graphql-1.5.9>    Compiling yansi-term v0.1.21042pg_graphql-1.5.9>    Compiling annotate-snippets v0.9.21043pg_graphql-1.5.9>    Compiling itertools v0.12.11044pg_graphql-1.5.9>    Compiling pathsearch v0.2.01045pg_graphql-1.5.9>    Compiling url v2.5.01046pg_graphql-1.5.9>    Compiling cexpr v0.6.01047pg_graphql-1.5.9>    Compiling regex v1.10.41048pg_graphql-1.5.9>    Compiling cargo_toml v0.19.21049pg_graphql-1.5.9>    Compiling semver-parser v0.10.21050pg_graphql-1.5.9>    Compiling home v0.5.91051pg_graphql-1.5.9>    Compiling bitflags v2.5.01052pg_graphql-1.5.9>    Compiling rustc-hash v1.1.01053pg_graphql-1.5.9>    Compiling shlex v1.3.01054pg_graphql-1.5.9>    Compiling same-file v1.0.61055pg_graphql-1.5.9>    Compiling walkdir v2.5.01056pg_graphql-1.5.9>    Compiling pgrx-pg-config v0.12.61057pg_graphql-1.5.9>    Compiling semver v0.11.01058pg_graphql-1.5.9>    Compiling getrandom v0.2.141059pg_graphql-1.5.9>    Compiling fixedbitset v0.4.21060pg_graphql-1.5.9>    Compiling byteorder v1.5.01061pg_graphql-1.5.9>    Compiling strsim v0.10.01062pg_graphql-1.5.9>    Compiling unicode-segmentation v1.11.01063pg_graphql-1.5.9>    Compiling ident_case v1.0.11064pg_graphql-1.5.9>    Compiling fnv v1.0.71065pg_graphql-1.5.9>    Compiling darling_core v0.14.41066pg_graphql-1.5.9>    Compiling convert_case v0.6.01067pg_graphql-1.5.9>    Compiling petgraph v0.6.41068pg_graphql-1.5.9>    Compiling rustc_version v0.3.31069pg_graphql-1.5.9>    Compiling pgrx-bindgen v0.12.61070pg_graphql-1.5.9>    Compiling cee-scape v0.2.01071pg_graphql-1.5.9>    Compiling unescape v0.1.01072pg_graphql-1.5.9>    Compiling radium v0.7.01073pg_graphql-1.5.9>    Compiling pgrx-sql-entity-graph v0.12.61074pg_graphql-1.5.9>    Compiling pgrx-pg-sys v0.12.61075pg_graphql-1.5.9>    Compiling atomic-traits v0.3.01076pg_graphql-1.5.9>    Compiling darling_macro v0.14.41077pg_graphql-1.5.9>    Compiling tap v1.0.11078pg_graphql-1.5.9>    Compiling heapless v0.8.01079pg_graphql-1.5.9>    Compiling void v1.0.21080pg_graphql-1.5.9>    Compiling unreachable v1.0.01081pg_graphql-1.5.9>    Compiling wyz v0.5.11082pg_graphql-1.5.9>    Compiling darling v0.14.41083pg_graphql-1.5.9>    Compiling pgrx-macros v0.12.61084pg_graphql-1.5.9>    Compiling hash32 v0.3.11085pg_graphql-1.5.9>    Compiling rand_core v0.6.41086pg_graphql-1.5.9>    Compiling enum-map-derive v0.17.01087pg_graphql-1.5.9>    Compiling half v1.8.31088pg_graphql-1.5.9>    Compiling ascii v0.9.31089pg_graphql-1.5.9>    Compiling sptr v0.3.21090pg_graphql-1.5.9>    Compiling funty v2.0.01091pg_graphql-1.5.9>    Compiling stable_deref_trait v1.2.01092pg_graphql-1.5.9>    Compiling ppv-lite86 v0.2.171093pg_graphql-1.5.9>    Compiling rand_chacha v0.3.11094pg_graphql-1.5.9>    Compiling bitvec v1.0.11095pg_graphql-1.5.9>    Compiling combine v3.8.11096pg_graphql-1.5.9>    Compiling serde_cbor v0.11.21097pg_graphql-1.5.9>    Compiling enum-map v2.7.31098pg_graphql-1.5.9>    Compiling cached_proc_macro v0.18.11099pg_graphql-1.5.9>    Compiling uuid v1.8.01100pg_graphql-1.5.9>    Compiling instant v0.1.121101pg_graphql-1.5.9>    Compiling cached_proc_macro_types v0.1.11102pg_graphql-1.5.9>    Compiling seahash v4.1.01103pg_graphql-1.5.9>    Compiling cached v0.46.11104pg_graphql-1.5.9>    Compiling graphql-parser v0.4.01105pg_graphql-1.5.9>    Compiling rand v0.8.51106pg_graphql-1.5.9>    Compiling pgrx v0.12.61107pg_graphql-1.5.9>    Compiling itertools v0.10.51108pg_graphql-1.5.9>    Compiling bimap v0.6.31109pg_graphql-1.5.9>    Compiling lazy_static v1.4.01110pg_graphql-1.5.9>    Compiling base64 v0.13.11111pg_graphql-1.5.9>    Compiling pg_graphql v1.5.9 (/build/source)1112pg_graphql-1.5.9>     Finished `release` profile [optimized] target(s) in 4m 30s1113pg_graphql-1.5.9>   Installing extension1114pg_graphql-1.5.9>      Copying control file to /nix/store/qkbj2jmwjp1a305cacw5dnzw8c1k64hv-pg_graphql-1.5.9/nix/store/pmaflmk45425rq04ajcb4yhm58w6hq3p-postgresql-17_22/share/postgresql/extension/pg_graphql.control1115pg_graphql-1.5.9>      Copying shared library to /nix/store/qkbj2jmwjp1a305cacw5dnzw8c1k64hv-pg_graphql-1.5.9/nix/store/j71vd8cq510zphc7wk56959mij4dfriv-postgresql-17_22-lib/lib/pg_graphql.so1116pg_graphql-1.5.9>   Discovered 5 SQL entities: 0 schemas (0 unique), 1 functions, 0 types, 0 enums, 4 sqls, 0 ords, 0 hashes, 0 aggregates, 0 triggers1117pg_graphql-1.5.9>   Rebuilding pgrx_embed, in debug mode, for SQL generation with features  pg171118pg_graphql-1.5.9>    Compiling proc-macro2 v1.0.791119pg_graphql-1.5.9>    Compiling unicode-ident v1.0.121120pg_graphql-1.5.9>    Compiling libc v0.2.1531121pg_graphql-1.5.9>    Compiling thiserror v1.0.581122pg_graphql-1.5.9>    Compiling quote v1.0.361123pg_graphql-1.5.9>    Compiling syn v2.0.581124pg_graphql-1.5.9>    Compiling equivalent v1.0.11125pg_graphql-1.5.9>    Compiling cfg-if v1.0.01126pg_graphql-1.5.9>    Compiling memchr v2.7.21127pg_graphql-1.5.9>    Compiling serde v1.0.1971128pg_graphql-1.5.9>    Compiling hashbrown v0.14.31129pg_graphql-1.5.9>    Compiling indexmap v2.2.61130pg_graphql-1.5.9>    Compiling once_cell v1.19.01131pg_graphql-1.5.9>    Compiling eyre v0.6.121132pg_graphql-1.5.9>    Compiling tinyvec_macros v0.1.11133pg_graphql-1.5.9>    Compiling indenter v0.3.31134pg_graphql-1.5.9>    Compiling glob v0.3.11135pg_graphql-1.5.9>    Compiling clang-sys v1.7.01136pg_graphql-1.5.9>    Compiling tinyvec v1.6.01137pg_graphql-1.5.9>    Compiling is_ci v1.2.01138pg_graphql-1.5.9>    Compiling winnow v0.6.51139pg_graphql-1.5.9>    Compiling thiserror-impl v1.0.581140pg_graphql-1.5.9>    Compiling serde_derive v1.0.1971141pg_graphql-1.5.9>    Compiling serde_json v1.0.1151142pg_graphql-1.5.9>    Compiling anyhow v1.0.821143pg_graphql-1.5.9>    Compiling unicode-normalization v0.1.231144pg_graphql-1.5.9>    Compiling is-terminal v0.4.131145pg_graphql-1.5.9>    Compiling minimal-lexical v0.2.11146pg_graphql-1.5.9>    Compiling percent-encoding v2.3.11147pg_graphql-1.5.9>    Compiling cc v1.0.921148pg_graphql-1.5.9>    Compiling owo-colors v4.1.01149pg_graphql-1.5.9>    Compiling ucd-trie v0.1.61150pg_graphql-1.5.9>    Compiling unicode-bidi v0.3.151151pg_graphql-1.5.9>    Compiling ryu v1.0.171152pg_graphql-1.5.9>    Compiling regex-syntax v0.8.31153pg_graphql-1.5.9>    Compiling itoa v1.0.111154pg_graphql-1.5.9>    Compiling serde_spanned v0.6.51155pg_graphql-1.5.9>    Compiling toml_datetime v0.6.51156pg_graphql-1.5.9>    Compiling regex-automata v0.4.61157pg_graphql-1.5.9>    Compiling toml_edit v0.22.91158pg_graphql-1.5.9>    Compiling toml v0.8.121159pg_graphql-1.5.9>    Compiling idna v0.5.01160pg_graphql-1.5.9>    Compiling pest v2.7.91161pg_graphql-1.5.9>    Compiling form_urlencoded v1.2.11162pg_graphql-1.5.9>    Compiling nom v7.1.31163pg_graphql-1.5.9>    Compiling supports-color v2.1.01164pg_graphql-1.5.9>    Compiling supports-color v3.0.11165pg_graphql-1.5.9>    Compiling libloading v0.8.31166pg_graphql-1.5.9>    Compiling yansi-term v0.1.21167pg_graphql-1.5.9>    Compiling unicode-width v0.1.141168pg_graphql-1.5.9>    Compiling syn v1.0.1091169pg_graphql-1.5.9>    Compiling fixedbitset v0.4.21170pg_graphql-1.5.9>    Compiling bindgen v0.70.11171pg_graphql-1.5.9>    Compiling either v1.10.01172pg_graphql-1.5.9>    Compiling itertools v0.12.11173pg_graphql-1.5.9>    Compiling annotate-snippets v0.9.21174pg_graphql-1.5.9>    Compiling cexpr v0.6.01175pg_graphql-1.5.9>    Compiling pathsearch v0.2.01176pg_graphql-1.5.9>    Compiling semver-parser v0.10.21177pg_graphql-1.5.9>    Compiling url v2.5.01178pg_graphql-1.5.9>    Compiling cargo_toml v0.19.21179pg_graphql-1.5.9>    Compiling regex v1.10.41180pg_graphql-1.5.9>    Compiling same-file v1.0.61181pg_graphql-1.5.9>    Compiling bitflags v2.5.01182pg_graphql-1.5.9>    Compiling rustc-hash v1.1.01183pg_graphql-1.5.9>    Compiling unicode-segmentation v1.11.01184pg_graphql-1.5.9>    Compiling shlex v1.3.01185pg_graphql-1.5.9>    Compiling home v0.5.91186pg_graphql-1.5.9>    Compiling pgrx-pg-config v0.12.61187pg_graphql-1.5.9>    Compiling convert_case v0.6.01188pg_graphql-1.5.9>    Compiling walkdir v2.5.01189pg_graphql-1.5.9>    Compiling semver v0.11.01190pg_graphql-1.5.9>    Compiling getrandom v0.2.141191pg_graphql-1.5.9>    Compiling strsim v0.10.01192pg_graphql-1.5.9>    Compiling unescape v0.1.01193pg_graphql-1.5.9>    Compiling fnv v1.0.71194pg_graphql-1.5.9>    Compiling ident_case v1.0.11195pg_graphql-1.5.9>    Compiling byteorder v1.5.01196pg_graphql-1.5.9>    Compiling darling_core v0.14.41197pg_graphql-1.5.9>    Compiling pgrx-bindgen v0.12.61198pg_graphql-1.5.9>    Compiling rustc_version v0.3.31199pg_graphql-1.5.9>    Compiling petgraph v0.6.41200pg_graphql-1.5.9>    Compiling cee-scape v0.2.01201pg_graphql-1.5.9>    Compiling radium v0.7.01202pg_graphql-1.5.9>    Compiling pgrx-sql-entity-graph v0.12.61203pg_graphql-1.5.9>    Compiling pgrx-pg-sys v0.12.61204pg_graphql-1.5.9>    Compiling atomic-traits v0.3.01205pg_graphql-1.5.9>    Compiling darling_macro v0.14.41206pg_graphql-1.5.9>    Compiling heapless v0.8.01207pg_graphql-1.5.9>    Compiling tap v1.0.11208pg_graphql-1.5.9>    Compiling void v1.0.21209pg_graphql-1.5.9>    Compiling unreachable v1.0.01210pg_graphql-1.5.9>    Compiling wyz v0.5.11211pg_graphql-1.5.9>    Compiling pgrx-macros v0.12.61212pg_graphql-1.5.9>    Compiling darling v0.14.41213pg_graphql-1.5.9>    Compiling hash32 v0.3.11214pg_graphql-1.5.9>    Compiling rand_core v0.6.41215pg_graphql-1.5.9>    Compiling enum-map-derive v0.17.01216pg_graphql-1.5.9>    Compiling ascii v0.9.31217pg_graphql-1.5.9>    Compiling ppv-lite86 v0.2.171218pg_graphql-1.5.9>    Compiling sptr v0.3.21219pg_graphql-1.5.9>    Compiling stable_deref_trait v1.2.01220pg_graphql-1.5.9>    Compiling half v1.8.31221pg_graphql-1.5.9>    Compiling funty v2.0.01222pg_graphql-1.5.9>    Compiling bitvec v1.0.11223pg_graphql-1.5.9>    Compiling serde_cbor v0.11.21224pg_graphql-1.5.9>    Compiling rand_chacha v0.3.11225pg_graphql-1.5.9>    Compiling combine v3.8.11226pg_graphql-1.5.9>    Compiling enum-map v2.7.31227pg_graphql-1.5.9>    Compiling cached_proc_macro v0.18.11228pg_graphql-1.5.9>    Compiling uuid v1.8.01229pg_graphql-1.5.9>    Compiling instant v0.1.121230pg_graphql-1.5.9>    Compiling seahash v4.1.01231pg_graphql-1.5.9>    Compiling cached_proc_macro_types v0.1.11232pg_graphql-1.5.9>    Compiling cached v0.46.11233pg_graphql-1.5.9>    Compiling graphql-parser v0.4.01234pg_graphql-1.5.9>    Compiling rand v0.8.51235pg_graphql-1.5.9>    Compiling itertools v0.10.51236pg_graphql-1.5.9>    Compiling bimap v0.6.31237pg_graphql-1.5.9>    Compiling lazy_static v1.4.01238pg_graphql-1.5.9>    Compiling base64 v0.13.11239pg_graphql-1.5.9>    Compiling pgrx v0.12.61240building '/nix/store/2g7vgzxilw1jrqvk2nww87l24i8vk9vh-pg_net-0.20.4.drv' on 'ssh-ng://nixbot-remote-build@78.232.36.247'1241building '/nix/store/2g7vgzxilw1jrqvk2nww87l24i8vk9vh-pg_net-0.20.4.drv'1242pg_net-0.20.4> Running phase: unpackPhase1243pg_net-0.20.4> unpacking source archive /nix/store/29pmmzv8rhqja1mwjzsnxdm8vy2f6iqh-source1244pg_net-0.20.4> source root is source1245pg_net-0.20.4> Running phase: patchPhase1246pg_net-0.20.4> Running phase: updateAutotoolsGnuConfigScriptsPhase1247pg_net-0.20.4> Running phase: configurePhase1248pg_net-0.20.4> no configure script, doing nothing1249pg_net-0.20.4> Running phase: buildPhase1250pg_net-0.20.4> gcc -Wall -Wmissing-prototypes -Wpointer-arith -Wdeclaration-after-statement -Werror=vla -Wendif-labels -Wmissing-format-attribute -Wimplicit-fallthrough=3 -Wcast-function-type -Wshadow=compatible-local -Wformat-security -fno-strict-aliasing -fwrapv -fexcess-precision=standard -Wno-format-truncation -Wno-stringop-truncation -moutline-atomics -g -O2 -std=c11 -Wextra -Wall -Werror -Wno-declaration-after-statement -Wno-vla -Wno-long-long -Wmissing-variable-declarations -fPIC -fvisibility=hidden  -DEXTVERSION=\"0.20.4\" -I. -I./ -I/nix/store/pmaflmk45425rq04ajcb4yhm58w6hq3p-postgresql-17_22/include/server -I/nix/store/pmaflmk45425rq04ajcb4yhm58w6hq3p-postgresql-17_22/include/internal -D_GNU_SOURCE  -I/nix/store/n8zb5iyyaqfrjmdgibap9j6a29y1cl41-libxml2-2.15.4-dev/include/libxml2 -I/nix/store/3gx080m9qfv8k0sff9bg5877n6zd9kv8-lz4-1.10.0-dev/include -I/nix/store/3y8mdshg1hkwpcnzhhd1q71p2wps47d4-zstd-1.5.7-dev/include -I/nix/store/qm179cq3lxwcmmm6lnkfghiw67zjbm3c-icu4c-75.1-dev/include  -c -o src/core.o src/core.c1251pg_net-0.20.4> gcc -Wall -Wmissing-prototypes -Wpointer-arith -Wdeclaration-after-statement -Werror=vla -Wendif-labels -Wmissing-format-attribute -Wimplicit-fallthrough=3 -Wcast-function-type -Wshadow=compatible-local -Wformat-security -fno-strict-aliasing -fwrapv -fexcess-precision=standard -Wno-format-truncation -Wno-stringop-truncation -moutline-atomics -g -O2 -std=c11 -Wextra -Wall -Werror -Wno-declaration-after-statement -Wno-vla -Wno-long-long -Wmissing-variable-declarations -fPIC -fvisibility=hidden  -DEXTVERSION=\"0.20.4\" -I. -I./ -I/nix/store/pmaflmk45425rq04ajcb4yhm58w6hq3p-postgresql-17_22/include/server -I/nix/store/pmaflmk45425rq04ajcb4yhm58w6hq3p-postgresql-17_22/include/internal -D_GNU_SOURCE  -I/nix/store/n8zb5iyyaqfrjmdgibap9j6a29y1cl41-libxml2-2.15.4-dev/include/libxml2 -I/nix/store/3gx080m9qfv8k0sff9bg5877n6zd9kv8-lz4-1.10.0-dev/include -I/nix/store/3y8mdshg1hkwpcnzhhd1q71p2wps47d4-zstd-1.5.7-dev/include -I/nix/store/qm179cq3lxwcmmm6lnkfghiw67zjbm3c-icu4c-75.1-dev/include  -c -o src/errors.o src/errors.c1252pg_net-0.20.4> gcc -Wall -Wmissing-prototypes -Wpointer-arith -Wdeclaration-after-statement -Werror=vla -Wendif-labels -Wmissing-format-attribute -Wimplicit-fallthrough=3 -Wcast-function-type -Wshadow=compatible-local -Wformat-security -fno-strict-aliasing -fwrapv -fexcess-precision=standard -Wno-format-truncation -Wno-stringop-truncation -moutline-atomics -g -O2 -std=c11 -Wextra -Wall -Werror -Wno-declaration-after-statement -Wno-vla -Wno-long-long -Wmissing-variable-declarations -fPIC -fvisibility=hidden  -DEXTVERSION=\"0.20.4\" -I. -I./ -I/nix/store/pmaflmk45425rq04ajcb4yhm58w6hq3p-postgresql-17_22/include/server -I/nix/store/pmaflmk45425rq04ajcb4yhm58w6hq3p-postgresql-17_22/include/internal -D_GNU_SOURCE  -I/nix/store/n8zb5iyyaqfrjmdgibap9j6a29y1cl41-libxml2-2.15.4-dev/include/libxml2 -I/nix/store/3gx080m9qfv8k0sff9bg5877n6zd9kv8-lz4-1.10.0-dev/include -I/nix/store/3y8mdshg1hkwpcnzhhd1q71p2wps47d4-zstd-1.5.7-dev/include -I/nix/store/qm179cq3lxwcmmm6lnkfghiw67zjbm3c-icu4c-75.1-dev/include  -c -o src/event.o src/event.c1253pg_net-0.20.4> gcc -Wall -Wmissing-prototypes -Wpointer-arith -Wdeclaration-after-statement -Werror=vla -Wendif-labels -Wmissing-format-attribute -Wimplicit-fallthrough=3 -Wcast-function-type -Wshadow=compatible-local -Wformat-security -fno-strict-aliasing -fwrapv -fexcess-precision=standard -Wno-format-truncation -Wno-stringop-truncation -moutline-atomics -g -O2 -std=c11 -Wextra -Wall -Werror -Wno-declaration-after-statement -Wno-vla -Wno-long-long -Wmissing-variable-declarations -fPIC -fvisibility=hidden  -DEXTVERSION=\"0.20.4\" -I. -I./ -I/nix/store/pmaflmk45425rq04ajcb4yhm58w6hq3p-postgresql-17_22/include/server -I/nix/store/pmaflmk45425rq04ajcb4yhm58w6hq3p-postgresql-17_22/include/internal -D_GNU_SOURCE  -I/nix/store/n8zb5iyyaqfrjmdgibap9j6a29y1cl41-libxml2-2.15.4-dev/include/libxml2 -I/nix/store/3gx080m9qfv8k0sff9bg5877n6zd9kv8-lz4-1.10.0-dev/include -I/nix/store/3y8mdshg1hkwpcnzhhd1q71p2wps47d4-zstd-1.5.7-dev/include -I/nix/store/qm179cq3lxwcmmm6lnkfghiw67zjbm3c-icu4c-75.1-dev/include  -c -o src/util.o src/util.c1254pg_net-0.20.4> gcc -Wall -Wmissing-prototypes -Wpointer-arith -Wdeclaration-after-statement -Werror=vla -Wendif-labels -Wmissing-format-attribute -Wimplicit-fallthrough=3 -Wcast-function-type -Wshadow=compatible-local -Wformat-security -fno-strict-aliasing -fwrapv -fexcess-precision=standard -Wno-format-truncation -Wno-stringop-truncation -moutline-atomics -g -O2 -std=c11 -Wextra -Wall -Werror -Wno-declaration-after-statement -Wno-vla -Wno-long-long -Wmissing-variable-declarations -fPIC -fvisibility=hidden  -DEXTVERSION=\"0.20.4\" -I. -I./ -I/nix/store/pmaflmk45425rq04ajcb4yhm58w6hq3p-postgresql-17_22/include/server -I/nix/store/pmaflmk45425rq04ajcb4yhm58w6hq3p-postgresql-17_22/include/internal -D_GNU_SOURCE  -I/nix/store/n8zb5iyyaqfrjmdgibap9j6a29y1cl41-libxml2-2.15.4-dev/include/libxml2 -I/nix/store/3gx080m9qfv8k0sff9bg5877n6zd9kv8-lz4-1.10.0-dev/include -I/nix/store/3y8mdshg1hkwpcnzhhd1q71p2wps47d4-zstd-1.5.7-dev/include -I/nix/store/qm179cq3lxwcmmm6lnkfghiw67zjbm3c-icu4c-75.1-dev/include  -c -o src/worker.o src/worker.c1255pg_net-0.20.4> gcc -Wall -Wmissing-prototypes -Wpointer-arith -Wdeclaration-after-statement -Werror=vla -Wendif-labels -Wmissing-format-attribute -Wimplicit-fallthrough=3 -Wcast-function-type -Wshadow=compatible-local -Wformat-security -fno-strict-aliasing -fwrapv -fexcess-precision=standard -Wno-format-truncation -Wno-stringop-truncation -moutline-atomics -g -O2 -std=c11 -Wextra -Wall -Werror -Wno-declaration-after-statement -Wno-vla -Wno-long-long -Wmissing-variable-declarations -fPIC -fvisibility=hidden -shared -o pg_net.so  src/core.o  src/errors.o  src/event.o  src/util.o  src/worker.o  -L/nix/store/j71vd8cq510zphc7wk56959mij4dfriv-postgresql-17_22-lib/lib    -L/nix/store/xjnvfcp3i347rp7zncsw5vdp7wgnpyaf-libxml2-2.15.4/lib -L/nix/store/yq0c2jhzc3877vagbkwxinm80wajlkh6-lz4-1.10.0-lib/lib -L/nix/store/i8f26lwk8i93hmiyrmsy752m6nwi4pmk-zstd-1.5.7/lib -Wl,--as-needed -Wl,-rpath,'/nix/store/j71vd8cq510zphc7wk56959mij4dfriv-postgresql-17_22-lib/lib',--enable-new-dtags -fvisibility=hidden -lcurl 1256pg_net-0.20.4> cp sql/pg_net.sql sql/pg_net--0.20.4.sql1257pg_net-0.20.4> sed "s/@EXTVERSION@/0.20.4/g" pg_net.control.in > pg_net.control1258pg_net-0.20.4> Running phase: installPhase1259pg_net-0.20.4> Running phase: fixupPhase1260pg_net-0.20.4> shrinking RPATHs of ELF executables and libraries in /nix/store/sraf558prmkrrx9pyc9ynb4v7xv5vnpd-pg_net-0.20.41261pg_net-0.20.4> shrinking /nix/store/sraf558prmkrrx9pyc9ynb4v7xv5vnpd-pg_net-0.20.4/lib/pg_net-0.20.4.so1262pg_net-0.20.4> checking for references to /build/ in /nix/store/sraf558prmkrrx9pyc9ynb4v7xv5vnpd-pg_net-0.20.4...1263pg_net-0.20.4> patching script interpreter paths in /nix/store/sraf558prmkrrx9pyc9ynb4v7xv5vnpd-pg_net-0.20.41264pg_net-0.20.4> stripping (with command strip and flags -S -p) in  /nix/store/sraf558prmkrrx9pyc9ynb4v7xv5vnpd-pg_net-0.20.4/lib1265pg_graphql-1.5.9>    Compiling pg_graphql v1.5.9 (/build/source)1266building '/nix/store/9hcgh425487agi7v1yayivzsm8ivl63p-pg_net-0.8.0.drv' on 'ssh-ng://nixbot-remote-build@78.232.36.247'1267building '/nix/store/9hcgh425487agi7v1yayivzsm8ivl63p-pg_net-0.8.0.drv'1268pg_net-0.8.0> Running phase: unpackPhase1269pg_net-0.8.0> unpacking source archive /nix/store/wyisw4pmqj8gjmbxnwlqkiccx6xbnm3g-source1270pg_net-0.8.0> source root is source1271pg_net-0.8.0> Running phase: patchPhase1272pg_net-0.8.0> Running phase: updateAutotoolsGnuConfigScriptsPhase1273pg_net-0.8.0> Running phase: configurePhase1274pg_net-0.8.0> no configure script, doing nothing1275pg_net-0.8.0> Running phase: buildPhase1276pg_net-0.8.0> gcc -Wall -Wmissing-prototypes -Wpointer-arith -Wdeclaration-after-statement -Werror=vla -Wendif-labels -Wmissing-format-attribute -Wimplicit-fallthrough=3 -Wcast-function-type -Wformat-security -fno-strict-aliasing -fwrapv -fexcess-precision=standard -Wno-deprecated-non-prototype -Wno-format-truncation -Wno-stringop-truncation -g -O2 -std=gnu17 -Werror -Wno-declaration-after-statement -fPIC  -DEXTVERSION=\"0.8.0\" -I. -I./ -I/nix/store/bc9327c6474vwmqmhkszkmiz86mba73s-postgresql-15.19/include/server -I/nix/store/bc9327c6474vwmqmhkszkmiz86mba73s-postgresql-15.19/include/internal -D_GNU_SOURCE  -I/nix/store/n8zb5iyyaqfrjmdgibap9j6a29y1cl41-libxml2-2.15.4-dev/include/libxml2 -I/nix/store/3gx080m9qfv8k0sff9bg5877n6zd9kv8-lz4-1.10.0-dev/include -I/nix/store/3y8mdshg1hkwpcnzhhd1q71p2wps47d4-zstd-1.5.7-dev/include -I/nix/store/qm179cq3lxwcmmm6lnkfghiw67zjbm3c-icu4c-75.1-dev/include  -c -o src/worker.o src/worker.c1277pg_net-0.8.0> src/worker.c: In function 'init':1278pg_net-0.8.0> src/worker.c:153:9: warning: 'CURLOPT_PROTOCOLS' is deprecated: since 7.85.0. Use CURLOPT_PROTOCOLS_STR [-Wdeprecated-declarations]1279pg_net-0.8.0>   153 |         curl_easy_setopt(eh, CURLOPT_PROTOCOLS, CURLPROTO_HTTP | CURLPROTO_HTTPS);1280pg_net-0.8.0>       |         ^~~~~~~~~~~~~~~~1281pg_net-0.8.0> In file included from src/worker.c:30:1282pg_net-0.8.0> /nix/store/i6jyqhi7zdnf1p1m489mr9r6y8z4jfj6-curl-8.22.0-dev/include/curl/curl.h:1798:3: note: declared here1283pg_net-0.8.0>  1798 |   CURLOPTDEPRECATED(CURLOPT_PROTOCOLS, CURLOPTTYPE_LONG, 181,1284pg_net-0.8.0>       |   ^~~~~~~~~~~~~~~~~1285pg_net-0.8.0> gcc -Wall -Wmissing-prototypes -Wpointer-arith -Wdeclaration-after-statement -Werror=vla -Wendif-labels -Wmissing-format-attribute -Wimplicit-fallthrough=3 -Wcast-function-type -Wformat-security -fno-strict-aliasing -fwrapv -fexcess-precision=standard -Wno-deprecated-non-prototype -Wno-format-truncation -Wno-stringop-truncation -g -O2 -std=gnu17 -Werror -Wno-declaration-after-statement -fPIC  -DEXTVERSION=\"0.8.0\" -I. -I./ -I/nix/store/bc9327c6474vwmqmhkszkmiz86mba73s-postgresql-15.19/include/server -I/nix/store/bc9327c6474vwmqmhkszkmiz86mba73s-postgresql-15.19/include/internal -D_GNU_SOURCE  -I/nix/store/n8zb5iyyaqfrjmdgibap9j6a29y1cl41-libxml2-2.15.4-dev/include/libxml2 -I/nix/store/3gx080m9qfv8k0sff9bg5877n6zd9kv8-lz4-1.10.0-dev/include -I/nix/store/3y8mdshg1hkwpcnzhhd1q71p2wps47d4-zstd-1.5.7-dev/include -I/nix/store/qm179cq3lxwcmmm6lnkfghiw67zjbm3c-icu4c-75.1-dev/include  -c -o src/util.o src/util.c1286pg_net-0.8.0> gcc -Wall -Wmissing-prototypes -Wpointer-arith -Wdeclaration-after-statement -Werror=vla -Wendif-labels -Wmissing-format-attribute -Wimplicit-fallthrough=3 -Wcast-function-type -Wformat-security -fno-strict-aliasing -fwrapv -fexcess-precision=standard -Wno-deprecated-non-prototype -Wno-format-truncation -Wno-stringop-truncation -g -O2 -std=gnu17 -Werror -Wno-declaration-after-statement -fPIC -shared -o pg_net.so src/worker.o src/util.o -L/nix/store/bs8w2qsyhnqirvhchz9fnvf86y7j6xyf-postgresql-15.19-lib/lib    -L/nix/store/xjnvfcp3i347rp7zncsw5vdp7wgnpyaf-libxml2-2.15.4/lib -L/nix/store/yq0c2jhzc3877vagbkwxinm80wajlkh6-lz4-1.10.0-lib/lib -L/nix/store/i8f26lwk8i93hmiyrmsy752m6nwi4pmk-zstd-1.5.7/lib -Wl,--as-needed -Wl,-rpath,'/nix/store/bs8w2qsyhnqirvhchz9fnvf86y7j6xyf-postgresql-15.19-lib/lib',--enable-new-dtags  -lcurl 1287pg_net-0.8.0> cp sql/pg_net.sql sql/pg_net--0.8.0.sql1288pg_net-0.8.0> sed "s/@PG_NET_VERSION@/0.8.0/g" pg_net.control.in > pg_net.control1289pg_net-0.8.0> Running phase: installPhase1290pg_net-0.8.0> Running phase: fixupPhase1291pg_net-0.8.0> shrinking RPATHs of ELF executables and libraries in /nix/store/mwgqnagjxzvlz0r221z6vh4rqail1d0x-pg_net-0.8.01292pg_net-0.8.0> shrinking /nix/store/mwgqnagjxzvlz0r221z6vh4rqail1d0x-pg_net-0.8.0/lib/pg_net-0.8.0.so1293pg_net-0.8.0> checking for references to /build/ in /nix/store/mwgqnagjxzvlz0r221z6vh4rqail1d0x-pg_net-0.8.0...1294pg_net-0.8.0> patching script interpreter paths in /nix/store/mwgqnagjxzvlz0r221z6vh4rqail1d0x-pg_net-0.8.01295pg_net-0.8.0> stripping (with command strip and flags -S -p) in  /nix/store/mwgqnagjxzvlz0r221z6vh4rqail1d0x-pg_net-0.8.0/lib1296pg_graphql-1.5.9>     Finished `dev` profile [unoptimized + debuginfo] target(s) in 3m 13s1297pg_graphql-1.5.9>      Writing SQL entities to /nix/store/qkbj2jmwjp1a305cacw5dnzw8c1k64hv-pg_graphql-1.5.9/nix/store/pmaflmk45425rq04ajcb4yhm58w6hq3p-postgresql-17_22/share/postgresql/extension/pg_graphql--1.5.9.sql1298pg_graphql-1.5.9>     Finished installing pg_graphql1299pg_graphql-1.5.9> buildPhase completed in 7 minutes 45 seconds1300pg_graphql-1.5.9> Running phase: checkPhase1301pg_graphql-1.5.9>    Validating /nix/store/pmaflmk45425rq04ajcb4yhm58w6hq3p-postgresql-17_22/bin/pg_config1302pg_graphql-1.5.9>  Initializing data directory at /build/tmp.XFbrOPgyf6/data-171303pg_graphql-1.5.9> waiting for server to start....2026-10-27 12:59:53.798 GMT [4829] LOG:  starting PostgreSQL 17.11 on aarch64-unknown-linux-gnu, compiled by gcc (GCC) 15.3.0, 64-bit1304pg_graphql-1.5.9> 2026-10-27 12:59:53.800 GMT [4829] LOG:  listening on Unix socket "/build/tmp.xW21SNwkx9/.s.PGSQL.5432"1305pg_graphql-1.5.9> 2026-10-27 12:59:53.809 GMT [4832] LOG:  database system was shut down at 2026-10-27 12:59:53 GMT1306pg_graphql-1.5.9> 2026-10-27 12:59:53.815 GMT [4829] LOG:  database system is ready to accept connections1307pg_graphql-1.5.9>  done1308pg_graphql-1.5.9> server started1309pg_graphql-1.5.9> createuser: error: connection to server at "localhost" (127.0.0.1), port 5432 failed: Connection refused1310pg_graphql-1.5.9> 	Is the server running on that host and accepting TCP/IP connections?1311pg_graphql-1.5.9> waiting for server to shut down....2026-10-27 12:59:53.880 GMT [4829] LOG:  received fast shutdown request1312pg_graphql-1.5.9> 2026-10-27 12:59:53.883 GMT [4829] LOG:  aborting any active transactions1313pg_graphql-1.5.9> 2026-10-27 12:59:53.885 GMT [4829] LOG:  background worker "logical replication launcher" (PID 4835) exited with exit code 11314pg_graphql-1.5.9> 2026-10-27 12:59:53.885 GMT [4830] LOG:  shutting down1315pg_graphql-1.5.9> 2026-10-27 12:59:53.891 GMT [4830] LOG:  checkpoint starting: shutdown immediate1316pg_graphql-1.5.9> 2026-10-27 12:59:53.906 GMT [4830] LOG:  checkpoint complete: wrote 3 buffers (0.0%); 0 WAL file(s) added, 0 removed, 0 recycled; write=0.005 s, sync=0.002 s, total=0.021 s; sync files=2, longest=0.001 s, average=0.001 s; distance=0 kB, estimate=0 kB; lsn=0/14EC910, redo lsn=0/14EC9101317pg_graphql-1.5.9> 2026-10-27 12:59:53.912 GMT [4829] LOG:  database system is shut down1318pg_graphql-1.5.9>  done1319pg_graphql-1.5.9> server stopped1320pg_graphql-1.5.9>    Validating /build/tmp.mFe56VKXuP/17/bin/pg_config1321pg_graphql-1.5.9>  Initializing data directory at /build/tmp.mFe56VKXuP/data-171322pg_graphql-1.5.9>        Using PgConfig("pg17") and `pg_config` from /build/tmp.mFe56VKXuP/17/bin/pg_config1323pg_graphql-1.5.9>     Building extension with features pg171324pg_graphql-1.5.9>      Running command "/nix/store/ymh217xdvqvnxz3qijbg3mnqz44xl73f-rust-default-1.81.0/bin/cargo" "build" "--lib" "--release" "--features" "pg17" "--no-default-features" "--message-format=json-render-diagnostics" "--frozen" "-j" "2"1325pg_graphql-1.5.9>     Finished `release` profile [optimized] target(s) in 0.13s1326pg_graphql-1.5.9>   Installing extension1327pg_graphql-1.5.9>      Copying control file to /build/tmp.mFe56VKXuP/17/share/postgresql/extension/pg_graphql.control1328pg_graphql-1.5.9>      Copying shared library to /build/tmp.mFe56VKXuP/17/lib/pg_graphql.so1329pg_graphql-1.5.9>   Discovered 5 SQL entities: 0 schemas (0 unique), 1 functions, 0 types, 0 enums, 4 sqls, 0 ords, 0 hashes, 0 aggregates, 0 triggers1330pg_graphql-1.5.9>   Rebuilding pgrx_embed, in debug mode, for SQL generation with features pg171331pg_graphql-1.5.9>    Compiling pg_graphql v1.5.9 (/build/source)1332pg_graphql-1.5.9>     Finished `dev` profile [unoptimized + debuginfo] target(s) in 24.95s1333pg_graphql-1.5.9>      Writing SQL entities to /build/tmp.mFe56VKXuP/17/share/postgresql/extension/pg_graphql--1.5.9.sql1334pg_graphql-1.5.9>     Finished installing pg_graphql1335pg_graphql-1.5.9> ++ mktemp -d1336pg_graphql-1.5.9> + TMPDIR=/build/tmp.g3BpdnTS8i1337pg_graphql-1.5.9> + export PGDATA=/build/tmp.g3BpdnTS8i1338pg_graphql-1.5.9> + PGDATA=/build/tmp.g3BpdnTS8i1339pg_graphql-1.5.9> + export PGHOST=/build/tmp.g3BpdnTS8i1340pg_graphql-1.5.9> + PGHOST=/build/tmp.g3BpdnTS8i1341pg_graphql-1.5.9> + export PGUSER=postgres1342pg_graphql-1.5.9> + PGUSER=postgres1343pg_graphql-1.5.9> + export PGDATABASE=postgres1344pg_graphql-1.5.9> + PGDATABASE=postgres1345pg_graphql-1.5.9> + export PGTZ=UTC1346pg_graphql-1.5.9> + PGTZ=UTC1347pg_graphql-1.5.9> + export PG_COLOR=auto1348pg_graphql-1.5.9> + PG_COLOR=auto1349pg_graphql-1.5.9> + trap 'pg_ctl stop -m i' sigint sigterm exit1350pg_graphql-1.5.9> + rm -rf /build/tmp.g3BpdnTS8i1351pg_graphql-1.5.9> + initdb --no-locale --encoding=UTF8 --nosync -U postgres1352pg_graphql-1.5.9> The files belonging to this database system will be owned by user "nixbld".1353pg_graphql-1.5.9> This user must also own the server process.1354pg_graphql-1.5.9> 1355pg_graphql-1.5.9> The database cluster will be initialized with locale "C".1356pg_graphql-1.5.9> The default text search configuration will be set to "english".1357pg_graphql-1.5.9> 1358pg_graphql-1.5.9> Data page checksums are disabled.1359pg_graphql-1.5.9> 1360pg_graphql-1.5.9> creating directory /build/tmp.g3BpdnTS8i ... ok1361pg_graphql-1.5.9> creating subdirectories ... ok1362pg_graphql-1.5.9> selecting dynamic shared memory implementation ... posix1363pg_graphql-1.5.9> selecting default "max_connections" ... 1001364pg_graphql-1.5.9> selecting default "shared_buffers" ... 128MB1365pg_graphql-1.5.9> selecting default time zone ... UTC1366pg_graphql-1.5.9> creating configuration files ... ok1367pg_graphql-1.5.9> running bootstrap script ... ok1368pg_graphql-1.5.9> performing post-bootstrap initialization ... ok1369pg_graphql-1.5.9> 1370pg_graphql-1.5.9> Sync to disk skipped.1371pg_graphql-1.5.9> The data directory might become corrupt if the operating system crashes.1372pg_graphql-1.5.9> 1373pg_graphql-1.5.9> initdb: warning: enabling "trust" authentication for local connections1374pg_graphql-1.5.9> initdb: hint: You can change this by editing pg_hba.conf or using the option -A, or --auth-local and --auth-host, the next time you run initdb.1375pg_graphql-1.5.9> 1376pg_graphql-1.5.9> Success. You can now start the database server using:1377pg_graphql-1.5.9> 1378pg_graphql-1.5.9>     /build/tmp.mFe56VKXuP/17/bin/pg_ctl -D /build/tmp.g3BpdnTS8i -l logfile start1379pg_graphql-1.5.9> 1380pg_graphql-1.5.9> + pg_ctl start -o '-F -c listen_addresses="" -c log_min_messages=WARNING -k /build/tmp.g3BpdnTS8i'1381pg_graphql-1.5.9> waiting for server to start....2026-10-27 13:00:22.079 UTC [5118] LOG:  starting PostgreSQL 17.11 on aarch64-unknown-linux-gnu, compiled by gcc (GCC) 15.3.0, 64-bit1382pg_graphql-1.5.9> 2026-10-27 13:00:22.079 UTC [5118] LOG:  listening on Unix socket "/build/tmp.g3BpdnTS8i/.s.PGSQL.5432"1383pg_graphql-1.5.9> 2026-10-27 13:00:22.081 UTC [5121] LOG:  database system was shut down at 2026-10-27 13:00:22 UTC1384pg_graphql-1.5.9> 2026-10-27 13:00:22.084 UTC [5118] LOG:  database system is ready to accept connections1385pg_graphql-1.5.9>  done1386pg_graphql-1.5.9> server started1387pg_graphql-1.5.9> + createdb contrib_regression1388pg_graphql-1.5.9> + TESTDIR=test1389pg_graphql-1.5.9> +++ pg_config --pgxs1390pg_graphql-1.5.9> ++ dirname /nix/store/pmaflmk45425rq04ajcb4yhm58w6hq3p-postgresql-17_22/lib/pgxs/src/makefiles/pgxs.mk1391pg_graphql-1.5.9> + PGXS=/nix/store/pmaflmk45425rq04ajcb4yhm58w6hq3p-postgresql-17_22/lib/pgxs/src/makefiles1392pg_graphql-1.5.9> + REGRESS=/nix/store/pmaflmk45425rq04ajcb4yhm58w6hq3p-postgresql-17_22/lib/pgxs/src/makefiles/../test/regress/pg_regress1393pg_graphql-1.5.9> + '[' 0 -ne 0 ']'1394pg_graphql-1.5.9> ++ ls test/sql1395pg_graphql-1.5.9> ++ sed -e 's/\..*$//'1396pg_graphql-1.5.9> ++ sort1397pg_graphql-1.5.9> + TESTS=$'aliases\nallow_camel_names\narray_args_and_return_types\nbigint_is_string\nbuiltin_directives\ncomment_directive\ncomment_directive_description\ncompound_filters\nempty_mutations\nenum_mappings\nextend_type_with_function\nextend_type_with_function_relation\nextend_type_with_generated_column\nfilter_by_node_id\nfragment_on_mutation\nfragment_on_query\nfunction_calls\nfunction_calls_default_args\nfunction_calls_unsupported\nfunction_return_row_is_selectable\nfunction_return_view_has_pkey\ninflection_fields\ninflection_function\ninflection_relationships\ninflection_types\nissue_163\nissue_170\nissue_225\nissue_237_field_merging\nissue_237_field_merging_mismatched\nissue_300\nissue_306\nissue_312\nissue_334_ambiguous_function\nissue_337\nissue_339_function_return_json\nissue_339_function_return_table\nissue_353_too_many_fields\nissue_370_citext_as_string\nissue_373\nissue_377_enum_search_path\nissue_409_fkey_rls_nullability\nissue_444\nissue_463\nissue_511\nissue_533\nissue_542_partial_unique\nissue_551_too_many_fields\nissue_557_1_to_1_nullability\nissue_fragment_spread_cycles\njson_is_stringified\nmax_page_size\nmax_rows_directive\nmulti_column_primary_key\nmultiple_mutations\nmultiple_queries\nmutation_delete\nmutation_delete_variable\nmutation_insert\nmutation_update\nnull_argument\nomit_exotic_types\nomit_weird_names\noperation_name\noverride_enum_name\noverride_field_name\noverride_func_field_name\noverride_relationship_field_name\noverride_type_name\npage_info\npermissions_connection_column\npermissions_functions\npermissions_node_column\npermissions_table_level\npermissions_types\nprimary_key_is_required\nrelationship_one_to_one\nresolve___schema\nresolve___type\nresolve___typename\nresolve_array_type\nresolve_connection_filter\nresolve_connection_named\nresolve_connection_order_by\nresolve_connection_pagination_args\nresolve_connection_to_conn\nresolve_connection_to_node\nresolve_error_connection_edge_no_field\nresolve_error_connection_edge_node_no_field\nresolve_error_connection_no_field\nresolve_error_from_parser\nresolve_error_mutation_no_field\nresolve_error_node_no_field\nresolve_error_query_no_field\nresolve_fragment\nresolve_graphiql_schema\nresolve_one\nroundtrip_types\nrow_level_security\nsqli_connection\nstring_filters\ntest_error_anon_and_named_operations\ntest_error_invalid_offset\ntest_error_multiple_anon_operations\ntest_error_mutation_transpilation\ntest_error_operation_name_not_found\ntest_error_operation_names_not_unique\ntest_error_parsing\ntest_error_query_transpilation\ntest_error_subscription\ntest_query__type\ntotal_count\ntype_bigfloat\ntype_modifier_max_length\ntype_opaque\nvariable_default\nviews_integration'1398pg_graphql-1.5.9> + psql -v ON_ERROR_STOP=1 -f test/fixtures.sql -d contrib_regression1399pg_graphql-1.5.9> psql:test/fixtures.sql:1: NOTICE:  extension "pg_graphql" does not exist, skipping1400pg_graphql-1.5.9> DROP EXTENSION1401pg_graphql-1.5.9> CREATE EXTENSION1402pg_graphql-1.5.9> COMMENT1403pg_graphql-1.5.9> CREATE FUNCTION1404pg_graphql-1.5.9> + /nix/store/pmaflmk45425rq04ajcb4yhm58w6hq3p-postgresql-17_22/lib/pgxs/src/makefiles/../test/regress/pg_regress --use-existing --dbname=contrib_regression --inputdir=test aliases allow_camel_names array_args_and_return_types bigint_is_string builtin_directives comment_directive comment_directive_description compound_filters empty_mutations enum_mappings extend_type_with_function extend_type_with_function_relation extend_type_with_generated_column filter_by_node_id fragment_on_mutation fragment_on_query function_calls function_calls_default_args function_calls_unsupported function_return_row_is_selectable function_return_view_has_pkey inflection_fields inflection_function inflection_relationships inflection_types issue_163 issue_170 issue_225 issue_237_field_merging issue_237_field_merging_mismatched issue_300 issue_306 issue_312 issue_334_ambiguous_function issue_337 issue_339_function_return_json issue_339_function_return_table issue_353_too_many_fields issue_370_citext_as_string issue_373 issue_377_enum_search_path issue_409_fkey_rls_nullability issue_444 issue_463 issue_511 issue_533 issue_542_partial_unique issue_551_too_many_fields issue_557_1_to_1_nullability issue_fragment_spread_cycles json_is_stringified max_page_size max_rows_directive multi_column_primary_key multiple_mutations multiple_queries mutation_delete mutation_delete_variable mutation_insert mutation_update null_argument omit_exotic_types omit_weird_names operation_name override_enum_name override_field_name override_func_field_name override_relationship_field_name override_type_name page_info permissions_connection_column permissions_functions permissions_node_column permissions_table_level permissions_types primary_key_is_required relationship_one_to_one resolve___schema resolve___type resolve___typename resolve_array_type resolve_connection_filter resolve_connection_named resolve_connection_order_by resolve_connection_pagination_args resolve_connection_to_conn resolve_connection_to_node resolve_error_connection_edge_no_field resolve_error_connection_edge_node_no_field resolve_error_connection_no_field resolve_error_from_parser resolve_error_mutation_no_field resolve_error_node_no_field resolve_error_query_no_field resolve_fragment resolve_graphiql_schema resolve_one roundtrip_types row_level_security sqli_connection string_filters test_error_anon_and_named_operations test_error_invalid_offset test_error_multiple_anon_operations test_error_mutation_transpilation test_error_operation_name_not_found test_error_operation_names_not_unique test_error_parsing test_error_query_transpilation test_error_subscription test_query__type total_count type_bigfloat type_modifier_max_length type_opaque variable_default views_integration1405pg_graphql-1.5.9> # using postmaster on /build/tmp.g3BpdnTS8i, default port1406pg_graphql-1.5.9> ok 1         - aliases                                    56 ms1407pg_graphql-1.5.9> ok 2         - allow_camel_names                          54 ms1408pg_graphql-1.5.9> ok 3         - array_args_and_return_types              1514 ms1409pg_graphql-1.5.9> ok 4         - bigint_is_string                           52 ms1410pg_graphql-1.5.9> ok 5         - builtin_directives                         59 ms1411pg_graphql-1.5.9> ok 6         - comment_directive                          10 ms1412pg_graphql-1.5.9> ok 7         - comment_directive_description              46 ms1413pg_graphql-1.5.9> ok 8         - compound_filters                          245 ms1414pg_graphql-1.5.9> ok 9         - empty_mutations                            51 ms1415pg_graphql-1.5.9> ok 10        - enum_mappings                              55 ms1416pg_graphql-1.5.9> ok 11        - extend_type_with_function                  56 ms1417pg_graphql-1.5.9> ok 12        - extend_type_with_function_relation        139 ms1418pg_graphql-1.5.9> ok 13        - extend_type_with_generated_column          49 ms1419pg_graphql-1.5.9> ok 14        - filter_by_node_id                          55 ms1420pg_graphql-1.5.9> ok 15        - fragment_on_mutation                       47 ms1421pg_graphql-1.5.9> ok 16        - fragment_on_query                          48 ms1422pg_graphql-1.5.9> ok 17        - function_calls                           1433 ms1423pg_graphql-1.5.9> ok 18        - function_calls_default_args                97 ms1424pg_graphql-1.5.9> ok 19        - function_calls_unsupported                292 ms1425pg_graphql-1.5.9> ok 20        - function_return_row_is_selectable          80 ms1426pg_graphql-1.5.9> ok 21        - function_return_view_has_pkey              77 ms1427pg_graphql-1.5.9> ok 22        - inflection_fields                         126 ms1428pg_graphql-1.5.9> ok 23        - inflection_function                       128 ms1429pg_graphql-1.5.9> ok 24        - inflection_relationships                  192 ms1430pg_graphql-1.5.9> ok 25        - inflection_types                          127 ms1431pg_graphql-1.5.9> ok 26        - issue_163                                  48 ms1432pg_graphql-1.5.9> ok 27        - issue_170                                  48 ms1433pg_graphql-1.5.9> ok 28        - issue_225                                  52 ms1434pg_graphql-1.5.9> ok 29        - issue_237_field_merging                   102 ms1435pg_graphql-1.5.9> ok 30        - issue_237_field_merging_mismatched         83 ms1436pg_graphql-1.5.9> ok 31        - issue_300                                  52 ms1437pg_graphql-1.5.9> ok 32        - issue_306                                  55 ms1438pg_graphql-1.5.9> ok 33        - issue_312                                  49 ms1439pg_graphql-1.5.9> ok 34        - issue_334_ambiguous_function               50 ms1440pg_graphql-1.5.9> ok 35        - issue_337                                  99 ms1441pg_graphql-1.5.9> ok 36        - issue_339_function_return_json             59 ms1442pg_graphql-1.5.9> ok 37        - issue_339_function_return_table            61 ms1443pg_graphql-1.5.9> ok 38        - issue_353_too_many_fields                  72 ms1444pg_graphql-1.5.9> ok 39        - issue_370_citext_as_string                 67 ms1445pg_graphql-1.5.9> ok 40        - issue_373                                  53 ms1446pg_graphql-1.5.9> ok 41        - issue_377_enum_search_path                 75 ms1447pg_graphql-1.5.9> ok 42        - issue_409_fkey_rls_nullability            112 ms1448pg_graphql-1.5.9> ok 43        - issue_444                                  53 ms1449pg_graphql-1.5.9> ok 44        - issue_463                                  50 ms1450pg_graphql-1.5.9> ok 45        - issue_511                                  78 ms1451pg_graphql-1.5.9> ok 46        - issue_533                                 104 ms1452pg_graphql-1.5.9> ok 47        - issue_542_partial_unique                   83 ms1453pg_graphql-1.5.9> ok 48        - issue_551_too_many_fields                  68 ms1454pg_graphql-1.5.9> ok 49        - issue_557_1_to_1_nullability               56 ms1455pg_graphql-1.5.9> ok 50        - issue_fragment_spread_cycles              205 ms1456pg_graphql-1.5.9> ok 51        - json_is_stringified                        56 ms1457pg_graphql-1.5.9> ok 52        - max_page_size                              51 ms1458pg_graphql-1.5.9> ok 53        - max_rows_directive                        101 ms1459pg_graphql-1.5.9> ok 54        - multi_column_primary_key                   62 ms1460pg_graphql-1.5.9> ok 55        - multiple_mutations                         52 ms1461pg_graphql-1.5.9> ok 56        - multiple_queries                           50 ms1462pg_graphql-1.5.9> ok 57        - mutation_delete                            63 ms1463pg_graphql-1.5.9> ok 58        - mutation_delete_variable                   53 ms1464pg_graphql-1.5.9> ok 59        - mutation_insert                            61 ms1465pg_graphql-1.5.9> ok 60        - mutation_update                            65 ms1466pg_graphql-1.5.9> ok 61        - null_argument                              48 ms1467pg_graphql-1.5.9> ok 62        - omit_exotic_types                          55 ms1468pg_graphql-1.5.9> ok 63        - omit_weird_names                           75 ms1469pg_graphql-1.5.9> ok 64        - operation_name                             73 ms1470pg_graphql-1.5.9> ok 65        - override_enum_name                         47 ms1471pg_graphql-1.5.9> ok 66        - override_field_name                        57 ms1472pg_graphql-1.5.9> ok 67        - override_func_field_name                   51 ms1473pg_graphql-1.5.9> ok 68        - override_relationship_field_name           52 ms1474pg_graphql-1.5.9> ok 69        - override_type_name                         50 ms1475pg_graphql-1.5.9> ok 70        - page_info                                  69 ms1476pg_graphql-1.5.9> ok 71        - permissions_connection_column              80 ms1477pg_graphql-1.5.9> ok 72        - permissions_functions                      76 ms1478pg_graphql-1.5.9> ok 73        - permissions_node_column                    86 ms1479pg_graphql-1.5.9> ok 74        - permissions_table_level                   163 ms1480pg_graphql-1.5.9> ok 75        - permissions_types                          97 ms1481pg_graphql-1.5.9> ok 76        - primary_key_is_required                    73 ms1482pg_graphql-1.5.9> ok 77        - relationship_one_to_one                    56 ms1483pg_graphql-1.5.9> ok 78        - resolve___schema                           58 ms1484pg_graphql-1.5.9> ok 79        - resolve___type                             49 ms1485pg_graphql-1.5.9> ok 80        - resolve___typename                         53 ms1486pg_graphql-1.5.9> ok 81        - resolve_array_type                         51 ms1487pg_graphql-1.5.9> ok 82        - resolve_connection_filter                 111 ms1488pg_graphql-1.5.9> ok 83        - resolve_connection_named                   49 ms1489pg_graphql-1.5.9> ok 84        - resolve_connection_order_by               128 ms1490pg_graphql-1.5.9> ok 85        - resolve_connection_pagination_args         99 ms1491pg_graphql-1.5.9> ok 86        - resolve_connection_to_conn                 54 ms1492pg_graphql-1.5.9> ok 87        - resolve_connection_to_node                 54 ms1493pg_graphql-1.5.9> ok 88        - resolve_error_connection_edge_no_field       48 ms1494pg_graphql-1.5.9> ok 89        - resolve_error_connection_edge_node_no_field       48 ms1495pg_graphql-1.5.9> ok 90        - resolve_error_connection_no_field          46 ms1496pg_graphql-1.5.9> ok 91        - resolve_error_from_parser                  11 ms1497pg_graphql-1.5.9> ok 92        - resolve_error_mutation_no_field            42 ms1498pg_graphql-1.5.9> ok 93        - resolve_error_node_no_field                47 ms1499pg_graphql-1.5.9> ok 94        - resolve_error_query_no_field               42 ms1500pg_graphql-1.5.9> ok 95        - resolve_fragment                           49 ms1501pg_graphql-1.5.9> ok 96        - resolve_graphiql_schema                   108 ms1502pg_graphql-1.5.9> ok 97        - resolve_one                                87 ms1503pg_graphql-1.5.9> ok 98        - roundtrip_types                            62 ms1504pg_graphql-1.5.9> ok 99        - row_level_security                         54 ms1505pg_graphql-1.5.9> ok 100       - sqli_connection                            59 ms1506pg_graphql-1.5.9> ok 101       - string_filters                             61 ms1507pg_graphql-1.5.9> ok 102       - test_error_anon_and_named_operations       44 ms1508pg_graphql-1.5.9> ok 103       - test_error_invalid_offset                  75 ms1509pg_graphql-1.5.9> ok 104       - test_error_multiple_anon_operations        42 ms1510pg_graphql-1.5.9> ok 105       - test_error_mutation_transpilation          48 ms1511pg_graphql-1.5.9> ok 106       - test_error_operation_name_not_found        43 ms1512pg_graphql-1.5.9> ok 107       - test_error_operation_names_not_unique       42 ms1513pg_graphql-1.5.9> ok 108       - test_error_parsing                         11 ms1514pg_graphql-1.5.9> ok 109       - test_error_query_transpilation             51 ms1515pg_graphql-1.5.9> ok 110       - test_error_subscription                    42 ms1516pg_graphql-1.5.9> ok 111       - test_query__type                           42 ms1517pg_graphql-1.5.9> ok 112       - total_count                                75 ms1518pg_graphql-1.5.9> ok 113       - type_bigfloat                              52 ms1519pg_graphql-1.5.9> ok 114       - type_modifier_max_length                   51 ms1520pg_graphql-1.5.9> ok 115       - type_opaque                                56 ms1521pg_graphql-1.5.9> ok 116       - variable_default                           52 ms1522pg_graphql-1.5.9> ok 117       - views_integration                         170 ms1523pg_graphql-1.5.9> 1..1171524pg_graphql-1.5.9> # All 117 tests passed.1525pg_graphql-1.5.9> + pg_ctl stop -m i1526pg_graphql-1.5.9> waiting for server to shut down....2026-10-27 13:00:33.582 UTC [5118] LOG:  received immediate shutdown request1527pg_graphql-1.5.9> 2026-10-27 13:00:33.590 UTC [5118] LOG:  database system is shut down1528pg_graphql-1.5.9>  done1529pg_graphql-1.5.9> server stopped1530pg_graphql-1.5.9> checkPhase completed in 41 seconds1531pg_graphql-1.5.9> Running phase: installPhase1532pg_graphql-1.5.9> Executing buildPgrxExtension install1533pg_graphql-1.5.9> Running phase: fixupPhase1534pg_graphql-1.5.9> shrinking RPATHs of ELF executables and libraries in /nix/store/qkbj2jmwjp1a305cacw5dnzw8c1k64hv-pg_graphql-1.5.91535pg_graphql-1.5.9> shrinking /nix/store/qkbj2jmwjp1a305cacw5dnzw8c1k64hv-pg_graphql-1.5.9/lib/pg_graphql-1.5.9.so1536pg_graphql-1.5.9> checking for references to /build/ in /nix/store/qkbj2jmwjp1a305cacw5dnzw8c1k64hv-pg_graphql-1.5.9...1537pg_graphql-1.5.9> patching script interpreter paths in /nix/store/qkbj2jmwjp1a305cacw5dnzw8c1k64hv-pg_graphql-1.5.91538pg_graphql-1.5.9> stripping (with command strip and flags -S -p) in  /nix/store/qkbj2jmwjp1a305cacw5dnzw8c1k64hv-pg_graphql-1.5.9/lib1539building '/nix/store/z6aryaxgd01s3csz3pg904g22a9hw3sl-vector-0.7.0.drv' on 'ssh-ng://nixbot-remote-build@78.232.36.247'1540building '/nix/store/z6aryaxgd01s3csz3pg904g22a9hw3sl-vector-0.7.0.drv'1541vector-0.7.0> Running phase: unpackPhase1542vector-0.7.0> unpacking source archive /nix/store/6zi14y7jriwv1023irw75gsm6iah576x-source1543vector-0.7.0> source root is source1544vector-0.7.0> Running phase: patchPhase1545vector-0.7.0> Running phase: updateAutotoolsGnuConfigScriptsPhase1546vector-0.7.0> Running phase: configurePhase1547vector-0.7.0> no configure script, doing nothing1548vector-0.7.0> Running phase: buildPhase1549vector-0.7.0> build flags: SHELL=/nix/store/pbjg9k27s3v1wp5s8c6pb23s0m69yjwz-bash-5.3p9/bin/bash1550vector-0.7.0> gcc -Wall -Wmissing-prototypes -Wpointer-arith -Wdeclaration-after-statement -Werror=vla -Wendif-labels -Wmissing-format-attribute -Wimplicit-fallthrough=3 -Wcast-function-type -Wshadow=compatible-local -Wformat-security -fno-strict-aliasing -fwrapv -fexcess-precision=standard -Wno-format-truncation -Wno-stringop-truncation -moutline-atomics -g -O2 -march=native -ftree-vectorize -fassociative-math -fno-signed-zeros -fno-trapping-math -fPIC -fvisibility=hidden -I. -I./ -I/nix/store/pmaflmk45425rq04ajcb4yhm58w6hq3p-postgresql-17_22/include/server -I/nix/store/pmaflmk45425rq04ajcb4yhm58w6hq3p-postgresql-17_22/include/internal -D_GNU_SOURCE  -I/nix/store/n8zb5iyyaqfrjmdgibap9j6a29y1cl41-libxml2-2.15.4-dev/include/libxml2 -I/nix/store/3gx080m9qfv8k0sff9bg5877n6zd9kv8-lz4-1.10.0-dev/include -I/nix/store/3y8mdshg1hkwpcnzhhd1q71p2wps47d4-zstd-1.5.7-dev/include -I/nix/store/qm179cq3lxwcmmm6lnkfghiw67zjbm3c-icu4c-75.1-dev/include  -c -o src/bitutils.o src/bitutils.c1551vector-0.7.0> warning: Skipping impure flag -march=native because NIX_ENFORCE_NO_NATIVE is set1552vector-0.7.0> gcc -Wall -Wmissing-prototypes -Wpointer-arith -Wdeclaration-after-statement -Werror=vla -Wendif-labels -Wmissing-format-attribute -Wimplicit-fallthrough=3 -Wcast-function-type -Wshadow=compatible-local -Wformat-security -fno-strict-aliasing -fwrapv -fexcess-precision=standard -Wno-format-truncation -Wno-stringop-truncation -moutline-atomics -g -O2 -march=native -ftree-vectorize -fassociative-math -fno-signed-zeros -fno-trapping-math -fPIC -fvisibility=hidden -I. -I./ -I/nix/store/pmaflmk45425rq04ajcb4yhm58w6hq3p-postgresql-17_22/include/server -I/nix/store/pmaflmk45425rq04ajcb4yhm58w6hq3p-postgresql-17_22/include/internal -D_GNU_SOURCE  -I/nix/store/n8zb5iyyaqfrjmdgibap9j6a29y1cl41-libxml2-2.15.4-dev/include/libxml2 -I/nix/store/3gx080m9qfv8k0sff9bg5877n6zd9kv8-lz4-1.10.0-dev/include -I/nix/store/3y8mdshg1hkwpcnzhhd1q71p2wps47d4-zstd-1.5.7-dev/include -I/nix/store/qm179cq3lxwcmmm6lnkfghiw67zjbm3c-icu4c-75.1-dev/include  -c -o src/bitvec.o src/bitvec.c1553vector-0.7.0> warning: Skipping impure flag -march=native because NIX_ENFORCE_NO_NATIVE is set1554vector-0.7.0> gcc -Wall -Wmissing-prototypes -Wpointer-arith -Wdeclaration-after-statement -Werror=vla -Wendif-labels -Wmissing-format-attribute -Wimplicit-fallthrough=3 -Wcast-function-type -Wshadow=compatible-local -Wformat-security -fno-strict-aliasing -fwrapv -fexcess-precision=standard -Wno-format-truncation -Wno-stringop-truncation -moutline-atomics -g -O2 -march=native -ftree-vectorize -fassociative-math -fno-signed-zeros -fno-trapping-math -fPIC -fvisibility=hidden -I. -I./ -I/nix/store/pmaflmk45425rq04ajcb4yhm58w6hq3p-postgresql-17_22/include/server -I/nix/store/pmaflmk45425rq04ajcb4yhm58w6hq3p-postgresql-17_22/include/internal -D_GNU_SOURCE  -I/nix/store/n8zb5iyyaqfrjmdgibap9j6a29y1cl41-libxml2-2.15.4-dev/include/libxml2 -I/nix/store/3gx080m9qfv8k0sff9bg5877n6zd9kv8-lz4-1.10.0-dev/include -I/nix/store/3y8mdshg1hkwpcnzhhd1q71p2wps47d4-zstd-1.5.7-dev/include -I/nix/store/qm179cq3lxwcmmm6lnkfghiw67zjbm3c-icu4c-75.1-dev/include  -c -o src/halfutils.o src/halfutils.c1555vector-0.7.0> warning: Skipping impure flag -march=native because NIX_ENFORCE_NO_NATIVE is set1556vector-0.7.0> gcc -Wall -Wmissing-prototypes -Wpointer-arith -Wdeclaration-after-statement -Werror=vla -Wendif-labels -Wmissing-format-attribute -Wimplicit-fallthrough=3 -Wcast-function-type -Wshadow=compatible-local -Wformat-security -fno-strict-aliasing -fwrapv -fexcess-precision=standard -Wno-format-truncation -Wno-stringop-truncation -moutline-atomics -g -O2 -march=native -ftree-vectorize -fassociative-math -fno-signed-zeros -fno-trapping-math -fPIC -fvisibility=hidden -I. -I./ -I/nix/store/pmaflmk45425rq04ajcb4yhm58w6hq3p-postgresql-17_22/include/server -I/nix/store/pmaflmk45425rq04ajcb4yhm58w6hq3p-postgresql-17_22/include/internal -D_GNU_SOURCE  -I/nix/store/n8zb5iyyaqfrjmdgibap9j6a29y1cl41-libxml2-2.15.4-dev/include/libxml2 -I/nix/store/3gx080m9qfv8k0sff9bg5877n6zd9kv8-lz4-1.10.0-dev/include -I/nix/store/3y8mdshg1hkwpcnzhhd1q71p2wps47d4-zstd-1.5.7-dev/include -I/nix/store/qm179cq3lxwcmmm6lnkfghiw67zjbm3c-icu4c-75.1-dev/include  -c -o src/halfvec.o src/halfvec.c1557vector-0.7.0> warning: Skipping impure flag -march=native because NIX_ENFORCE_NO_NATIVE is set1558vector-0.7.0> gcc -Wall -Wmissing-prototypes -Wpointer-arith -Wdeclaration-after-statement -Werror=vla -Wendif-labels -Wmissing-format-attribute -Wimplicit-fallthrough=3 -Wcast-function-type -Wshadow=compatible-local -Wformat-security -fno-strict-aliasing -fwrapv -fexcess-precision=standard -Wno-format-truncation -Wno-stringop-truncation -moutline-atomics -g -O2 -march=native -ftree-vectorize -fassociative-math -fno-signed-zeros -fno-trapping-math -fPIC -fvisibility=hidden -I. -I./ -I/nix/store/pmaflmk45425rq04ajcb4yhm58w6hq3p-postgresql-17_22/include/server -I/nix/store/pmaflmk45425rq04ajcb4yhm58w6hq3p-postgresql-17_22/include/internal -D_GNU_SOURCE  -I/nix/store/n8zb5iyyaqfrjmdgibap9j6a29y1cl41-libxml2-2.15.4-dev/include/libxml2 -I/nix/store/3gx080m9qfv8k0sff9bg5877n6zd9kv8-lz4-1.10.0-dev/include -I/nix/store/3y8mdshg1hkwpcnzhhd1q71p2wps47d4-zstd-1.5.7-dev/include -I/nix/store/qm179cq3lxwcmmm6lnkfghiw67zjbm3c-icu4c-75.1-dev/include  -c -o src/hnsw.o src/hnsw.c1559vector-0.7.0> warning: Skipping impure flag -march=native because NIX_ENFORCE_NO_NATIVE is set1560vector-0.7.0> gcc -Wall -Wmissing-prototypes -Wpointer-arith -Wdeclaration-after-statement -Werror=vla -Wendif-labels -Wmissing-format-attribute -Wimplicit-fallthrough=3 -Wcast-function-type -Wshadow=compatible-local -Wformat-security -fno-strict-aliasing -fwrapv -fexcess-precision=standard -Wno-format-truncation -Wno-stringop-truncation -moutline-atomics -g -O2 -march=native -ftree-vectorize -fassociative-math -fno-signed-zeros -fno-trapping-math -fPIC -fvisibility=hidden -I. -I./ -I/nix/store/pmaflmk45425rq04ajcb4yhm58w6hq3p-postgresql-17_22/include/server -I/nix/store/pmaflmk45425rq04ajcb4yhm58w6hq3p-postgresql-17_22/include/internal -D_GNU_SOURCE  -I/nix/store/n8zb5iyyaqfrjmdgibap9j6a29y1cl41-libxml2-2.15.4-dev/include/libxml2 -I/nix/store/3gx080m9qfv8k0sff9bg5877n6zd9kv8-lz4-1.10.0-dev/include -I/nix/store/3y8mdshg1hkwpcnzhhd1q71p2wps47d4-zstd-1.5.7-dev/include -I/nix/store/qm179cq3lxwcmmm6lnkfghiw67zjbm3c-icu4c-75.1-dev/include  -c -o src/hnswbuild.o src/hnswbuild.c1561vector-0.7.0> warning: Skipping impure flag -march=native because NIX_ENFORCE_NO_NATIVE is set1562vector-0.7.0> gcc -Wall -Wmissing-prototypes -Wpointer-arith -Wdeclaration-after-statement -Werror=vla -Wendif-labels -Wmissing-format-attribute -Wimplicit-fallthrough=3 -Wcast-function-type -Wshadow=compatible-local -Wformat-security -fno-strict-aliasing -fwrapv -fexcess-precision=standard -Wno-format-truncation -Wno-stringop-truncation -moutline-atomics -g -O2 -march=native -ftree-vectorize -fassociative-math -fno-signed-zeros -fno-trapping-math -fPIC -fvisibility=hidden -I. -I./ -I/nix/store/pmaflmk45425rq04ajcb4yhm58w6hq3p-postgresql-17_22/include/server -I/nix/store/pmaflmk45425rq04ajcb4yhm58w6hq3p-postgresql-17_22/include/internal -D_GNU_SOURCE  -I/nix/store/n8zb5iyyaqfrjmdgibap9j6a29y1cl41-libxml2-2.15.4-dev/include/libxml2 -I/nix/store/3gx080m9qfv8k0sff9bg5877n6zd9kv8-lz4-1.10.0-dev/include -I/nix/store/3y8mdshg1hkwpcnzhhd1q71p2wps47d4-zstd-1.5.7-dev/include -I/nix/store/qm179cq3lxwcmmm6lnkfghiw67zjbm3c-icu4c-75.1-dev/include  -c -o src/hnswinsert.o src/hnswinsert.c1563vector-0.7.0> warning: Skipping impure flag -march=native because NIX_ENFORCE_NO_NATIVE is set1564vector-0.7.0> gcc -Wall -Wmissing-prototypes -Wpointer-arith -Wdeclaration-after-statement -Werror=vla -Wendif-labels -Wmissing-format-attribute -Wimplicit-fallthrough=3 -Wcast-function-type -Wshadow=compatible-local -Wformat-security -fno-strict-aliasing -fwrapv -fexcess-precision=standard -Wno-format-truncation -Wno-stringop-truncation -moutline-atomics -g -O2 -march=native -ftree-vectorize -fassociative-math -fno-signed-zeros -fno-trapping-math -fPIC -fvisibility=hidden -I. -I./ -I/nix/store/pmaflmk45425rq04ajcb4yhm58w6hq3p-postgresql-17_22/include/server -I/nix/store/pmaflmk45425rq04ajcb4yhm58w6hq3p-postgresql-17_22/include/internal -D_GNU_SOURCE  -I/nix/store/n8zb5iyyaqfrjmdgibap9j6a29y1cl41-libxml2-2.15.4-dev/include/libxml2 -I/nix/store/3gx080m9qfv8k0sff9bg5877n6zd9kv8-lz4-1.10.0-dev/include -I/nix/store/3y8mdshg1hkwpcnzhhd1q71p2wps47d4-zstd-1.5.7-dev/include -I/nix/store/qm179cq3lxwcmmm6lnkfghiw67zjbm3c-icu4c-75.1-dev/include  -c -o src/hnswscan.o src/hnswscan.c1565vector-0.7.0> warning: Skipping impure flag -march=native because NIX_ENFORCE_NO_NATIVE is set1566vector-0.7.0> gcc -Wall -Wmissing-prototypes -Wpointer-arith -Wdeclaration-after-statement -Werror=vla -Wendif-labels -Wmissing-format-attribute -Wimplicit-fallthrough=3 -Wcast-function-type -Wshadow=compatible-local -Wformat-security -fno-strict-aliasing -fwrapv -fexcess-precision=standard -Wno-format-truncation -Wno-stringop-truncation -moutline-atomics -g -O2 -march=native -ftree-vectorize -fassociative-math -fno-signed-zeros -fno-trapping-math -fPIC -fvisibility=hidden -I. -I./ -I/nix/store/pmaflmk45425rq04ajcb4yhm58w6hq3p-postgresql-17_22/include/server -I/nix/store/pmaflmk45425rq04ajcb4yhm58w6hq3p-postgresql-17_22/include/internal -D_GNU_SOURCE  -I/nix/store/n8zb5iyyaqfrjmdgibap9j6a29y1cl41-libxml2-2.15.4-dev/include/libxml2 -I/nix/store/3gx080m9qfv8k0sff9bg5877n6zd9kv8-lz4-1.10.0-dev/include -I/nix/store/3y8mdshg1hkwpcnzhhd1q71p2wps47d4-zstd-1.5.7-dev/include -I/nix/store/qm179cq3lxwcmmm6lnkfghiw67zjbm3c-icu4c-75.1-dev/include  -c -o src/hnswutils.o src/hnswutils.c1567vector-0.7.0> warning: Skipping impure flag -march=native because NIX_ENFORCE_NO_NATIVE is set1568vector-0.7.0> gcc -Wall -Wmissing-prototypes -Wpointer-arith -Wdeclaration-after-statement -Werror=vla -Wendif-labels -Wmissing-format-attribute -Wimplicit-fallthrough=3 -Wcast-function-type -Wshadow=compatible-local -Wformat-security -fno-strict-aliasing -fwrapv -fexcess-precision=standard -Wno-format-truncation -Wno-stringop-truncation -moutline-atomics -g -O2 -march=native -ftree-vectorize -fassociative-math -fno-signed-zeros -fno-trapping-math -fPIC -fvisibility=hidden -I. -I./ -I/nix/store/pmaflmk45425rq04ajcb4yhm58w6hq3p-postgresql-17_22/include/server -I/nix/store/pmaflmk45425rq04ajcb4yhm58w6hq3p-postgresql-17_22/include/internal -D_GNU_SOURCE  -I/nix/store/n8zb5iyyaqfrjmdgibap9j6a29y1cl41-libxml2-2.15.4-dev/include/libxml2 -I/nix/store/3gx080m9qfv8k0sff9bg5877n6zd9kv8-lz4-1.10.0-dev/include -I/nix/store/3y8mdshg1hkwpcnzhhd1q71p2wps47d4-zstd-1.5.7-dev/include -I/nix/store/qm179cq3lxwcmmm6lnkfghiw67zjbm3c-icu4c-75.1-dev/include  -c -o src/hnswvacuum.o src/hnswvacuum.c1569vector-0.7.0> warning: Skipping impure flag -march=native because NIX_ENFORCE_NO_NATIVE is set1570vector-0.7.0> gcc -Wall -Wmissing-prototypes -Wpointer-arith -Wdeclaration-after-statement -Werror=vla -Wendif-labels -Wmissing-format-attribute -Wimplicit-fallthrough=3 -Wcast-function-type -Wshadow=compatible-local -Wformat-security -fno-strict-aliasing -fwrapv -fexcess-precision=standard -Wno-format-truncation -Wno-stringop-truncation -moutline-atomics -g -O2 -march=native -ftree-vectorize -fassociative-math -fno-signed-zeros -fno-trapping-math -fPIC -fvisibility=hidden -I. -I./ -I/nix/store/pmaflmk45425rq04ajcb4yhm58w6hq3p-postgresql-17_22/include/server -I/nix/store/pmaflmk45425rq04ajcb4yhm58w6hq3p-postgresql-17_22/include/internal -D_GNU_SOURCE  -I/nix/store/n8zb5iyyaqfrjmdgibap9j6a29y1cl41-libxml2-2.15.4-dev/include/libxml2 -I/nix/store/3gx080m9qfv8k0sff9bg5877n6zd9kv8-lz4-1.10.0-dev/include -I/nix/store/3y8mdshg1hkwpcnzhhd1q71p2wps47d4-zstd-1.5.7-dev/include -I/nix/store/qm179cq3lxwcmmm6lnkfghiw67zjbm3c-icu4c-75.1-dev/include  -c -o src/ivfbuild.o src/ivfbuild.c1571vector-0.7.0> warning: Skipping impure flag -march=native because NIX_ENFORCE_NO_NATIVE is set1572vector-0.7.0> gcc -Wall -Wmissing-prototypes -Wpointer-arith -Wdeclaration-after-statement -Werror=vla -Wendif-labels -Wmissing-format-attribute -Wimplicit-fallthrough=3 -Wcast-function-type -Wshadow=compatible-local -Wformat-security -fno-strict-aliasing -fwrapv -fexcess-precision=standard -Wno-format-truncation -Wno-stringop-truncation -moutline-atomics -g -O2 -march=native -ftree-vectorize -fassociative-math -fno-signed-zeros -fno-trapping-math -fPIC -fvisibility=hidden -I. -I./ -I/nix/store/pmaflmk45425rq04ajcb4yhm58w6hq3p-postgresql-17_22/include/server -I/nix/store/pmaflmk45425rq04ajcb4yhm58w6hq3p-postgresql-17_22/include/internal -D_GNU_SOURCE  -I/nix/store/n8zb5iyyaqfrjmdgibap9j6a29y1cl41-libxml2-2.15.4-dev/include/libxml2 -I/nix/store/3gx080m9qfv8k0sff9bg5877n6zd9kv8-lz4-1.10.0-dev/include -I/nix/store/3y8mdshg1hkwpcnzhhd1q71p2wps47d4-zstd-1.5.7-dev/include -I/nix/store/qm179cq3lxwcmmm6lnkfghiw67zjbm3c-icu4c-75.1-dev/include  -c -o src/ivfflat.o src/ivfflat.c1573vector-0.7.0> warning: Skipping impure flag -march=native because NIX_ENFORCE_NO_NATIVE is set1574vector-0.7.0> gcc -Wall -Wmissing-prototypes -Wpointer-arith -Wdeclaration-after-statement -Werror=vla -Wendif-labels -Wmissing-format-attribute -Wimplicit-fallthrough=3 -Wcast-function-type -Wshadow=compatible-local -Wformat-security -fno-strict-aliasing -fwrapv -fexcess-precision=standard -Wno-format-truncation -Wno-stringop-truncation -moutline-atomics -g -O2 -march=native -ftree-vectorize -fassociative-math -fno-signed-zeros -fno-trapping-math -fPIC -fvisibility=hidden -I. -I./ -I/nix/store/pmaflmk45425rq04ajcb4yhm58w6hq3p-postgresql-17_22/include/server -I/nix/store/pmaflmk45425rq04ajcb4yhm58w6hq3p-postgresql-17_22/include/internal -D_GNU_SOURCE  -I/nix/store/n8zb5iyyaqfrjmdgibap9j6a29y1cl41-libxml2-2.15.4-dev/include/libxml2 -I/nix/store/3gx080m9qfv8k0sff9bg5877n6zd9kv8-lz4-1.10.0-dev/include -I/nix/store/3y8mdshg1hkwpcnzhhd1q71p2wps47d4-zstd-1.5.7-dev/include -I/nix/store/qm179cq3lxwcmmm6lnkfghiw67zjbm3c-icu4c-75.1-dev/include  -c -o src/ivfinsert.o src/ivfinsert.c1575vector-0.7.0> warning: Skipping impure flag -march=native because NIX_ENFORCE_NO_NATIVE is set1576vector-0.7.0> gcc -Wall -Wmissing-prototypes -Wpointer-arith -Wdeclaration-after-statement -Werror=vla -Wendif-labels -Wmissing-format-attribute -Wimplicit-fallthrough=3 -Wcast-function-type -Wshadow=compatible-local -Wformat-security -fno-strict-aliasing -fwrapv -fexcess-precision=standard -Wno-format-truncation -Wno-stringop-truncation -moutline-atomics -g -O2 -march=native -ftree-vectorize -fassociative-math -fno-signed-zeros -fno-trapping-math -fPIC -fvisibility=hidden -I. -I./ -I/nix/store/pmaflmk45425rq04ajcb4yhm58w6hq3p-postgresql-17_22/include/server -I/nix/store/pmaflmk45425rq04ajcb4yhm58w6hq3p-postgresql-17_22/include/internal -D_GNU_SOURCE  -I/nix/store/n8zb5iyyaqfrjmdgibap9j6a29y1cl41-libxml2-2.15.4-dev/include/libxml2 -I/nix/store/3gx080m9qfv8k0sff9bg5877n6zd9kv8-lz4-1.10.0-dev/include -I/nix/store/3y8mdshg1hkwpcnzhhd1q71p2wps47d4-zstd-1.5.7-dev/include -I/nix/store/qm179cq3lxwcmmm6lnkfghiw67zjbm3c-icu4c-75.1-dev/include  -c -o src/ivfkmeans.o src/ivfkmeans.c1577vector-0.7.0> warning: Skipping impure flag -march=native because NIX_ENFORCE_NO_NATIVE is set1578vector-0.7.0> gcc -Wall -Wmissing-prototypes -Wpointer-arith -Wdeclaration-after-statement -Werror=vla -Wendif-labels -Wmissing-format-attribute -Wimplicit-fallthrough=3 -Wcast-function-type -Wshadow=compatible-local -Wformat-security -fno-strict-aliasing -fwrapv -fexcess-precision=standard -Wno-format-truncation -Wno-stringop-truncation -moutline-atomics -g -O2 -march=native -ftree-vectorize -fassociative-math -fno-signed-zeros -fno-trapping-math -fPIC -fvisibility=hidden -I. -I./ -I/nix/store/pmaflmk45425rq04ajcb4yhm58w6hq3p-postgresql-17_22/include/server -I/nix/store/pmaflmk45425rq04ajcb4yhm58w6hq3p-postgresql-17_22/include/internal -D_GNU_SOURCE  -I/nix/store/n8zb5iyyaqfrjmdgibap9j6a29y1cl41-libxml2-2.15.4-dev/include/libxml2 -I/nix/store/3gx080m9qfv8k0sff9bg5877n6zd9kv8-lz4-1.10.0-dev/include -I/nix/store/3y8mdshg1hkwpcnzhhd1q71p2wps47d4-zstd-1.5.7-dev/include -I/nix/store/qm179cq3lxwcmmm6lnkfghiw67zjbm3c-icu4c-75.1-dev/include  -c -o src/ivfscan.o src/ivfscan.c1579vector-0.7.0> warning: Skipping impure flag -march=native because NIX_ENFORCE_NO_NATIVE is set1580vector-0.7.0> gcc -Wall -Wmissing-prototypes -Wpointer-arith -Wdeclaration-after-statement -Werror=vla -Wendif-labels -Wmissing-format-attribute -Wimplicit-fallthrough=3 -Wcast-function-type -Wshadow=compatible-local -Wformat-security -fno-strict-aliasing -fwrapv -fexcess-precision=standard -Wno-format-truncation -Wno-stringop-truncation -moutline-atomics -g -O2 -march=native -ftree-vectorize -fassociative-math -fno-signed-zeros -fno-trapping-math -fPIC -fvisibility=hidden -I. -I./ -I/nix/store/pmaflmk45425rq04ajcb4yhm58w6hq3p-postgresql-17_22/include/server -I/nix/store/pmaflmk45425rq04ajcb4yhm58w6hq3p-postgresql-17_22/include/internal -D_GNU_SOURCE  -I/nix/store/n8zb5iyyaqfrjmdgibap9j6a29y1cl41-libxml2-2.15.4-dev/include/libxml2 -I/nix/store/3gx080m9qfv8k0sff9bg5877n6zd9kv8-lz4-1.10.0-dev/include -I/nix/store/3y8mdshg1hkwpcnzhhd1q71p2wps47d4-zstd-1.5.7-dev/include -I/nix/store/qm179cq3lxwcmmm6lnkfghiw67zjbm3c-icu4c-75.1-dev/include  -c -o src/ivfutils.o src/ivfutils.c1581vector-0.7.0> warning: Skipping impure flag -march=native because NIX_ENFORCE_NO_NATIVE is set1582vector-0.7.0> gcc -Wall -Wmissing-prototypes -Wpointer-arith -Wdeclaration-after-statement -Werror=vla -Wendif-labels -Wmissing-format-attribute -Wimplicit-fallthrough=3 -Wcast-function-type -Wshadow=compatible-local -Wformat-security -fno-strict-aliasing -fwrapv -fexcess-precision=standard -Wno-format-truncation -Wno-stringop-truncation -moutline-atomics -g -O2 -march=native -ftree-vectorize -fassociative-math -fno-signed-zeros -fno-trapping-math -fPIC -fvisibility=hidden -I. -I./ -I/nix/store/pmaflmk45425rq04ajcb4yhm58w6hq3p-postgresql-17_22/include/server -I/nix/store/pmaflmk45425rq04ajcb4yhm58w6hq3p-postgresql-17_22/include/internal -D_GNU_SOURCE  -I/nix/store/n8zb5iyyaqfrjmdgibap9j6a29y1cl41-libxml2-2.15.4-dev/include/libxml2 -I/nix/store/3gx080m9qfv8k0sff9bg5877n6zd9kv8-lz4-1.10.0-dev/include -I/nix/store/3y8mdshg1hkwpcnzhhd1q71p2wps47d4-zstd-1.5.7-dev/include -I/nix/store/qm179cq3lxwcmmm6lnkfghiw67zjbm3c-icu4c-75.1-dev/include  -c -o src/ivfvacuum.o src/ivfvacuum.c1583vector-0.7.0> warning: Skipping impure flag -march=native because NIX_ENFORCE_NO_NATIVE is set1584vector-0.7.0> gcc -Wall -Wmissing-prototypes -Wpointer-arith -Wdeclaration-after-statement -Werror=vla -Wendif-labels -Wmissing-format-attribute -Wimplicit-fallthrough=3 -Wcast-function-type -Wshadow=compatible-local -Wformat-security -fno-strict-aliasing -fwrapv -fexcess-precision=standard -Wno-format-truncation -Wno-stringop-truncation -moutline-atomics -g -O2 -march=native -ftree-vectorize -fassociative-math -fno-signed-zeros -fno-trapping-math -fPIC -fvisibility=hidden -I. -I./ -I/nix/store/pmaflmk45425rq04ajcb4yhm58w6hq3p-postgresql-17_22/include/server -I/nix/store/pmaflmk45425rq04ajcb4yhm58w6hq3p-postgresql-17_22/include/internal -D_GNU_SOURCE  -I/nix/store/n8zb5iyyaqfrjmdgibap9j6a29y1cl41-libxml2-2.15.4-dev/include/libxml2 -I/nix/store/3gx080m9qfv8k0sff9bg5877n6zd9kv8-lz4-1.10.0-dev/include -I/nix/store/3y8mdshg1hkwpcnzhhd1q71p2wps47d4-zstd-1.5.7-dev/include -I/nix/store/qm179cq3lxwcmmm6lnkfghiw67zjbm3c-icu4c-75.1-dev/include  -c -o src/sparsevec.o src/sparsevec.c1585vector-0.7.0> warning: Skipping impure flag -march=native because NIX_ENFORCE_NO_NATIVE is set1586vector-0.7.0> gcc -Wall -Wmissing-prototypes -Wpointer-arith -Wdeclaration-after-statement -Werror=vla -Wendif-labels -Wmissing-format-attribute -Wimplicit-fallthrough=3 -Wcast-function-type -Wshadow=compatible-local -Wformat-security -fno-strict-aliasing -fwrapv -fexcess-precision=standard -Wno-format-truncation -Wno-stringop-truncation -moutline-atomics -g -O2 -march=native -ftree-vectorize -fassociative-math -fno-signed-zeros -fno-trapping-math -fPIC -fvisibility=hidden -I. -I./ -I/nix/store/pmaflmk45425rq04ajcb4yhm58w6hq3p-postgresql-17_22/include/server -I/nix/store/pmaflmk45425rq04ajcb4yhm58w6hq3p-postgresql-17_22/include/internal -D_GNU_SOURCE  -I/nix/store/n8zb5iyyaqfrjmdgibap9j6a29y1cl41-libxml2-2.15.4-dev/include/libxml2 -I/nix/store/3gx080m9qfv8k0sff9bg5877n6zd9kv8-lz4-1.10.0-dev/include -I/nix/store/3y8mdshg1hkwpcnzhhd1q71p2wps47d4-zstd-1.5.7-dev/include -I/nix/store/qm179cq3lxwcmmm6lnkfghiw67zjbm3c-icu4c-75.1-dev/include  -c -o src/vector.o src/vector.c1587vector-0.7.0> warning: Skipping impure flag -march=native because NIX_ENFORCE_NO_NATIVE is set1588vector-0.7.0> gcc -Wall -Wmissing-prototypes -Wpointer-arith -Wdeclaration-after-statement -Werror=vla -Wendif-labels -Wmissing-format-attribute -Wimplicit-fallthrough=3 -Wcast-function-type -Wshadow=compatible-local -Wformat-security -fno-strict-aliasing -fwrapv -fexcess-precision=standard -Wno-format-truncation -Wno-stringop-truncation -moutline-atomics -g -O2 -march=native -ftree-vectorize -fassociative-math -fno-signed-zeros -fno-trapping-math -fPIC -fvisibility=hidden -shared -o vector.so src/bitutils.o src/bitvec.o src/halfutils.o src/halfvec.o src/hnsw.o src/hnswbuild.o src/hnswinsert.o src/hnswscan.o src/hnswutils.o src/hnswvacuum.o src/ivfbuild.o src/ivfflat.o src/ivfinsert.o src/ivfkmeans.o src/ivfscan.o src/ivfutils.o src/ivfvacuum.o src/sparsevec.o src/vector.o -L/nix/store/j71vd8cq510zphc7wk56959mij4dfriv-postgresql-17_22-lib/lib    -L/nix/store/xjnvfcp3i347rp7zncsw5vdp7wgnpyaf-libxml2-2.15.4/lib -L/nix/store/yq0c2jhzc3877vagbkwxinm80wajlkh6-lz4-1.10.0-lib/lib -L/nix/store/i8f26lwk8i93hmiyrmsy752m6nwi4pmk-zstd-1.5.7/lib -Wl,--as-needed -Wl,-rpath,'/nix/store/j71vd8cq510zphc7wk56959mij4dfriv-postgresql-17_22-lib/lib',--enable-new-dtags -fvisibility=hidden 1589vector-0.7.0> warning: Skipping impure flag -march=native because NIX_ENFORCE_NO_NATIVE is set1590vector-0.7.0> cp sql/vector.sql sql/vector--0.7.0.sql1591vector-0.7.0> Running phase: installPhase1592vector-0.7.0> Running phase: fixupPhase1593vector-0.7.0> shrinking RPATHs of ELF executables and libraries in /nix/store/gh00izxs2fka49am45r4fmb9g7ia4dkd-vector-0.7.01594vector-0.7.0> shrinking /nix/store/gh00izxs2fka49am45r4fmb9g7ia4dkd-vector-0.7.0/lib/vector-0.7.0.so1595vector-0.7.0> checking for references to /build/ in /nix/store/gh00izxs2fka49am45r4fmb9g7ia4dkd-vector-0.7.0...1596vector-0.7.0> patching script interpreter paths in /nix/store/gh00izxs2fka49am45r4fmb9g7ia4dkd-vector-0.7.01597vector-0.7.0> stripping (with command strip and flags -S -p) in  /nix/store/gh00izxs2fka49am45r4fmb9g7ia4dkd-vector-0.7.0/lib