nixbot

builds

cancelled checks.aarch64-linux.ext-pg_graphql build #473 · raw · eval 20.0 s · 1.6 GiB allocated · ·

1these 80 derivations will be built:2  /nix/store/63hyl8xsljb5f5xkcj9ijm0gnahrm1xj-pg_graphql-1.6.1.drv3  /nix/store/b9dmsdagjh34saxi45wgawgq389csdyi-pg_graphql-1.5.11.drv4  /nix/store/c2zk9rycmw0vwa3qq1pyplnh513fkq9j-pg_graphql-1.5.9.drv5  /nix/store/w0bpwzz5zdfm8qnhwz483r3slpilmb0x-pg_graphql-1.6.2.drv6  /nix/store/v28ahsirc4vmfn1l07kihqgjph3lrj4m-pg_graphql.drv7  /nix/store/h0vz8s5khv2crkc4qxxrjbffgw9458gm-postgresql-orioledb-17-pg_graphql.drv8  /nix/store/2bkkf5wdn4mz152r85703g9m3f8crvdn-system-path.drv9  /nix/store/3ggryl2qhavwmy3linrr5p9gqq3svngh-dbus-1.drv10  /nix/store/cvaqaqd0bhrfrrbci6gfvh27k86k9vv5-unit-postgresql-setup.service.drv11  /nix/store/bk6fiyi8kmylmsdpvhi3jpmz7mlbsx0r-X-Restart-Triggers-dbus-broker.drv12  /nix/store/i280bx3iwra922bki6246v79rrdm65dx-unit-dbus-broker.service.drv13  /nix/store/ni52820asg7sbviavqhkia3yza8xs4i5-unit-postgresql.service.drv14  /nix/store/j3qzavlrxiqdxpy35phgaprb3iham47p-system-units.drv15  /nix/store/igyq1xz2x3i0di8b6vppw8vkhjswh1k0-unit-dbus-broker.service.drv16  /nix/store/m4apyamihi171rm89mv9synym6876f2a-user-units.drv17  /nix/store/wv1xccafxwwdcr5wfik4ljk9747kggcf-etc.drv18  /nix/store/05sc41nmd13zr2dvkjbl14q3pz0lhjdi-activate.drv19  /nix/store/1825w5xw6bcknsyx4q8dg88h75k4dq36-pg_graphql-1.5.11.drv20  /nix/store/3lnsfq42g59dcv6izyrkm2gngm74p2cs-pg_graphql-1.6.1.drv21  /nix/store/61mvnpi4a66dffaphz77pymqyxij3m2z-pg_graphql-1.5.9.drv22  /nix/store/s76s3s72y8srwfdnkbzng326n2zilc4i-pg_graphql-1.6.2.drv23  /nix/store/pdbh8xq7fp4wwx79pgb22dwkh6spwnsh-pg_graphql.drv24  /nix/store/gn9gvx9pbizdr9x4aa6j8qz1xwp7n2jq-postgresql-17-pg_graphql.drv25  /nix/store/7z2b7synlikgvh4vsr95268qvhqpfyk2-system-path.drv26  /nix/store/hn9ci9cwnj1529fk63jn1krgs51qnzha-dbus-1.drv27  /nix/store/hz13qpj9n1yhd4d4njlcbnhq64p048rd-X-Restart-Triggers-dbus-broker.drv28  /nix/store/0g7x4y1mz065x0v6fz4ln9mm1nkd405k-unit-dbus-broker.service.drv29  /nix/store/26fn0rb3qzxawci6lpsi0rvkhlarm5mw-pg_graphql-1.6.1.drv30  /nix/store/2d97540fv1lpdpivdzphhy8am2dyr8r4-pg_graphql-1.2.3.drv31  /nix/store/325yf3yfi8jx2ndmpa95c4n06xisghdk-pg_graphql-1.0.2.drv32  /nix/store/4c051z9bv4diia0jv8mwf0pqa32rn086-pg_graphql-1.5.1.drv33  /nix/store/95b1rzgciqh5xy8inalxq7370hn2f2m8-pg_graphql-1.1.0.drv34  /nix/store/9f94yvgw5hrz2jjzagd543lykidi76w5-pg_graphql-1.4.2.drv35  /nix/store/a496hwlnv3r89dkv60fmmwbff5i3zqc7-pg_graphql-1.5.11.drv36  /nix/store/bqap5yqr48aznl3j1h5k2yhvc99d9c33-pg_graphql-1.5.7.drv37  /nix/store/d3cd2aihrx4q64wgsy0a7pxbsrgzcmh8-pg_graphql-1.4.4.drv38  /nix/store/fhmf2803z73lv6ryzq1427gyk0098k16-pg_graphql-1.2.0.drv39  /nix/store/fzkqqymhxyrwzcgg3lvq18yn2j5mf9im-pg_graphql-1.5.1-mergeless.drv40  /nix/store/mp5hrhajad9d1lrli35zybq5klawxb48-pg_graphql-1.4.1.drv41  /nix/store/p0gbqi8bspd8xh2gk8dvfjphn624pyh3-pg_graphql-1.2.2.drv42  /nix/store/v7sa7kywvzvxis2c7b76w4jc0arcbp0m-pg_graphql-1.5.6.drv43  /nix/store/ybg01jvqbvnpgrazcnnhyfrgalk9mvyz-pg_graphql-1.6.2.drv44  /nix/store/yda6awhhivif3n8jn8arql4k0glg560m-pg_graphql-1.5.4.drv45  /nix/store/ykzk834jbir2cayjcnrr4m5wiam80kr8-pg_graphql-1.5.0.drv46  /nix/store/zj90anjy23060h6p64ycs0ldx4wpja5z-pg_graphql-1.5.9.drv47  /nix/store/zv2isif0w19crf4rq24mqq2f282x1cl6-pg_graphql.drv48  /nix/store/nn3gvzw04p5gppbms1jhgwvvpwg9rxky-postgresql-15-pg_graphql.drv49  /nix/store/0gj29nw89icvql249s4672k1bwsy2jk1-unit-postgresql-setup.service.drv50  /nix/store/4zqjpsd0bib5jgcp2z5xqrjgbhwgrmn1-system-path.drv51  /nix/store/97zpxmd740dc01dqx7gv3ad07r47xzi7-unit-postgresql.service.drv52  /nix/store/wyb3a9wlnpq75igg6j04v32divhx0pdf-dbus-1.drv53  /nix/store/qbxkx70irg53aja263c2zr7nd6v44r9c-X-Restart-Triggers-dbus-broker.drv54  /nix/store/xaigcd3ky1yi5rdv7aah0vlwxv887v0n-unit-dbus-broker.service.drv55  /nix/store/mdlc7nwcy69qx869s9wdcifi4pr1052w-system-units.drv56  /nix/store/kw92wwwb4fz23h6cwgdpqnw1jb9zdkba-unit-dbus-broker.service.drv57  /nix/store/vngwfvhrl5kfbrfi7ar6yb0vfz3270gd-user-units.drv58  /nix/store/cr2l14bxqjf99v4si0migrpmc6gwqxqy-etc.drv59  /nix/store/b1nk07mavxsyk4hxnjjwwg1z00ryzhx1-activate.drv60  /nix/store/n9i4w3vfgrn1nln0k7d1frdsfhpwag8d-postgresql-configfile-check.drv61  /nix/store/csl8lnin6w1nkfr3p8hwbk6fx6d68xwl-nixos-system-server-test.drv62  /nix/store/4zmm4z81ggmr1wg7vpwcqj5s4vfvcb0k-postgresql-configfile-check.drv63  /nix/store/48nznnqhgyhbn898p3ap11v19y411snj-unit-postgresql.service.drv64  /nix/store/akdvcfyz764gw0lwwbqln9w2zswsdahy-unit-postgresql-setup.service.drv65  /nix/store/7h77fac0c9w141iqp2j8yfnz05h9vjmg-unit-script-postgresql-migrate-start.drv66  /nix/store/zsn4dh45dgfyj617phijsgirzcly4akx-unit-postgresql-migrate.service.drv67  /nix/store/fl7hjkksmkp2kwmf58b1862dwc7dc8fn-system-units.drv68  /nix/store/xxf13zy36bvqqnf540rv7v84pbsi64f3-unit-dbus-broker.service.drv69  /nix/store/iwj22kpd6jxxhw31864a7ap01zaam798-user-units.drv70  /nix/store/9vlm2zh277rz0pr7l6j4jhpbmq6lp50a-etc.drv71  /nix/store/z7nbffmlx0z1jzw2mrzxxjm1hyhmikfr-activate.drv72  /nix/store/hkk15pwyzmhv7qamh1s17jc3kb1r5fsi-nixos-system-server-test.drv73  /nix/store/vbc32y6rjmg6c049nf02b04ky97c52h9-postgresql-configfile-check.drv74  /nix/store/2b7iy9hg8qqdpc6vgmvw1iraxzffxyyx-nixos-system-server-test.drv75  /nix/store/9fhvi986v5c65pyjn5axivkk8wimwlxh-test-script.drv76  /nix/store/2id5kbr2c9kr4ckqfyl8yp9dmkzrbps2-closure-info.drv77  /nix/store/lmiw04wcqq4c4zl3y906aklhcga6v3dc-run-nixos-vm.drv78  /nix/store/p8fpyvvndycb608pp1nji1lk9rq675nq-nixos-vm.drv79  /nix/store/1mv3a9phc7772ylh7036c4id7s2956fi-driverConfiguration.json.drv80  /nix/store/9x9ajbhsizl6aw18prnx7fcf55vn9zz6-nixos-test-driver-pg_graphql.drv81  /nix/store/y0jn44lj72pmnpcxgysv2xbigil39dzx-vm-test-run-pg_graphql.drv82building '/nix/store/325yf3yfi8jx2ndmpa95c4n06xisghdk-pg_graphql-1.0.2.drv' on 'ssh-ng://nixbot-remote-build@78.232.36.247'83building '/nix/store/325yf3yfi8jx2ndmpa95c4n06xisghdk-pg_graphql-1.0.2.drv'84pg_graphql-1.0.2> Running phase: unpackPhase85pg_graphql-1.0.2> unpacking source archive /nix/store/v099afy4c6kb2hrxx5wbhhv86vmkkjs5-source86pg_graphql-1.0.2> source root is source87pg_graphql-1.0.2> Executing cargoSetupPostUnpackHook88pg_graphql-1.0.2> Finished cargoSetupPostUnpackHook89pg_graphql-1.0.2> Running phase: patchPhase90pg_graphql-1.0.2> applying patch /nix/store/3nxwmgam0dv7y1gmb0yqnawh1l85sizb-0001-Add-missing-Cargo.lock-1.0.2.patch91pg_graphql-1.0.2> patching file Cargo.lock92pg_graphql-1.0.2> Executing cargoSetupPostPatchHook93pg_graphql-1.0.2> Validating consistency between /build/source/Cargo.lock and /build/cargo-vendor-dir/Cargo.lock94pg_graphql-1.0.2> Finished cargoSetupPostPatchHook95pg_graphql-1.0.2> Running phase: updateAutotoolsGnuConfigScriptsPhase96pg_graphql-1.0.2> Running phase: configurePhase97pg_graphql-1.0.2> Running phase: buildPhase98pg_graphql-1.0.2> Executing cargo-pgrx buildPhase99pg_graphql-1.0.2>    Validating /nix/store/bc9327c6474vwmqmhkszkmiz86mba73s-postgresql-15.19/bin/pg_config100pg_graphql-1.0.2>  Initializing data directory at /build/tmp.kG0tyJCPA0/data-15101pg_graphql-1.0.2> waiting for server to start....2026-10-27 12:16:43.183 GMT [90] LOG:  starting PostgreSQL 15.19 on aarch64-unknown-linux-gnu, compiled by gcc (GCC) 15.3.0, 64-bit102pg_graphql-1.0.2> 2026-10-27 12:16:43.187 GMT [90] LOG:  listening on Unix socket "/build/tmp.KiOD4wX80H/.s.PGSQL.5432"103pg_graphql-1.0.2> 2026-10-27 12:16:43.200 GMT [93] LOG:  database system was shut down at 2026-10-27 12:16:42 GMT104pg_graphql-1.0.2> 2026-10-27 12:16:43.207 GMT [90] LOG:  database system is ready to accept connections105pg_graphql-1.0.2>  done106pg_graphql-1.0.2> server started107pg_graphql-1.0.2> createuser: error: connection to server at "localhost" (127.0.0.1), port 5432 failed: Connection refused108pg_graphql-1.0.2> 	Is the server running on that host and accepting TCP/IP connections?109pg_graphql-1.0.2> waiting for server to shut down....2026-10-27 12:16:43.266 GMT [90] LOG:  received fast shutdown request110pg_graphql-1.0.2> 2026-10-27 12:16:43.286 GMT [90] LOG:  aborting any active transactions111pg_graphql-1.0.2> 2026-10-27 12:16:43.291 GMT [90] LOG:  background worker "logical replication launcher" (PID 96) exited with exit code 1112pg_graphql-1.0.2> 2026-10-27 12:16:43.291 GMT [91] LOG:  shutting down113pg_graphql-1.0.2> 2026-10-27 12:16:43.302 GMT [91] LOG:  checkpoint starting: shutdown immediate114pg_graphql-1.0.2> 2026-10-27 12:16:43.384 GMT [91] LOG:  checkpoint complete: wrote 3 buffers (0.0%); 0 WAL file(s) added, 0 removed, 0 recycled; write=0.027 s, sync=0.002 s, total=0.094 s; sync files=2, longest=0.002 s, average=0.001 s; distance=0 kB, estimate=0 kB115pg_graphql-1.0.2> 2026-10-27 12:16:43.390 GMT [90] LOG:  database system is shut down116pg_graphql-1.0.2>  done117pg_graphql-1.0.2> server stopped118pg_graphql-1.0.2> warning: `/build/source/.cargo/config` is deprecated in favor of `config.toml`119pg_graphql-1.0.2> note: if you need to support cargo 1.38 or earlier, you can symlink `config` to `config.toml`120pg_graphql-1.0.2>     Building extension with features  pg15121pg_graphql-1.0.2>      Running command "cargo" "build" "--release" "--features" " pg15" "--no-default-features" "--message-format=json-render-diagnostics" "--frozen" "-j" "2"122pg_graphql-1.0.2> warning: `/build/source/.cargo/config` is deprecated in favor of `config.toml`123pg_graphql-1.0.2> note: if you need to support cargo 1.38 or earlier, you can symlink `config` to `config.toml`124pg_graphql-1.0.2>    Compiling proc-macro2 v1.0.95125pg_graphql-1.0.2>    Compiling quote v1.0.28126pg_graphql-1.0.2>    Compiling unicode-ident v1.0.6127building '/nix/store/95b1rzgciqh5xy8inalxq7370hn2f2m8-pg_graphql-1.1.0.drv' on 'ssh-ng://nixbot-remote-build@78.232.36.247'128pg_graphql-1.0.2>    Compiling autocfg v1.1.0129pg_graphql-1.0.2>    Compiling libc v0.2.146130building '/nix/store/95b1rzgciqh5xy8inalxq7370hn2f2m8-pg_graphql-1.1.0.drv'131pg_graphql-1.1.0> Running phase: unpackPhase132pg_graphql-1.1.0> unpacking source archive /nix/store/ykay7ckw4v05m499g7g98qs7g98xp7dj-source133pg_graphql-1.1.0> source root is source134pg_graphql-1.1.0> Executing cargoSetupPostUnpackHook135pg_graphql-1.0.2>    Compiling syn v1.0.109136pg_graphql-1.0.2>    Compiling syn v2.0.43137pg_graphql-1.1.0> Finished cargoSetupPostUnpackHook138pg_graphql-1.1.0> Running phase: patchPhase139pg_graphql-1.1.0> applying patch /nix/store/qawcnxkrqdmys0px7bjzhh66dvidbnay-0001-Add-missing-Cargo.lock-1.1.0.patch140pg_graphql-1.1.0> patching file Cargo.lock141pg_graphql-1.1.0> Executing cargoSetupPostPatchHook142pg_graphql-1.1.0> Validating consistency between /build/source/Cargo.lock and /build/cargo-vendor-dir/Cargo.lock143pg_graphql-1.1.0> Finished cargoSetupPostPatchHook144pg_graphql-1.1.0> Running phase: updateAutotoolsGnuConfigScriptsPhase145pg_graphql-1.1.0> Running phase: configurePhase146pg_graphql-1.1.0> Running phase: buildPhase147pg_graphql-1.1.0> Executing cargo-pgrx buildPhase148pg_graphql-1.1.0>    Validating /nix/store/bc9327c6474vwmqmhkszkmiz86mba73s-postgresql-15.19/bin/pg_config149pg_graphql-1.1.0>  Initializing data directory at /build/tmp.9zhEZMYFMH/data-15150pg_graphql-1.1.0> waiting for server to start....2026-10-27 12:16:47.989 GMT [90] LOG:  starting PostgreSQL 15.19 on aarch64-unknown-linux-gnu, compiled by gcc (GCC) 15.3.0, 64-bit151pg_graphql-1.1.0> 2026-10-27 12:16:47.992 GMT [90] LOG:  listening on Unix socket "/build/tmp.j12DvhLtXD/.s.PGSQL.5432"152pg_graphql-1.1.0> 2026-10-27 12:16:48.001 GMT [93] LOG:  database system was shut down at 2026-10-27 12:16:47 GMT153pg_graphql-1.1.0> 2026-10-27 12:16:48.007 GMT [90] LOG:  database system is ready to accept connections154pg_graphql-1.1.0>  done155pg_graphql-1.1.0> server started156pg_graphql-1.1.0> createuser: error: connection to server at "localhost" (127.0.0.1), port 5432 failed: Connection refused157pg_graphql-1.1.0> 	Is the server running on that host and accepting TCP/IP connections?158pg_graphql-1.1.0> waiting for server to shut down....2026-10-27 12:16:48.074 GMT [90] LOG:  received fast shutdown request159pg_graphql-1.1.0> 2026-10-27 12:16:48.077 GMT [90] LOG:  aborting any active transactions160pg_graphql-1.1.0> 2026-10-27 12:16:48.079 GMT [90] LOG:  background worker "logical replication launcher" (PID 96) exited with exit code 1161pg_graphql-1.1.0> 2026-10-27 12:16:48.079 GMT [91] LOG:  shutting down162pg_graphql-1.1.0> 2026-10-27 12:16:48.081 GMT [91] LOG:  checkpoint starting: shutdown immediate163pg_graphql-1.1.0> 2026-10-27 12:16:48.100 GMT [91] LOG:  checkpoint complete: wrote 3 buffers (0.0%); 0 WAL file(s) added, 0 removed, 0 recycled; write=0.005 s, sync=0.003 s, total=0.021 s; sync files=2, longest=0.002 s, average=0.002 s; distance=0 kB, estimate=0 kB164pg_graphql-1.1.0> 2026-10-27 12:16:48.106 GMT [90] LOG:  database system is shut down165pg_graphql-1.1.0>  done166pg_graphql-1.1.0> server stopped167pg_graphql-1.1.0> warning: `/build/source/.cargo/config` is deprecated in favor of `config.toml`168pg_graphql-1.1.0> note: if you need to support cargo 1.38 or earlier, you can symlink `config` to `config.toml`169pg_graphql-1.1.0>     Building extension with features 170pg_graphql-1.1.0>      Running command "cargo" "build" "--release" "--message-format=json-render-diagnostics" "--frozen" "-j" "2"171pg_graphql-1.1.0> warning: `/build/source/.cargo/config` is deprecated in favor of `config.toml`172pg_graphql-1.1.0> note: if you need to support cargo 1.38 or earlier, you can symlink `config` to `config.toml`173pg_graphql-1.1.0>    Compiling proc-macro2 v1.0.95174pg_graphql-1.1.0>    Compiling quote v1.0.28175pg_graphql-1.1.0>    Compiling unicode-ident v1.0.6176pg_graphql-1.1.0>    Compiling autocfg v1.1.0177pg_graphql-1.1.0>    Compiling libc v0.2.146178pg_graphql-1.1.0>    Compiling syn v1.0.109179pg_graphql-1.1.0>    Compiling syn v2.0.43180pg_graphql-1.0.2>    Compiling cfg-if v1.0.0181pg_graphql-1.0.2>    Compiling log v0.4.17182pg_graphql-1.0.2>    Compiling memchr v2.5.0183pg_graphql-1.0.2>    Compiling serde_derive v1.0.193184pg_graphql-1.0.2>    Compiling thiserror v1.0.38185pg_graphql-1.0.2>    Compiling tracing-attributes v0.1.30186pg_graphql-1.1.0>    Compiling cfg-if v1.0.0187pg_graphql-1.1.0>    Compiling log v0.4.17188pg_graphql-1.1.0>    Compiling memchr v2.5.0189pg_graphql-1.0.2>    Compiling indexmap v1.9.2190pg_graphql-1.0.2>    Compiling once_cell v1.18.0191pg_graphql-1.1.0>    Compiling serde_derive v1.0.193192pg_graphql-1.1.0>    Compiling thiserror v1.0.38193pg_graphql-1.1.0>    Compiling tracing-attributes v0.1.30194pg_graphql-1.0.2>    Compiling thiserror-impl v1.0.38195pg_graphql-1.0.2>    Compiling eyre v0.6.8196pg_graphql-1.0.2>    Compiling serde_json v1.0.96197pg_graphql-1.0.2>    Compiling crossbeam-utils v0.8.14198pg_graphql-1.0.2>    Compiling serde v1.0.193199pg_graphql-1.0.2>    Compiling pin-project-lite v0.2.9200pg_graphql-1.0.2>    Compiling tracing-core v0.1.30201pg_graphql-1.0.2>    Compiling aho-corasick v1.0.1202pg_graphql-1.1.0>    Compiling indexmap v1.9.2203pg_graphql-1.1.0>    Compiling once_cell v1.18.0204pg_graphql-1.0.2>    Compiling memoffset v0.7.1205pg_graphql-1.0.2>    Compiling lazy_static v1.4.0206pg_graphql-1.1.0>    Compiling thiserror-impl v1.0.38207pg_graphql-1.0.2>    Compiling regex-syntax v0.7.2208pg_graphql-1.0.2>    Compiling regex-syntax v0.6.29209pg_graphql-1.1.0>    Compiling serde_json v1.0.96210pg_graphql-1.1.0>    Compiling eyre v0.6.8211pg_graphql-1.1.0>    Compiling crossbeam-utils v0.8.14212pg_graphql-1.1.0>    Compiling pin-project-lite v0.2.9213pg_graphql-1.1.0>    Compiling serde v1.0.193214pg_graphql-1.1.0>    Compiling tracing-core v0.1.30215pg_graphql-1.1.0>    Compiling aho-corasick v1.0.1216pg_graphql-1.1.0>    Compiling memoffset v0.7.1217pg_graphql-1.1.0>    Compiling regex-syntax v0.7.2218pg_graphql-1.0.2>    Compiling regex-automata v0.1.10219pg_graphql-1.1.0>    Compiling regex-syntax v0.6.29220pg_graphql-1.0.2>    Compiling regex v1.8.4221pg_graphql-1.1.0>    Compiling lazy_static v1.4.0222pg_graphql-1.0.2>    Compiling crossbeam-epoch v0.9.13223pg_graphql-1.1.0>    Compiling regex-automata v0.1.10224pg_graphql-1.1.0>    Compiling regex v1.8.4225pg_graphql-1.0.2>    Compiling tinyvec_macros v0.1.0226pg_graphql-1.0.2>    Compiling glob v0.3.1227pg_graphql-1.0.2>    Compiling overload v0.1.1228pg_graphql-1.0.2>    Compiling nu-ansi-term v0.46.0229pg_graphql-1.0.2>    Compiling clang-sys v1.4.0230pg_graphql-1.0.2>    Compiling tracing v0.1.37231pg_graphql-1.0.2>    Compiling tinyvec v1.6.0232pg_graphql-1.0.2>    Compiling tracing-log v0.2.0233pg_graphql-1.0.2>    Compiling matchers v0.1.0234pg_graphql-1.0.2>    Compiling sharded-slab v0.1.7235pg_graphql-1.0.2>    Compiling thread_local v1.1.9236pg_graphql-1.0.2>    Compiling smallvec v1.10.0237pg_graphql-1.0.2>    Compiling ryu v1.0.12238pg_graphql-1.0.2>    Compiling indenter v0.3.3239pg_graphql-1.0.2>    Compiling hashbrown v0.12.3240pg_graphql-1.0.2>    Compiling scopeguard v1.1.0241pg_graphql-1.1.0>    Compiling crossbeam-epoch v0.9.13242pg_graphql-1.0.2>    Compiling itoa v1.0.5243pg_graphql-1.0.2>    Compiling ucd-trie v0.1.5244pg_graphql-1.1.0>    Compiling overload v0.1.1245pg_graphql-1.1.0>    Compiling glob v0.3.1246pg_graphql-1.0.2>    Compiling pest v2.5.4247pg_graphql-1.1.0>    Compiling tinyvec_macros v0.1.0248pg_graphql-1.1.0>    Compiling tinyvec v1.6.0249pg_graphql-1.1.0>    Compiling clang-sys v1.4.0250pg_graphql-1.1.0>    Compiling tracing v0.1.37251pg_graphql-1.1.0>    Compiling nu-ansi-term v0.46.0252pg_graphql-1.1.0>    Compiling tracing-log v0.2.0253pg_graphql-1.1.0>    Compiling matchers v0.1.0254pg_graphql-1.1.0>    Compiling sharded-slab v0.1.7255pg_graphql-1.0.2>    Compiling tracing-subscriber v0.3.18256pg_graphql-1.1.0>    Compiling thread_local v1.1.9257pg_graphql-1.0.2>    Compiling unicode-normalization v0.1.22258pg_graphql-1.1.0>    Compiling ryu v1.0.12259pg_graphql-1.1.0>    Compiling itoa v1.0.5260pg_graphql-1.1.0>    Compiling indenter v0.3.3261pg_graphql-1.1.0>    Compiling hashbrown v0.12.3262pg_graphql-1.1.0>    Compiling smallvec v1.10.0263pg_graphql-1.1.0>    Compiling ucd-trie v0.1.5264pg_graphql-1.1.0>    Compiling scopeguard v1.1.0265pg_graphql-1.1.0>    Compiling pest v2.5.4266pg_graphql-1.0.2>    Compiling minimal-lexical v0.2.1267pg_graphql-1.1.0>    Compiling tracing-subscriber v0.3.18268pg_graphql-1.0.2>    Compiling percent-encoding v2.3.0269pg_graphql-1.0.2>    Compiling unicode-bidi v0.3.10270pg_graphql-1.0.2>    Compiling semver v1.0.16271pg_graphql-1.0.2>    Compiling cty v0.2.2272pg_graphql-1.0.2>    Compiling rayon-core v1.10.2273pg_graphql-1.0.2>    Compiling seq-macro v0.3.2274pg_graphql-1.0.2>    Compiling fixedbitset v0.4.2275pg_graphql-1.0.2>    Compiling petgraph v0.6.3276pg_graphql-1.1.0>    Compiling unicode-normalization v0.1.22277pg_graphql-1.1.0>    Compiling cty v0.2.2278pg_graphql-1.1.0>    Compiling percent-encoding v2.3.0279pg_graphql-1.1.0>    Compiling fixedbitset v0.4.2280pg_graphql-1.1.0>    Compiling rayon-core v1.10.2281pg_graphql-1.1.0>    Compiling seq-macro v0.3.2282pg_graphql-1.1.0>    Compiling minimal-lexical v0.2.1283pg_graphql-1.1.0>    Compiling semver v1.0.16284pg_graphql-1.1.0>    Compiling unicode-bidi v0.3.10285pg_graphql-1.1.0>    Compiling idna v0.4.0286pg_graphql-1.0.2>    Compiling cstr_core v0.2.6287pg_graphql-1.0.2>    Compiling idna v0.4.0288pg_graphql-1.0.2>    Compiling form_urlencoded v1.2.0289pg_graphql-1.0.2>    Compiling nom v7.1.3290pg_graphql-1.0.2>    Compiling tracing-error v0.2.1291pg_graphql-1.0.2>    Compiling crossbeam-deque v0.8.2292pg_graphql-1.0.2>    Compiling semver-parser v0.10.2293pg_graphql-1.1.0>    Compiling nom v7.1.3294pg_graphql-1.0.2>    Compiling crossbeam-channel v0.5.6295pg_graphql-1.0.2>    Compiling num_cpus v1.15.0296pg_graphql-1.1.0>    Compiling petgraph v0.6.3297pg_graphql-1.0.2>    Compiling dirs-sys v0.3.7298pg_graphql-1.0.2>    Compiling atty v0.2.14299pg_graphql-1.0.2>    Compiling libloading v0.7.4300pg_graphql-1.1.0>    Compiling form_urlencoded v1.2.0301pg_graphql-1.1.0>    Compiling cstr_core v0.2.6302pg_graphql-1.0.2>    Compiling bindgen v0.60.1303pg_graphql-1.1.0>    Compiling tracing-error v0.2.1304pg_graphql-1.1.0>    Compiling semver-parser v0.10.2305pg_graphql-1.0.2>    Compiling unescape v0.1.0306pg_graphql-1.1.0>    Compiling crossbeam-deque v0.8.2307pg_graphql-1.0.2>    Compiling convert_case v0.5.0308pg_graphql-1.1.0>    Compiling crossbeam-channel v0.5.6309pg_graphql-1.0.2>    Compiling futures-core v0.3.26310pg_graphql-1.1.0>    Compiling atty v0.2.14311pg_graphql-1.1.0>    Compiling num_cpus v1.15.0312pg_graphql-1.1.0>    Compiling dirs-sys v0.3.7313pg_graphql-1.1.0>    Compiling libloading v0.7.4314pg_graphql-1.0.2>    Compiling pgx-utils v0.6.1315pg_graphql-1.1.0>    Compiling futures-core v0.3.26316pg_graphql-1.1.0>    Compiling convert_case v0.5.0317pg_graphql-1.1.0>    Compiling unescape v0.1.0318pg_graphql-1.1.0>    Compiling bindgen v0.60.1319pg_graphql-1.1.0>    Compiling pgx-utils v0.6.1320pg_graphql-1.0.2>    Compiling dirs v4.0.0321pg_graphql-1.0.2>    Compiling cexpr v0.6.0322pg_graphql-1.0.2>    Compiling semver v0.11.0323pg_graphql-1.0.2>    Compiling url v2.4.0324pg_graphql-1.1.0>    Compiling dirs v4.0.0325pg_graphql-1.1.0>    Compiling semver v0.11.0326pg_graphql-1.1.0>    Compiling url v2.4.0327pg_graphql-1.1.0>    Compiling cexpr v0.6.0328pg_graphql-1.0.2>    Compiling toml v0.5.11329pg_graphql-1.0.2>    Compiling getrandom v0.2.8330pg_graphql-1.0.2>    Compiling slab v0.4.7331pg_graphql-1.0.2>    Compiling rustc-hash v1.1.0332pg_graphql-1.0.2>    Compiling either v1.8.1333pg_graphql-1.0.2>    Compiling byteorder v1.4.3334pg_graphql-1.0.2>    Compiling bitflags v1.3.2335pg_graphql-1.0.2>    Compiling lazycell v1.3.0336pg_graphql-1.0.2>    Compiling peeking_take_while v0.1.2337pg_graphql-1.0.2>    Compiling shlex v1.1.0338pg_graphql-1.0.2>    Compiling owo-colors v3.5.0339pg_graphql-1.0.2>    Compiling futures-channel v0.3.26340pg_graphql-1.1.0>    Compiling toml v0.5.11341pg_graphql-1.0.2>    Compiling futures-task v0.3.26342pg_graphql-1.0.2>    Compiling pgx-pg-config v0.6.1343pg_graphql-1.1.0>    Compiling getrandom v0.2.8344pg_graphql-1.1.0>    Compiling slab v0.4.7345pg_graphql-1.1.0>    Compiling either v1.8.1346pg_graphql-1.1.0>    Compiling owo-colors v3.5.0347pg_graphql-1.1.0>    Compiling shlex v1.1.0348pg_graphql-1.1.0>    Compiling peeking_take_while v0.1.2349pg_graphql-1.1.0>    Compiling bitflags v1.3.2350pg_graphql-1.1.0>    Compiling byteorder v1.4.3351pg_graphql-1.1.0>    Compiling lazycell v1.3.0352pg_graphql-1.1.0>    Compiling futures-channel v0.3.26353pg_graphql-1.1.0>    Compiling rustc-hash v1.1.0354pg_graphql-1.1.0>    Compiling futures-task v0.3.26355pg_graphql-1.1.0>    Compiling pgx-pg-config v0.6.1356pg_graphql-1.0.2>    Compiling rayon v1.6.1357pg_graphql-1.0.2>    Compiling rustc_version v0.4.0358pg_graphql-1.0.2>    Compiling rustc_version v0.3.3359pg_graphql-1.0.2>    Compiling memoffset v0.6.5360pg_graphql-1.0.2>    Compiling fnv v1.0.7361pg_graphql-1.0.2>    Compiling futures-sink v0.3.26362pg_graphql-1.1.0>    Compiling rayon v1.6.1363pg_graphql-1.0.2>    Compiling radium v0.7.0364pg_graphql-1.0.2>    Compiling futures-util v0.3.26365pg_graphql-1.0.2>    Compiling ident_case v1.0.1366pg_graphql-1.0.2>    Compiling strsim v0.10.0367pg_graphql-1.0.2>    Compiling darling_core v0.13.4368pg_graphql-1.1.0>    Compiling rustc_version v0.4.0369pg_graphql-1.1.0>    Compiling rustc_version v0.3.3370pg_graphql-1.1.0>    Compiling memoffset v0.6.5371pg_graphql-1.1.0>    Compiling strsim v0.10.0372pg_graphql-1.1.0>    Compiling futures-sink v0.3.26373pg_graphql-1.1.0>    Compiling fnv v1.0.7374pg_graphql-1.1.0>    Compiling ident_case v1.0.1375pg_graphql-1.1.0>    Compiling radium v0.7.0376pg_graphql-1.1.0>    Compiling futures-util v0.3.26377pg_graphql-1.1.0>    Compiling darling_core v0.13.4378pg_graphql-1.0.2>    Compiling atomic-traits v0.3.0379pg_graphql-1.0.2>    Compiling heapless v0.7.16380pg_graphql-1.0.2>    Compiling pgx-pg-sys v0.6.1381pg_graphql-1.1.0>    Compiling pgx-pg-sys v0.6.1382pg_graphql-1.0.2>    Compiling futures-macro v0.3.26383pg_graphql-1.1.0>    Compiling atomic-traits v0.3.0384pg_graphql-1.1.0>    Compiling heapless v0.7.16385pg_graphql-1.0.2>    Compiling pin-utils v0.1.0386pg_graphql-1.0.2>    Compiling futures-io v0.3.26387pg_graphql-1.1.0>    Compiling futures-macro v0.3.26388pg_graphql-1.0.2>    Compiling tap v1.0.1389pg_graphql-1.0.2>    Compiling wyz v0.5.1390pg_graphql-1.1.0>    Compiling pin-utils v0.1.0391pg_graphql-1.1.0>    Compiling tap v1.0.1392pg_graphql-1.1.0>    Compiling futures-io v0.3.26393pg_graphql-1.1.0>    Compiling wyz v0.5.1394pg_graphql-1.0.2>    Compiling darling_macro v0.13.4395pg_graphql-1.0.2>    Compiling hash32 v0.2.1396pg_graphql-1.0.2>    Compiling pgx-macros v0.6.1397pg_graphql-1.0.2>    Compiling tokio v1.28.1398pg_graphql-1.0.2>    Compiling sptr v0.3.2399pg_graphql-1.0.2>    Compiling void v1.0.2400pg_graphql-1.0.2>    Compiling stable_deref_trait v1.2.0401pg_graphql-1.0.2>    Compiling half v1.8.2402pg_graphql-1.0.2>    Compiling funty v2.0.0403pg_graphql-1.0.2>    Compiling async-trait v0.1.64404pg_graphql-1.0.2>    Compiling bitvec v1.0.1405pg_graphql-1.1.0>    Compiling darling_macro v0.13.4406pg_graphql-1.1.0>    Compiling hash32 v0.2.1407pg_graphql-1.1.0>    Compiling pgx-macros v0.6.1408pg_graphql-1.1.0>    Compiling tokio v1.28.1409pg_graphql-1.1.0>    Compiling async-trait v0.1.64410pg_graphql-1.0.2>    Compiling serde_cbor v0.11.2411pg_graphql-1.1.0>    Compiling sptr v0.3.2412pg_graphql-1.1.0>    Compiling stable_deref_trait v1.2.0413pg_graphql-1.1.0>    Compiling void v1.0.2414pg_graphql-1.1.0>    Compiling funty v2.0.0415pg_graphql-1.1.0>    Compiling half v1.8.2416pg_graphql-1.1.0>    Compiling serde_cbor v0.11.2417pg_graphql-1.1.0>    Compiling bitvec v1.0.1418pg_graphql-1.0.2>    Compiling unreachable v1.0.0419pg_graphql-1.0.2>    Compiling darling v0.13.4420pg_graphql-1.1.0>    Compiling unreachable v1.0.0421pg_graphql-1.0.2>    Compiling futures-executor v0.3.26422pg_graphql-1.0.2>    Compiling uuid v1.3.3423pg_graphql-1.0.2>    Compiling rand_core v0.6.4424pg_graphql-1.0.2>    Compiling tokio-macros v2.1.0425pg_graphql-1.0.2>    Compiling seahash v4.1.0426pg_graphql-1.0.2>    Compiling cached_proc_macro_types v0.1.0427pg_graphql-1.0.2>    Compiling ascii v0.9.3428pg_graphql-1.1.0>    Compiling darling v0.13.4429pg_graphql-1.0.2>    Compiling ppv-lite86 v0.2.17430pg_graphql-1.1.0>    Compiling futures-executor v0.3.26431pg_graphql-1.0.2>    Compiling rand_chacha v0.3.1432pg_graphql-1.1.0>    Compiling rand_core v0.6.4433pg_graphql-1.1.0>    Compiling uuid v1.3.3434pg_graphql-1.0.2>    Compiling combine v3.8.1435pg_graphql-1.1.0>    Compiling tokio-macros v2.1.0436pg_graphql-1.1.0>    Compiling cached_proc_macro_types v0.1.0437pg_graphql-1.1.0>    Compiling ppv-lite86 v0.2.17438pg_graphql-1.1.0>    Compiling seahash v4.1.0439pg_graphql-1.1.0>    Compiling ascii v0.9.3440pg_graphql-1.1.0>    Compiling combine v3.8.1441pg_graphql-1.0.2>    Compiling cached_proc_macro v0.12.0442pg_graphql-1.0.2>    Compiling pgx v0.6.1443pg_graphql-1.1.0>    Compiling pgx v0.6.1444pg_graphql-1.1.0>    Compiling rand_chacha v0.3.1445pg_graphql-1.1.0>    Compiling cached_proc_macro v0.12.0446pg_graphql-1.0.2>    Compiling futures v0.3.26447pg_graphql-1.0.2>    Compiling async_once v0.2.6448pg_graphql-1.0.2>    Compiling cached v0.34.1449pg_graphql-1.0.2>    Compiling pgx-contrib-spiext v0.1.0 (https://github.com/supabase/pgx-contrib-spiext?rev=153ad2db8bb8634332ad36ffc66dcb017353bf93#153ad2db)450pg_graphql-1.0.2>    Compiling graphql-parser v0.4.0451pg_graphql-1.1.0>    Compiling futures v0.3.26452pg_graphql-1.1.0>    Compiling async_once v0.2.6453pg_graphql-1.1.0>    Compiling cached v0.34.1454pg_graphql-1.1.0>    Compiling rand v0.8.5455pg_graphql-1.0.2>    Compiling rand v0.8.5456pg_graphql-1.1.0>    Compiling pgx-contrib-spiext v0.1.0 (https://github.com/supabase/pgx-contrib-spiext?rev=153ad2db8bb8634332ad36ffc66dcb017353bf93#153ad2db)457pg_graphql-1.0.2>    Compiling itertools v0.10.5458pg_graphql-1.1.0>    Compiling graphql-parser v0.4.0459pg_graphql-1.0.2>    Compiling base64 v0.13.1460pg_graphql-1.1.0>    Compiling itertools v0.10.5461pg_graphql-1.1.0>    Compiling base64 v0.13.1462pg_graphql-1.1.0>    Compiling pg_graphql v1.1.0 (/build/source)463pg_graphql-1.1.0> warning: field `alias` is never read464pg_graphql-1.1.0>   --> src/builder.rs:13:9465pg_graphql-1.1.0>    |466pg_graphql-1.1.0> 12 | pub struct InsertBuilder {467pg_graphql-1.1.0>    |            ------------- field in this struct468pg_graphql-1.1.0> 13 |     pub alias: String,469pg_graphql-1.1.0>    |         ^^^^^470pg_graphql-1.1.0>    |471pg_graphql-1.1.0>    = note: `InsertBuilder` has derived impls for the traits `Debug` and `Clone`, but these are intentionally ignored during dead code analysis472pg_graphql-1.1.0>    = note: `#[warn(dead_code)]` on by default473pg_graphql-1.1.0> 474pg_graphql-1.1.0> warning: field `alias` is never read475pg_graphql-1.1.0>    --> src/builder.rs:298:9476pg_graphql-1.1.0>     |477pg_graphql-1.1.0> 297 | pub struct UpdateBuilder {478pg_graphql-1.1.0>     |            ------------- field in this struct479pg_graphql-1.1.0> 298 |     pub alias: String,480pg_graphql-1.1.0>     |         ^^^^^481pg_graphql-1.1.0>     |482pg_graphql-1.1.0>     = note: `UpdateBuilder` has derived impls for the traits `Debug` and `Clone`, but these are intentionally ignored during dead code analysis483pg_graphql-1.1.0> 484pg_graphql-1.1.0> warning: field `alias` is never read485pg_graphql-1.1.0>    --> src/builder.rs:454:9486pg_graphql-1.1.0>     |487pg_graphql-1.1.0> 453 | pub struct DeleteBuilder {488pg_graphql-1.1.0>     |            ------------- field in this struct489pg_graphql-1.1.0> 454 |     pub alias: String,490pg_graphql-1.1.0>     |         ^^^^^491pg_graphql-1.1.0>     |492pg_graphql-1.1.0>     = note: `DeleteBuilder` has derived impls for the traits `Debug` and `Clone`, but these are intentionally ignored during dead code analysis493pg_graphql-1.1.0> 494pg_graphql-1.1.0> warning: field `schema` is never read495pg_graphql-1.1.0>     --> src/builder.rs:1561:9496pg_graphql-1.1.0>      |497pg_graphql-1.1.0> 1560 | pub struct __SchemaBuilder {498pg_graphql-1.1.0>      |            --------------- field in this struct499pg_graphql-1.1.0> 1561 |     pub schema: __Schema,500pg_graphql-1.1.0>      |         ^^^^^^501pg_graphql-1.1.0>      |502pg_graphql-1.1.0>      = note: `__SchemaBuilder` has a derived impl for the trait `Clone`, but this is intentionally ignored during dead code analysis503pg_graphql-1.1.0> 504pg_graphql-1.1.0> warning: method `arg_map` is never used505pg_graphql-1.1.0>    --> src/graphql.rs:317:8506pg_graphql-1.1.0>     |507pg_graphql-1.1.0> 293 | pub trait ___Field {508pg_graphql-1.1.0>     |           -------- method in this trait509pg_graphql-1.1.0> ...510pg_graphql-1.1.0> 317 |     fn arg_map(&self) -> HashMap<String, __InputValue> {511pg_graphql-1.1.0>     |        ^^^^^^^512pg_graphql-1.1.0> 513pg_graphql-1.0.2>    Compiling pg_graphql v1.0.2 (/build/source)514pg_graphql-1.0.2> warning: field `alias` is never read515pg_graphql-1.0.2>   --> src/builder.rs:13:9516pg_graphql-1.0.2>    |517pg_graphql-1.0.2> 12 | pub struct InsertBuilder {518pg_graphql-1.0.2>    |            ------------- field in this struct519pg_graphql-1.0.2> 13 |     pub alias: String,520pg_graphql-1.0.2>    |         ^^^^^521pg_graphql-1.0.2>    |522pg_graphql-1.0.2>    = note: `InsertBuilder` has derived impls for the traits `Debug` and `Clone`, but these are intentionally ignored during dead code analysis523pg_graphql-1.0.2>    = note: `#[warn(dead_code)]` on by default524pg_graphql-1.0.2> 525pg_graphql-1.0.2> warning: field `alias` is never read526pg_graphql-1.0.2>    --> src/builder.rs:298:9527pg_graphql-1.0.2>     |528pg_graphql-1.0.2> 297 | pub struct UpdateBuilder {529pg_graphql-1.0.2>     |            ------------- field in this struct530pg_graphql-1.0.2> 298 |     pub alias: String,531pg_graphql-1.0.2>     |         ^^^^^532pg_graphql-1.0.2>     |533pg_graphql-1.0.2>     = note: `UpdateBuilder` has derived impls for the traits `Debug` and `Clone`, but these are intentionally ignored during dead code analysis534pg_graphql-1.0.2> 535pg_graphql-1.0.2> warning: field `alias` is never read536pg_graphql-1.0.2>    --> src/builder.rs:454:9537pg_graphql-1.0.2>     |538pg_graphql-1.0.2> 453 | pub struct DeleteBuilder {539pg_graphql-1.0.2>     |            ------------- field in this struct540pg_graphql-1.0.2> 454 |     pub alias: String,541pg_graphql-1.0.2>     |         ^^^^^542pg_graphql-1.0.2>     |543pg_graphql-1.0.2>     = note: `DeleteBuilder` has derived impls for the traits `Debug` and `Clone`, but these are intentionally ignored during dead code analysis544pg_graphql-1.0.2> 545pg_graphql-1.0.2> warning: field `schema` is never read546pg_graphql-1.0.2>     --> src/builder.rs:1548:9547pg_graphql-1.0.2>      |548pg_graphql-1.0.2> 1547 | pub struct __SchemaBuilder {549pg_graphql-1.0.2>      |            --------------- field in this struct550pg_graphql-1.0.2> 1548 |     pub schema: __Schema,551pg_graphql-1.0.2>      |         ^^^^^^552pg_graphql-1.0.2>      |553pg_graphql-1.0.2>      = note: `__SchemaBuilder` has a derived impl for the trait `Clone`, but this is intentionally ignored during dead code analysis554pg_graphql-1.0.2> 555pg_graphql-1.0.2> warning: method `arg_map` is never used556pg_graphql-1.0.2>    --> src/graphql.rs:318:8557pg_graphql-1.0.2>     |558pg_graphql-1.0.2> 294 | pub trait ___Field {559pg_graphql-1.0.2>     |           -------- method in this trait560pg_graphql-1.0.2> ...561pg_graphql-1.0.2> 318 |     fn arg_map(&self) -> HashMap<String, __InputValue> {562pg_graphql-1.0.2>     |        ^^^^^^^563pg_graphql-1.0.2> 564pg_graphql-1.0.2> warning: `pg_graphql` (lib) generated 5 warnings565pg_graphql-1.0.2>     Finished `release` profile [optimized] target(s) in 6m 41s566pg_graphql-1.0.2>   Installing extension567pg_graphql-1.0.2>      Copying control file to /nix/store/h16zsk3fi7wvqvzs8r8510klirhfcsz0-pg_graphql-1.0.2/nix/store/bc9327c6474vwmqmhkszkmiz86mba73s-postgresql-15.19/share/postgresql/extension/pg_graphql.control568pg_graphql-1.0.2>      Copying shared library to /nix/store/h16zsk3fi7wvqvzs8r8510klirhfcsz0-pg_graphql-1.0.2/nix/store/bs8w2qsyhnqirvhchz9fnvf86y7j6xyf-postgresql-15.19-lib/lib/pg_graphql.so569pg_graphql-1.0.2>  Discovering SQL entities570pg_graphql-1.1.0> warning: `pg_graphql` (lib) generated 5 warnings571pg_graphql-1.1.0>     Finished `release` profile [optimized] target(s) in 6m 38s572pg_graphql-1.1.0>   Installing extension573pg_graphql-1.1.0>      Copying control file to /nix/store/9l1j85mzys4q5grfp6nq3wfabc7byx42-pg_graphql-1.1.0/nix/store/bc9327c6474vwmqmhkszkmiz86mba73s-postgresql-15.19/share/postgresql/extension/pg_graphql.control574pg_graphql-1.1.0>      Copying shared library to /nix/store/9l1j85mzys4q5grfp6nq3wfabc7byx42-pg_graphql-1.1.0/nix/store/bs8w2qsyhnqirvhchz9fnvf86y7j6xyf-postgresql-15.19-lib/lib/pg_graphql.so575pg_graphql-1.1.0>  Discovering SQL entities576pg_graphql-1.0.2>   Discovered 4 SQL entities: 0 schemas (0 unique), 1 functions, 0 types, 0 enums, 3 sqls, 0 ords, 0 hashes, 0 aggregates, 0 triggers577pg_graphql-1.0.2>      Writing SQL entities to /nix/store/h16zsk3fi7wvqvzs8r8510klirhfcsz0-pg_graphql-1.0.2/nix/store/bc9327c6474vwmqmhkszkmiz86mba73s-postgresql-15.19/share/postgresql/extension/pg_graphql--1.0.2.sql578pg_graphql-1.0.2>     Finished installing pg_graphql579pg_graphql-1.0.2> buildPhase completed in 6 minutes 57 seconds580pg_graphql-1.0.2> Running phase: checkPhase581pg_graphql-1.0.2>    Validating /nix/store/bc9327c6474vwmqmhkszkmiz86mba73s-postgresql-15.19/bin/pg_config582pg_graphql-1.0.2>  Initializing data directory at /build/tmp.JhXKR9dMhy/data-15583pg_graphql-1.1.0>   Discovered 4 SQL entities: 0 schemas (0 unique), 1 functions, 0 types, 0 enums, 3 sqls, 0 ords, 0 hashes, 0 aggregates, 0 triggers584pg_graphql-1.1.0>      Writing SQL entities to /nix/store/9l1j85mzys4q5grfp6nq3wfabc7byx42-pg_graphql-1.1.0/nix/store/bc9327c6474vwmqmhkszkmiz86mba73s-postgresql-15.19/share/postgresql/extension/pg_graphql--1.1.0.sql585pg_graphql-1.1.0>     Finished installing pg_graphql586pg_graphql-1.1.0> buildPhase completed in 6 minutes 53 seconds587pg_graphql-1.1.0> Running phase: checkPhase588pg_graphql-1.1.0>    Validating /nix/store/bc9327c6474vwmqmhkszkmiz86mba73s-postgresql-15.19/bin/pg_config589pg_graphql-1.1.0>  Initializing data directory at /build/tmp.OKZvYoIo6a/data-15590pg_graphql-1.0.2> waiting for server to start....2026-10-27 12:23:40.438 GMT [3509] LOG:  starting PostgreSQL 15.19 on aarch64-unknown-linux-gnu, compiled by gcc (GCC) 15.3.0, 64-bit591pg_graphql-1.0.2> 2026-10-27 12:23:40.445 GMT [3509] LOG:  listening on Unix socket "/build/tmp.xWtZ0HxQoc/.s.PGSQL.5432"592pg_graphql-1.0.2> 2026-10-27 12:23:40.453 GMT [3512] LOG:  database system was shut down at 2026-10-27 12:23:40 GMT593pg_graphql-1.0.2> 2026-10-27 12:23:40.459 GMT [3509] LOG:  database system is ready to accept connections594pg_graphql-1.0.2>  done595pg_graphql-1.0.2> server started596pg_graphql-1.0.2> createuser: error: connection to server at "localhost" (127.0.0.1), port 5432 failed: Connection refused597pg_graphql-1.0.2> 	Is the server running on that host and accepting TCP/IP connections?598pg_graphql-1.0.2> waiting for server to shut down....2026-10-27 12:23:40.515 GMT [3509] LOG:  received fast shutdown request599pg_graphql-1.0.2> 2026-10-27 12:23:40.518 GMT [3509] LOG:  aborting any active transactions600pg_graphql-1.0.2> 2026-10-27 12:23:40.520 GMT [3509] LOG:  background worker "logical replication launcher" (PID 3515) exited with exit code 1601pg_graphql-1.0.2> 2026-10-27 12:23:40.521 GMT [3510] LOG:  shutting down602pg_graphql-1.0.2> 2026-10-27 12:23:40.524 GMT [3510] LOG:  checkpoint starting: shutdown immediate603pg_graphql-1.0.2> 2026-10-27 12:23:40.542 GMT [3510] LOG:  checkpoint complete: wrote 3 buffers (0.0%); 0 WAL file(s) added, 0 removed, 0 recycled; write=0.006 s, sync=0.002 s, total=0.021 s; sync files=2, longest=0.001 s, average=0.001 s; distance=0 kB, estimate=0 kB604pg_graphql-1.0.2> 2026-10-27 12:23:40.548 GMT [3509] LOG:  database system is shut down605pg_graphql-1.0.2>  done606pg_graphql-1.0.2> server stopped607pg_graphql-1.0.2> warning: `/build/source/.cargo/config` is deprecated in favor of `config.toml`608pg_graphql-1.0.2> note: if you need to support cargo 1.38 or earlier, you can symlink `config` to `config.toml`609pg_graphql-1.0.2>    Validating /build/tmp.7V9QACChtV/15/bin/pg_config610pg_graphql-1.0.2> warning: `/build/source/.cargo/config` is deprecated in favor of `config.toml`611pg_graphql-1.0.2> note: if you need to support cargo 1.38 or earlier, you can symlink `config` to `config.toml`612pg_graphql-1.1.0> waiting for server to start....2026-10-27 12:23:40.965 GMT [3509] LOG:  starting PostgreSQL 15.19 on aarch64-unknown-linux-gnu, compiled by gcc (GCC) 15.3.0, 64-bit613pg_graphql-1.1.0> 2026-10-27 12:23:40.967 GMT [3509] LOG:  listening on Unix socket "/build/tmp.SxjexPRCiD/.s.PGSQL.5432"614pg_graphql-1.1.0> 2026-10-27 12:23:40.976 GMT [3512] LOG:  database system was shut down at 2026-10-27 12:23:40 GMT615pg_graphql-1.1.0> 2026-10-27 12:23:40.982 GMT [3509] LOG:  database system is ready to accept connections616pg_graphql-1.0.2>     Building extension with features pg15617pg_graphql-1.0.2>      Running command "cargo" "build" "--release" "--features" "pg15" "--no-default-features" "--message-format=json-render-diagnostics" "--frozen" "-j" "2"618pg_graphql-1.0.2> warning: `/build/source/.cargo/config` is deprecated in favor of `config.toml`619pg_graphql-1.0.2> note: if you need to support cargo 1.38 or earlier, you can symlink `config` to `config.toml`620pg_graphql-1.1.0>  done621pg_graphql-1.1.0> server started622pg_graphql-1.1.0> createuser: error: connection to server at "localhost" (127.0.0.1), port 5432 failed: Connection refused623pg_graphql-1.1.0> 	Is the server running on that host and accepting TCP/IP connections?624pg_graphql-1.1.0> waiting for server to shut down....2026-10-27 12:23:41.049 GMT [3509] LOG:  received fast shutdown request625pg_graphql-1.1.0> 2026-10-27 12:23:41.051 GMT [3509] LOG:  aborting any active transactions626pg_graphql-1.1.0> 2026-10-27 12:23:41.053 GMT [3509] LOG:  background worker "logical replication launcher" (PID 3515) exited with exit code 1627pg_graphql-1.1.0> 2026-10-27 12:23:41.057 GMT [3510] LOG:  shutting down628pg_graphql-1.1.0> 2026-10-27 12:23:41.059 GMT [3510] LOG:  checkpoint starting: shutdown immediate629pg_graphql-1.1.0> 2026-10-27 12:23:41.084 GMT [3510] LOG:  checkpoint complete: wrote 3 buffers (0.0%); 0 WAL file(s) added, 0 removed, 0 recycled; write=0.004 s, sync=0.015 s, total=0.028 s; sync files=2, longest=0.013 s, average=0.008 s; distance=0 kB, estimate=0 kB630pg_graphql-1.1.0> 2026-10-27 12:23:41.090 GMT [3509] LOG:  database system is shut down631pg_graphql-1.1.0>  done632pg_graphql-1.1.0> server stopped633pg_graphql-1.0.2> warning: field `alias` is never read634pg_graphql-1.0.2>   --> src/builder.rs:13:9635pg_graphql-1.0.2>    |636pg_graphql-1.0.2> 12 | pub struct InsertBuilder {637pg_graphql-1.0.2>    |            ------------- field in this struct638pg_graphql-1.0.2> 13 |     pub alias: String,639pg_graphql-1.0.2>    |         ^^^^^640pg_graphql-1.0.2>    |641pg_graphql-1.0.2>    = note: `InsertBuilder` has derived impls for the traits `Debug` and `Clone`, but these are intentionally ignored during dead code analysis642pg_graphql-1.0.2>    = note: `#[warn(dead_code)]` on by default643pg_graphql-1.0.2> 644pg_graphql-1.0.2> warning: field `alias` is never read645pg_graphql-1.0.2>    --> src/builder.rs:298:9646pg_graphql-1.0.2>     |647pg_graphql-1.0.2> 297 | pub struct UpdateBuilder {648pg_graphql-1.0.2>     |            ------------- field in this struct649pg_graphql-1.0.2> 298 |     pub alias: String,650pg_graphql-1.0.2>     |         ^^^^^651pg_graphql-1.0.2>     |652pg_graphql-1.0.2>     = note: `UpdateBuilder` has derived impls for the traits `Debug` and `Clone`, but these are intentionally ignored during dead code analysis653pg_graphql-1.0.2> 654pg_graphql-1.0.2> warning: field `alias` is never read655pg_graphql-1.0.2>    --> src/builder.rs:454:9656pg_graphql-1.0.2>     |657pg_graphql-1.0.2> 453 | pub struct DeleteBuilder {658pg_graphql-1.0.2>     |            ------------- field in this struct659pg_graphql-1.0.2> 454 |     pub alias: String,660pg_graphql-1.0.2>     |         ^^^^^661pg_graphql-1.0.2>     |662pg_graphql-1.0.2>     = note: `DeleteBuilder` has derived impls for the traits `Debug` and `Clone`, but these are intentionally ignored during dead code analysis663pg_graphql-1.0.2> 664pg_graphql-1.0.2> warning: field `schema` is never read665pg_graphql-1.0.2>     --> src/builder.rs:1548:9666pg_graphql-1.0.2>      |667pg_graphql-1.0.2> 1547 | pub struct __SchemaBuilder {668pg_graphql-1.0.2>      |            --------------- field in this struct669pg_graphql-1.0.2> 1548 |     pub schema: __Schema,670pg_graphql-1.0.2>      |         ^^^^^^671pg_graphql-1.0.2>      |672pg_graphql-1.0.2>      = note: `__SchemaBuilder` has a derived impl for the trait `Clone`, but this is intentionally ignored during dead code analysis673pg_graphql-1.0.2> 674pg_graphql-1.0.2> warning: method `arg_map` is never used675pg_graphql-1.0.2>    --> src/graphql.rs:318:8676pg_graphql-1.0.2>     |677pg_graphql-1.0.2> 294 | pub trait ___Field {678pg_graphql-1.0.2>     |           -------- method in this trait679pg_graphql-1.0.2> ...680pg_graphql-1.0.2> 318 |     fn arg_map(&self) -> HashMap<String, __InputValue> {681pg_graphql-1.0.2>     |        ^^^^^^^682pg_graphql-1.0.2> 683pg_graphql-1.0.2> warning: `pg_graphql` (lib) generated 5 warnings684pg_graphql-1.0.2>     Finished `release` profile [optimized] target(s) in 0.16s685pg_graphql-1.0.2>   Installing extension686pg_graphql-1.0.2>      Copying control file to /build/tmp.7V9QACChtV/15/share/postgresql/extension/pg_graphql.control687pg_graphql-1.1.0> warning: `/build/source/.cargo/config` is deprecated in favor of `config.toml`688pg_graphql-1.1.0> note: if you need to support cargo 1.38 or earlier, you can symlink `config` to `config.toml`689pg_graphql-1.1.0>    Validating /build/tmp.zZrJexRsMM/15/bin/pg_config690pg_graphql-1.1.0> warning: `/build/source/.cargo/config` is deprecated in favor of `config.toml`691pg_graphql-1.1.0> note: if you need to support cargo 1.38 or earlier, you can symlink `config` to `config.toml`692pg_graphql-1.0.2>      Copying shared library to /build/tmp.7V9QACChtV/15/lib/pg_graphql.so693pg_graphql-1.1.0>     Building extension with features pg15694pg_graphql-1.1.0>      Running command "cargo" "build" "--release" "--features" "pg15" "--message-format=json-render-diagnostics" "--frozen" "-j" "2"695pg_graphql-1.1.0> warning: `/build/source/.cargo/config` is deprecated in favor of `config.toml`696pg_graphql-1.1.0> note: if you need to support cargo 1.38 or earlier, you can symlink `config` to `config.toml`697pg_graphql-1.0.2>  Discovering SQL entities698pg_graphql-1.1.0> warning: field `alias` is never read699pg_graphql-1.1.0>   --> src/builder.rs:13:9700pg_graphql-1.1.0>    |701pg_graphql-1.1.0> 12 | pub struct InsertBuilder {702pg_graphql-1.1.0>    |            ------------- field in this struct703pg_graphql-1.1.0> 13 |     pub alias: String,704pg_graphql-1.1.0>    |         ^^^^^705pg_graphql-1.1.0>    |706pg_graphql-1.1.0>    = note: `InsertBuilder` has derived impls for the traits `Debug` and `Clone`, but these are intentionally ignored during dead code analysis707pg_graphql-1.1.0>    = note: `#[warn(dead_code)]` on by default708pg_graphql-1.1.0> 709pg_graphql-1.1.0> warning: field `alias` is never read710pg_graphql-1.1.0>    --> src/builder.rs:298:9711pg_graphql-1.1.0>     |712pg_graphql-1.1.0> 297 | pub struct UpdateBuilder {713pg_graphql-1.1.0>     |            ------------- field in this struct714pg_graphql-1.1.0> 298 |     pub alias: String,715pg_graphql-1.1.0>     |         ^^^^^716pg_graphql-1.1.0>     |717pg_graphql-1.1.0>     = note: `UpdateBuilder` has derived impls for the traits `Debug` and `Clone`, but these are intentionally ignored during dead code analysis718pg_graphql-1.1.0> 719pg_graphql-1.1.0> warning: field `alias` is never read720pg_graphql-1.1.0>    --> src/builder.rs:454:9721pg_graphql-1.1.0>     |722pg_graphql-1.1.0> 453 | pub struct DeleteBuilder {723pg_graphql-1.1.0>     |            ------------- field in this struct724pg_graphql-1.1.0> 454 |     pub alias: String,725pg_graphql-1.1.0>     |         ^^^^^726pg_graphql-1.1.0>     |727pg_graphql-1.1.0>     = note: `DeleteBuilder` has derived impls for the traits `Debug` and `Clone`, but these are intentionally ignored during dead code analysis728pg_graphql-1.1.0> 729pg_graphql-1.1.0> warning: field `schema` is never read730pg_graphql-1.1.0>     --> src/builder.rs:1561:9731pg_graphql-1.1.0>      |732pg_graphql-1.1.0> 1560 | pub struct __SchemaBuilder {733pg_graphql-1.1.0>      |            --------------- field in this struct734pg_graphql-1.1.0> 1561 |     pub schema: __Schema,735pg_graphql-1.1.0>      |         ^^^^^^736pg_graphql-1.1.0>      |737pg_graphql-1.1.0>      = note: `__SchemaBuilder` has a derived impl for the trait `Clone`, but this is intentionally ignored during dead code analysis738pg_graphql-1.1.0> 739pg_graphql-1.1.0> warning: method `arg_map` is never used740pg_graphql-1.1.0>    --> src/graphql.rs:317:8741pg_graphql-1.1.0>     |742pg_graphql-1.1.0> 293 | pub trait ___Field {743pg_graphql-1.1.0>     |           -------- method in this trait744pg_graphql-1.1.0> ...745pg_graphql-1.1.0> 317 |     fn arg_map(&self) -> HashMap<String, __InputValue> {746pg_graphql-1.1.0>     |        ^^^^^^^747pg_graphql-1.1.0> 748pg_graphql-1.1.0> warning: `pg_graphql` (lib) generated 5 warnings749pg_graphql-1.1.0>     Finished `release` profile [optimized] target(s) in 0.17s750pg_graphql-1.1.0>   Installing extension751pg_graphql-1.1.0>      Copying control file to /build/tmp.zZrJexRsMM/15/share/postgresql/extension/pg_graphql.control752pg_graphql-1.1.0>      Copying shared library to /build/tmp.zZrJexRsMM/15/lib/pg_graphql.so753pg_graphql-1.1.0>  Discovering SQL entities754pg_graphql-1.0.2>   Discovered 4 SQL entities: 0 schemas (0 unique), 1 functions, 0 types, 0 enums, 3 sqls, 0 ords, 0 hashes, 0 aggregates, 0 triggers755pg_graphql-1.0.2>      Writing SQL entities to /build/tmp.7V9QACChtV/15/share/postgresql/extension/pg_graphql--1.0.2.sql756pg_graphql-1.0.2>     Finished installing pg_graphql757pg_graphql-1.0.2> ++ mktemp -d758pg_graphql-1.0.2> + TMPDIR=/build/tmp.VKXIu6rAFS759pg_graphql-1.0.2> + export PGDATA=/build/tmp.VKXIu6rAFS760pg_graphql-1.0.2> + PGDATA=/build/tmp.VKXIu6rAFS761pg_graphql-1.0.2> + export PGHOST=/build/tmp.VKXIu6rAFS762pg_graphql-1.0.2> + PGHOST=/build/tmp.VKXIu6rAFS763pg_graphql-1.0.2> + export PGUSER=postgres764pg_graphql-1.0.2> + PGUSER=postgres765pg_graphql-1.0.2> + export PGDATABASE=postgres766pg_graphql-1.0.2> + PGDATABASE=postgres767pg_graphql-1.0.2> + export PGTZ=UTC768pg_graphql-1.0.2> + PGTZ=UTC769pg_graphql-1.0.2> + export PG_COLOR=auto770pg_graphql-1.0.2> + PG_COLOR=auto771pg_graphql-1.0.2> + trap 'pg_ctl stop -m i' sigint sigterm exit772pg_graphql-1.0.2> + rm -rf ''773pg_graphql-1.0.2> + initdb --no-locale --encoding=UTF8 --nosync -U postgres774pg_graphql-1.0.2> The files belonging to this database system will be owned by user "nixbld".775pg_graphql-1.0.2> This user must also own the server process.776pg_graphql-1.0.2> 777pg_graphql-1.0.2> The database cluster will be initialized with locale "C".778pg_graphql-1.0.2> The default text search configuration will be set to "english".779pg_graphql-1.0.2> 780pg_graphql-1.0.2> Data page checksums are disabled.781pg_graphql-1.0.2> 782pg_graphql-1.0.2> fixing permissions on existing directory /build/tmp.VKXIu6rAFS ... ok783pg_graphql-1.0.2> creating subdirectories ... ok784pg_graphql-1.0.2> selecting dynamic shared memory implementation ... posix785pg_graphql-1.0.2> selecting default max_connections ... 100786pg_graphql-1.0.2> selecting default shared_buffers ... 128MB787pg_graphql-1.0.2> selecting default time zone ... UTC788pg_graphql-1.0.2> creating configuration files ... ok789pg_graphql-1.0.2> running bootstrap script ... ok790pg_graphql-1.0.2> performing post-bootstrap initialization ... ok791pg_graphql-1.0.2> 792pg_graphql-1.0.2> Sync to disk skipped.793pg_graphql-1.0.2> The data directory might become corrupt if the operating system crashes.794pg_graphql-1.0.2> 795pg_graphql-1.0.2> initdb: warning: enabling "trust" authentication for local connections796pg_graphql-1.0.2> initdb: hint: You can change this by editing pg_hba.conf or using the option -A, or --auth-local and --auth-host, the next time you run initdb.797pg_graphql-1.0.2> 798pg_graphql-1.0.2> Success. You can now start the database server using:799pg_graphql-1.0.2> 800pg_graphql-1.0.2>     /build/tmp.7V9QACChtV/15/bin/pg_ctl -D /build/tmp.VKXIu6rAFS -l logfile start801pg_graphql-1.0.2> 802pg_graphql-1.0.2> + pg_ctl start -o '-F -c listen_addresses="" -c log_min_messages=WARNING -k /build/tmp.VKXIu6rAFS'803pg_graphql-1.0.2> waiting for server to start....2026-10-27 12:23:55.801 UTC [3607] LOG:  starting PostgreSQL 15.19 on aarch64-unknown-linux-gnu, compiled by gcc (GCC) 15.3.0, 64-bit804pg_graphql-1.0.2> 2026-10-27 12:23:55.802 UTC [3607] LOG:  listening on Unix socket "/build/tmp.VKXIu6rAFS/.s.PGSQL.5432"805pg_graphql-1.0.2> 2026-10-27 12:23:55.803 UTC [3610] LOG:  database system was shut down at 2026-10-27 12:23:55 UTC806pg_graphql-1.0.2> 2026-10-27 12:23:55.807 UTC [3607] LOG:  database system is ready to accept connections807pg_graphql-1.0.2>  done808pg_graphql-1.0.2> server started809pg_graphql-1.0.2> + createdb contrib_regression810pg_graphql-1.0.2> + TESTDIR=test811pg_graphql-1.0.2> +++ pg_config --pgxs812pg_graphql-1.0.2> ++ dirname /nix/store/bc9327c6474vwmqmhkszkmiz86mba73s-postgresql-15.19/lib/pgxs/src/makefiles/pgxs.mk813pg_graphql-1.0.2> + PGXS=/nix/store/bc9327c6474vwmqmhkszkmiz86mba73s-postgresql-15.19/lib/pgxs/src/makefiles814pg_graphql-1.0.2> + REGRESS=/nix/store/bc9327c6474vwmqmhkszkmiz86mba73s-postgresql-15.19/lib/pgxs/src/makefiles/../test/regress/pg_regress815pg_graphql-1.0.2> ++ ls test/sql816pg_graphql-1.0.2> ++ sed -e 's/\..*$//'817pg_graphql-1.0.2> ++ sort818pg_graphql-1.0.2> + TESTS=$'aliases\nallow_camel_names\nbigint_is_string\ncomment_directive\nempty_mutations\nextend_type_with_function\nextend_type_with_generated_column\nfilter_by_node_id\nfragment_on_mutation\nfragment_on_query\ninflection_fields\ninflection_function\ninflection_relationships\ninflection_types\nissue_163\nissue_170\nissue_225\njson_is_stringified\nmax_page_size\nmulti_column_primary_key\nmultiple_mutations\nmultiple_queries\nmutation_delete\nmutation_delete_variable\nmutation_insert\nmutation_update\nnull_argument\nomit_exotic_types\nomit_weird_names\noperation_name\noverride_enum_name\noverride_field_name\noverride_func_field_name\noverride_relationship_field_name\noverride_type_name\npage_info\npermissions_connection_column\npermissions_node_column\npermissions_table_level\npermissions_types\nprimary_key_is_required\nrelationship_one_to_one\nresolve___schema\nresolve___type\nresolve___typename\nresolve_array_type\nresolve_connection_filter\nresolve_connection_named\nresolve_connection_order_by\nresolve_connection_pagination_args\nresolve_connection_to_conn\nresolve_connection_to_node\nresolve_error_connection_edge_no_field\nresolve_error_connection_edge_node_no_field\nresolve_error_connection_no_field\nresolve_error_from_parser\nresolve_error_mutation_no_field\nresolve_error_node_no_field\nresolve_error_query_no_field\nresolve_fragment\nresolve_graphiql_schema\nresolve_one\nroundtrip_types\nrow_level_security\nsqli_connection\ntest_error_anon_and_named_operations\ntest_error_multiple_anon_operations\ntest_error_operation_name_not_found\ntest_error_operation_names_not_unique\ntest_error_parsing\ntest_error_subscription\ntest_query__type\ntotal_count'819pg_graphql-1.0.2> + psql -v ON_ERROR_STOP=1 -f test/fixtures.sql -d contrib_regression820pg_graphql-1.0.2> psql:test/fixtures.sql:1: NOTICE:  extension "pg_graphql" does not exist, skipping821pg_graphql-1.0.2> DROP EXTENSION822pg_graphql-1.0.2> CREATE EXTENSION823pg_graphql-1.0.2> COMMENT824pg_graphql-1.0.2> CREATE FUNCTION825pg_graphql-1.0.2> + /nix/store/bc9327c6474vwmqmhkszkmiz86mba73s-postgresql-15.19/lib/pgxs/src/makefiles/../test/regress/pg_regress --use-existing --dbname=contrib_regression --inputdir=test aliases allow_camel_names bigint_is_string comment_directive empty_mutations extend_type_with_function extend_type_with_generated_column filter_by_node_id fragment_on_mutation fragment_on_query inflection_fields inflection_function inflection_relationships inflection_types issue_163 issue_170 issue_225 json_is_stringified max_page_size multi_column_primary_key multiple_mutations multiple_queries mutation_delete mutation_delete_variable mutation_insert mutation_update null_argument omit_exotic_types omit_weird_names operation_name override_enum_name override_field_name override_func_field_name override_relationship_field_name override_type_name page_info permissions_connection_column permissions_node_column permissions_table_level permissions_types primary_key_is_required relationship_one_to_one resolve___schema resolve___type resolve___typename resolve_array_type resolve_connection_filter resolve_connection_named resolve_connection_order_by resolve_connection_pagination_args resolve_connection_to_conn resolve_connection_to_node resolve_error_connection_edge_no_field resolve_error_connection_edge_node_no_field resolve_error_connection_no_field resolve_error_from_parser resolve_error_mutation_no_field resolve_error_node_no_field resolve_error_query_no_field resolve_fragment resolve_graphiql_schema resolve_one roundtrip_types row_level_security sqli_connection test_error_anon_and_named_operations test_error_multiple_anon_operations test_error_operation_name_not_found test_error_operation_names_not_unique test_error_parsing test_error_subscription test_query__type total_count826pg_graphql-1.0.2> (using postmaster on /build/tmp.VKXIu6rAFS, default port)827pg_graphql-1.0.2> ============== running regression test queries        ==============828pg_graphql-1.0.2> test aliases                      ... ok           39 ms829pg_graphql-1.0.2> test allow_camel_names            ... ok           36 ms830pg_graphql-1.0.2> test bigint_is_string             ... ok           37 ms831pg_graphql-1.0.2> test comment_directive            ... ok           10 ms832pg_graphql-1.0.2> test empty_mutations              ... ok           29 ms833pg_graphql-1.1.0>   Discovered 4 SQL entities: 0 schemas (0 unique), 1 functions, 0 types, 0 enums, 3 sqls, 0 ords, 0 hashes, 0 aggregates, 0 triggers834pg_graphql-1.1.0>      Writing SQL entities to /build/tmp.zZrJexRsMM/15/share/postgresql/extension/pg_graphql--1.1.0.sql835pg_graphql-1.1.0>     Finished installing pg_graphql836pg_graphql-1.1.0> ++ mktemp -d837pg_graphql-1.0.2> test extend_type_with_function    ... ok           33 ms838pg_graphql-1.1.0> + TMPDIR=/build/tmp.QcvhqEmJD1839pg_graphql-1.1.0> + export PGDATA=/build/tmp.QcvhqEmJD1840pg_graphql-1.1.0> + PGDATA=/build/tmp.QcvhqEmJD1841pg_graphql-1.1.0> + export PGHOST=/build/tmp.QcvhqEmJD1842pg_graphql-1.1.0> + PGHOST=/build/tmp.QcvhqEmJD1843pg_graphql-1.1.0> + export PGUSER=postgres844pg_graphql-1.1.0> + PGUSER=postgres845pg_graphql-1.1.0> + export PGDATABASE=postgres846pg_graphql-1.1.0> + PGDATABASE=postgres847pg_graphql-1.1.0> + export PGTZ=UTC848pg_graphql-1.1.0> + PGTZ=UTC849pg_graphql-1.1.0> + export PG_COLOR=auto850pg_graphql-1.1.0> + PG_COLOR=auto851pg_graphql-1.1.0> + trap 'pg_ctl stop -m i' sigint sigterm exit852pg_graphql-1.1.0> + rm -rf ''853pg_graphql-1.1.0> + initdb --no-locale --encoding=UTF8 --nosync -U postgres854pg_graphql-1.1.0> The files belonging to this database system will be owned by user "nixbld".855pg_graphql-1.1.0> This user must also own the server process.856pg_graphql-1.1.0> 857pg_graphql-1.1.0> The database cluster will be initialized with locale "C".858pg_graphql-1.1.0> The default text search configuration will be set to "english".859pg_graphql-1.1.0> 860pg_graphql-1.1.0> Data page checksums are disabled.861pg_graphql-1.1.0> 862pg_graphql-1.1.0> fixing permissions on existing directory /build/tmp.QcvhqEmJD1 ... ok863pg_graphql-1.1.0> creating subdirectories ... ok864pg_graphql-1.1.0> selecting dynamic shared memory implementation ... posix865pg_graphql-1.0.2> test extend_type_with_generated_column ... ok           31 ms866pg_graphql-1.1.0> selecting default max_connections ... 100867pg_graphql-1.1.0> selecting default shared_buffers ... 128MB868pg_graphql-1.1.0> selecting default time zone ... UTC869pg_graphql-1.1.0> creating configuration files ... ok870pg_graphql-1.0.2> test filter_by_node_id            ... ok           34 ms871pg_graphql-1.0.2> test fragment_on_mutation         ... ok           28 ms872pg_graphql-1.0.2> test fragment_on_query            ... ok           36 ms873pg_graphql-1.0.2> test inflection_fields            ... ok           57 ms874pg_graphql-1.1.0> running bootstrap script ... ok875pg_graphql-1.0.2> test inflection_function          ... ok           53 ms876pg_graphql-1.0.2> test inflection_relationships     ... ok           76 ms877pg_graphql-1.0.2> test inflection_types             ... ok           48 ms878pg_graphql-1.0.2> test issue_163                    ... ok           28 ms879pg_graphql-1.0.2> test issue_170                    ... ok           31 ms880pg_graphql-1.0.2> test issue_225                    ... ok           32 ms881pg_graphql-1.0.2> test json_is_stringified          ... ok           34 ms882pg_graphql-1.0.2> test max_page_size                ... ok           29 ms883pg_graphql-1.0.2> test multi_column_primary_key     ... ok           41 ms884pg_graphql-1.1.0> performing post-bootstrap initialization ... ok885pg_graphql-1.1.0> 886pg_graphql-1.1.0> Sync to disk skipped.887pg_graphql-1.1.0> The data directory might become corrupt if the operating system crashes.888pg_graphql-1.1.0> 889pg_graphql-1.1.0> initdb: warning: enabling "trust" authentication for local connections890pg_graphql-1.1.0> initdb: hint: You can change this by editing pg_hba.conf or using the option -A, or --auth-local and --auth-host, the next time you run initdb.891pg_graphql-1.1.0> 892pg_graphql-1.1.0> Success. You can now start the database server using:893pg_graphql-1.1.0> 894pg_graphql-1.1.0>     /build/tmp.zZrJexRsMM/15/bin/pg_ctl -D /build/tmp.QcvhqEmJD1 -l logfile start895pg_graphql-1.1.0> 896pg_graphql-1.1.0> + pg_ctl start -o '-F -c listen_addresses="" -c log_min_messages=WARNING -k /build/tmp.QcvhqEmJD1'897pg_graphql-1.0.2> test multiple_mutations           ... ok           30 ms898pg_graphql-1.1.0> waiting for server to start....2026-10-27 12:23:56.777 UTC [3607] LOG:  starting PostgreSQL 15.19 on aarch64-unknown-linux-gnu, compiled by gcc (GCC) 15.3.0, 64-bit899pg_graphql-1.1.0> 2026-10-27 12:23:56.777 UTC [3607] LOG:  listening on Unix socket "/build/tmp.QcvhqEmJD1/.s.PGSQL.5432"900pg_graphql-1.1.0> 2026-10-27 12:23:56.778 UTC [3610] LOG:  database system was shut down at 2026-10-27 12:23:56 UTC901pg_graphql-1.1.0> 2026-10-27 12:23:56.782 UTC [3607] LOG:  database system is ready to accept connections902pg_graphql-1.0.2> test multiple_queries             ... ok           30 ms903pg_graphql-1.0.2> test mutation_delete              ... ok           41 ms904pg_graphql-1.1.0>  done905pg_graphql-1.1.0> server started906pg_graphql-1.1.0> + createdb contrib_regression907pg_graphql-1.0.2> test mutation_delete_variable     ... ok           30 ms908pg_graphql-1.1.0> + TESTDIR=test909pg_graphql-1.1.0> +++ pg_config --pgxs910pg_graphql-1.1.0> ++ dirname /nix/store/bc9327c6474vwmqmhkszkmiz86mba73s-postgresql-15.19/lib/pgxs/src/makefiles/pgxs.mk911pg_graphql-1.0.2> test mutation_insert              ... ok           42 ms912pg_graphql-1.1.0> + PGXS=/nix/store/bc9327c6474vwmqmhkszkmiz86mba73s-postgresql-15.19/lib/pgxs/src/makefiles913pg_graphql-1.1.0> + REGRESS=/nix/store/bc9327c6474vwmqmhkszkmiz86mba73s-postgresql-15.19/lib/pgxs/src/makefiles/../test/regress/pg_regress914pg_graphql-1.1.0> ++ ls test/sql915pg_graphql-1.1.0> ++ sed -e 's/\..*$//'916pg_graphql-1.1.0> ++ sort917pg_graphql-1.1.0> + TESTS=$'aliases\nallow_camel_names\nbigint_is_string\ncomment_directive\nempty_mutations\nextend_type_with_function\nextend_type_with_generated_column\nfilter_by_node_id\nfragment_on_mutation\nfragment_on_query\ninflection_fields\ninflection_function\ninflection_relationships\ninflection_types\nissue_163\nissue_170\nissue_225\nissue_300\nissue_306\njson_is_stringified\nmax_page_size\nmax_rows_directive\nmulti_column_primary_key\nmultiple_mutations\nmultiple_queries\nmutation_delete\nmutation_delete_variable\nmutation_insert\nmutation_update\nnull_argument\nomit_exotic_types\nomit_weird_names\noperation_name\noverride_enum_name\noverride_field_name\noverride_func_field_name\noverride_relationship_field_name\noverride_type_name\npage_info\npermissions_connection_column\npermissions_node_column\npermissions_table_level\npermissions_types\nprimary_key_is_required\nrelationship_one_to_one\nresolve___schema\nresolve___type\nresolve___typename\nresolve_array_type\nresolve_connection_filter\nresolve_connection_named\nresolve_connection_order_by\nresolve_connection_pagination_args\nresolve_connection_to_conn\nresolve_connection_to_node\nresolve_error_connection_edge_no_field\nresolve_error_connection_edge_node_no_field\nresolve_error_connection_no_field\nresolve_error_from_parser\nresolve_error_mutation_no_field\nresolve_error_node_no_field\nresolve_error_query_no_field\nresolve_fragment\nresolve_graphiql_schema\nresolve_one\nroundtrip_types\nrow_level_security\nsqli_connection\ntest_error_anon_and_named_operations\ntest_error_multiple_anon_operations\ntest_error_operation_name_not_found\ntest_error_operation_names_not_unique\ntest_error_parsing\ntest_error_subscription\ntest_query__type\ntotal_count\nviews_integration'918pg_graphql-1.1.0> + psql -v ON_ERROR_STOP=1 -f test/fixtures.sql -d contrib_regression919pg_graphql-1.1.0> psql:test/fixtures.sql:1: NOTICE:  extension "pg_graphql" does not exist, skipping920pg_graphql-1.1.0> DROP EXTENSION921pg_graphql-1.1.0> CREATE EXTENSION922pg_graphql-1.1.0> COMMENT923pg_graphql-1.1.0> CREATE FUNCTION924pg_graphql-1.1.0> + /nix/store/bc9327c6474vwmqmhkszkmiz86mba73s-postgresql-15.19/lib/pgxs/src/makefiles/../test/regress/pg_regress --use-existing --dbname=contrib_regression --inputdir=test aliases allow_camel_names bigint_is_string comment_directive empty_mutations extend_type_with_function extend_type_with_generated_column filter_by_node_id fragment_on_mutation fragment_on_query inflection_fields inflection_function inflection_relationships inflection_types issue_163 issue_170 issue_225 issue_300 issue_306 json_is_stringified max_page_size max_rows_directive multi_column_primary_key multiple_mutations multiple_queries mutation_delete mutation_delete_variable mutation_insert mutation_update null_argument omit_exotic_types omit_weird_names operation_name override_enum_name override_field_name override_func_field_name override_relationship_field_name override_type_name page_info permissions_connection_column permissions_node_column permissions_table_level permissions_types primary_key_is_required relationship_one_to_one resolve___schema resolve___type resolve___typename resolve_array_type resolve_connection_filter resolve_connection_named resolve_connection_order_by resolve_connection_pagination_args resolve_connection_to_conn resolve_connection_to_node resolve_error_connection_edge_no_field resolve_error_connection_edge_node_no_field resolve_error_connection_no_field resolve_error_from_parser resolve_error_mutation_no_field resolve_error_node_no_field resolve_error_query_no_field resolve_fragment resolve_graphiql_schema resolve_one roundtrip_types row_level_security sqli_connection test_error_anon_and_named_operations test_error_multiple_anon_operations test_error_operation_name_not_found test_error_operation_names_not_unique test_error_parsing test_error_subscription test_query__type total_count views_integration925pg_graphql-1.1.0> (using postmaster on /build/tmp.QcvhqEmJD1, default port)926pg_graphql-1.1.0> ============== running regression test queries        ==============927pg_graphql-1.0.2> test mutation_update              ... ok           47 ms928pg_graphql-1.1.0> test aliases                      ... ok           39 ms929pg_graphql-1.0.2> test null_argument                ... ok           29 ms930pg_graphql-1.1.0> test allow_camel_names            ... ok           36 ms931pg_graphql-1.0.2> test omit_exotic_types            ... ok           31 ms932pg_graphql-1.1.0> test bigint_is_string             ... ok           34 ms933pg_graphql-1.0.2> test omit_weird_names             ... ok           35 ms934pg_graphql-1.1.0> test comment_directive            ... ok           10 ms935pg_graphql-1.1.0> test empty_mutations              ... ok           27 ms936pg_graphql-1.0.2> test operation_name               ... ok           30 ms937pg_graphql-1.0.2> test override_enum_name           ... ok           24 ms938pg_graphql-1.1.0> test extend_type_with_function    ... ok           31 ms939pg_graphql-1.0.2> test override_field_name          ... ok           31 ms940pg_graphql-1.1.0> test extend_type_with_generated_column ... ok           30 ms941pg_graphql-1.0.2> test override_func_field_name     ... ok           30 ms942pg_graphql-1.1.0> test filter_by_node_id            ... ok           31 ms943pg_graphql-1.0.2> test override_relationship_field_name ... ok           33 ms944pg_graphql-1.1.0> test fragment_on_mutation         ... ok           30 ms945pg_graphql-1.0.2> test override_type_name           ... ok           30 ms946pg_graphql-1.1.0> test fragment_on_query            ... ok           28 ms947pg_graphql-1.0.2> test page_info                    ... ok           40 ms948pg_graphql-1.1.0> test inflection_fields            ... ok           48 ms949pg_graphql-1.0.2> test permissions_connection_column ... ok           42 ms950pg_graphql-1.1.0> test inflection_function          ... ok           52 ms951pg_graphql-1.0.2> test permissions_node_column      ... ok           45 ms952pg_graphql-1.1.0> test inflection_relationships     ... ok           78 ms953pg_graphql-1.0.2> test permissions_table_level      ... ok           70 ms954pg_graphql-1.1.0> test inflection_types             ... ok           49 ms955pg_graphql-1.0.2> test permissions_types            ... ok           37 ms956pg_graphql-1.1.0> test issue_163                    ... ok           27 ms957pg_graphql-1.0.2> test primary_key_is_required      ... ok           37 ms958pg_graphql-1.1.0> test issue_170                    ... ok           28 ms959pg_graphql-1.0.2> test relationship_one_to_one      ... ok           35 ms960pg_graphql-1.1.0> test issue_225                    ... ok           32 ms961pg_graphql-1.0.2> test resolve___schema             ... ok           42 ms962pg_graphql-1.1.0> test issue_300                    ... ok           31 ms963pg_graphql-1.0.2> test resolve___type               ... ok           27 ms964pg_graphql-1.1.0> test issue_306                    ... ok           32 ms965pg_graphql-1.0.2> test resolve___typename           ... ok           33 ms966pg_graphql-1.1.0> test json_is_stringified          ... ok           32 ms967pg_graphql-1.0.2> test resolve_array_type           ... ok           33 ms968pg_graphql-1.1.0> test max_page_size                ... ok           28 ms969pg_graphql-1.1.0> test max_rows_directive           ... ok           44 ms970pg_graphql-1.0.2> test resolve_connection_filter    ... ok           52 ms971pg_graphql-1.0.2> test resolve_connection_named     ... ok           28 ms972pg_graphql-1.1.0> test multi_column_primary_key     ... ok           35 ms973pg_graphql-1.1.0> test multiple_mutations           ... ok           32 ms974pg_graphql-1.0.2> test resolve_connection_order_by  ... ok           44 ms975pg_graphql-1.1.0> test multiple_queries             ... ok           27 ms976pg_graphql-1.0.2> test resolve_connection_pagination_args ... ok           52 ms977pg_graphql-1.1.0> test mutation_delete              ... ok           37 ms978pg_graphql-1.1.0> test mutation_delete_variable     ... ok           29 ms979pg_graphql-1.0.2> test resolve_connection_to_conn   ... ok           35 ms980pg_graphql-1.0.2> test resolve_connection_to_node   ... ok           33 ms981pg_graphql-1.1.0> test mutation_insert              ... ok           39 ms982pg_graphql-1.0.2> test resolve_error_connection_edge_no_field ... ok           25 ms983pg_graphql-1.1.0> test mutation_update              ... ok           40 ms984pg_graphql-1.0.2> test resolve_error_connection_edge_node_no_field ... ok           26 ms985pg_graphql-1.1.0> test null_argument                ... ok           26 ms986pg_graphql-1.0.2> test resolve_error_connection_no_field ... ok           25 ms987pg_graphql-1.0.2> test resolve_error_from_parser    ... ok           10 ms988pg_graphql-1.1.0> test omit_exotic_types            ... ok           29 ms989pg_graphql-1.0.2> test resolve_error_mutation_no_field ... ok           21 ms990pg_graphql-1.1.0> test omit_weird_names             ... ok           37 ms991pg_graphql-1.0.2> test resolve_error_node_no_field  ... ok           30 ms992pg_graphql-1.1.0> test operation_name               ... ok           32 ms993pg_graphql-1.0.2> test resolve_error_query_no_field ... ok           34 ms994pg_graphql-1.1.0> test override_enum_name           ... ok           23 ms995pg_graphql-1.0.2> test resolve_fragment             ... ok           29 ms996pg_graphql-1.1.0> test override_field_name          ... ok           28 ms997pg_graphql-1.1.0> test override_func_field_name     ... ok           31 ms998pg_graphql-1.1.0> test override_relationship_field_name ... ok           31 ms999pg_graphql-1.0.2> test resolve_graphiql_schema      ... ok           78 ms1000pg_graphql-1.1.0> test override_type_name           ... ok           26 ms1001pg_graphql-1.0.2> test resolve_one                  ... ok           54 ms1002pg_graphql-1.1.0> test page_info                    ... ok           33 ms1003pg_graphql-1.0.2> test roundtrip_types              ... ok           39 ms1004pg_graphql-1.1.0> test permissions_connection_column ... ok           37 ms1005pg_graphql-1.0.2> test row_level_security           ... ok           31 ms1006pg_graphql-1.1.0> test permissions_node_column      ... ok           40 ms1007pg_graphql-1.0.2> test sqli_connection              ... ok           34 ms1008pg_graphql-1.0.2> test test_error_anon_and_named_operations ... ok           21 ms1009pg_graphql-1.1.0> test permissions_table_level      ... ok           59 ms1010pg_graphql-1.0.2> test test_error_multiple_anon_operations ... ok           20 ms1011pg_graphql-1.0.2> test test_error_operation_name_not_found ... ok           20 ms1012pg_graphql-1.1.0> test permissions_types            ... ok           34 ms1013pg_graphql-1.0.2> test test_error_operation_names_not_unique ... ok           21 ms1014pg_graphql-1.0.2> test test_error_parsing           ... ok           10 ms1015pg_graphql-1.1.0> test primary_key_is_required      ... ok           35 ms1016pg_graphql-1.0.2> test test_error_subscription      ... ok           20 ms1017pg_graphql-1.1.0> test relationship_one_to_one      ... ok           31 ms1018pg_graphql-1.0.2> test test_query__type             ... ok           21 ms1019pg_graphql-1.1.0> test resolve___schema             ... ok           38 ms1020pg_graphql-1.0.2> test total_count                  ... ok           38 ms1021pg_graphql-1.0.2> 1022pg_graphql-1.0.2> ======================1023pg_graphql-1.0.2>  All 73 tests passed. 1024pg_graphql-1.0.2> ======================1025pg_graphql-1.0.2> 1026pg_graphql-1.0.2> + pg_ctl stop -m i1027pg_graphql-1.0.2> waiting for server to shut down....2026-10-27 12:23:58.606 UTC [3607] LOG:  received immediate shutdown request1028pg_graphql-1.0.2> 2026-10-27 12:23:58.613 UTC [3607] LOG:  database system is shut down1029pg_graphql-1.1.0> test resolve___type               ... ok           29 ms1030pg_graphql-1.1.0> test resolve___typename           ... ok           39 ms1031pg_graphql-1.0.2>  done1032pg_graphql-1.0.2> server stopped1033pg_graphql-1.1.0> test resolve_array_type           ... ok           38 ms1034pg_graphql-1.0.2> Running phase: installPhase1035pg_graphql-1.0.2> Executing buildPgrxExtension install1036pg_graphql-1.0.2> Running phase: fixupPhase1037pg_graphql-1.0.2> shrinking RPATHs of ELF executables and libraries in /nix/store/h16zsk3fi7wvqvzs8r8510klirhfcsz0-pg_graphql-1.0.21038pg_graphql-1.1.0> test resolve_connection_filter    ... ok           51 ms1039pg_graphql-1.0.2> shrinking /nix/store/h16zsk3fi7wvqvzs8r8510klirhfcsz0-pg_graphql-1.0.2/lib/pg_graphql-1.0.2.so1040pg_graphql-1.0.2> checking for references to /build/ in /nix/store/h16zsk3fi7wvqvzs8r8510klirhfcsz0-pg_graphql-1.0.2...1041pg_graphql-1.0.2> patching script interpreter paths in /nix/store/h16zsk3fi7wvqvzs8r8510klirhfcsz0-pg_graphql-1.0.21042pg_graphql-1.1.0> test resolve_connection_named     ... ok           26 ms1043pg_graphql-1.0.2> stripping (with command strip and flags -S -p) in  /nix/store/h16zsk3fi7wvqvzs8r8510klirhfcsz0-pg_graphql-1.0.2/lib1044pg_graphql-1.1.0> test resolve_connection_order_by  ... ok           41 ms1045pg_graphql-1.1.0> test resolve_connection_pagination_args ... ok           45 ms1046pg_graphql-1.1.0> test resolve_connection_to_conn   ... ok           34 ms1047pg_graphql-1.1.0> test resolve_connection_to_node   ... ok           32 ms1048pg_graphql-1.1.0> test resolve_error_connection_edge_no_field ... ok           26 ms1049pg_graphql-1.1.0> test resolve_error_connection_edge_node_no_field ... ok           25 ms1050pg_graphql-1.1.0> test resolve_error_connection_no_field ... ok           24 ms1051pg_graphql-1.1.0> test resolve_error_from_parser    ... ok            9 ms1052pg_graphql-1.1.0> test resolve_error_mutation_no_field ... ok           20 ms1053pg_graphql-1.1.0> test resolve_error_node_no_field  ... ok           26 ms1054pg_graphql-1.1.0> test resolve_error_query_no_field ... ok           23 ms1055pg_graphql-1.1.0> test resolve_fragment             ... ok           28 ms1056pg_graphql-1.1.0> test resolve_graphiql_schema      ... ok           67 ms1057pg_graphql-1.1.0> test resolve_one                  ... ok           45 ms1058pg_graphql-1.1.0> test roundtrip_types              ... ok           40 ms1059pg_graphql-1.1.0> test row_level_security           ... ok           38 ms1060pg_graphql-1.1.0> test sqli_connection              ... ok           40 ms1061pg_graphql-1.1.0> test test_error_anon_and_named_operations ... ok           20 ms1062pg_graphql-1.1.0> test test_error_multiple_anon_operations ... ok           20 ms1063pg_graphql-1.1.0> test test_error_operation_name_not_found ... ok           20 ms1064pg_graphql-1.1.0> test test_error_operation_names_not_unique ... ok           20 ms1065pg_graphql-1.1.0> test test_error_parsing           ... ok           10 ms1066pg_graphql-1.1.0> test test_error_subscription      ... ok           20 ms1067pg_graphql-1.1.0> test test_query__type             ... ok           20 ms1068pg_graphql-1.1.0> test total_count                  ... ok           36 ms1069pg_graphql-1.1.0> test views_integration            ... ok           72 ms1070pg_graphql-1.1.0> 1071pg_graphql-1.1.0> ======================1072pg_graphql-1.1.0>  All 77 tests passed. 1073pg_graphql-1.1.0> ======================1074pg_graphql-1.1.0> 1075pg_graphql-1.1.0> + pg_ctl stop -m i1076pg_graphql-1.1.0> waiting for server to shut down....2026-10-27 12:23:59.697 UTC [3607] LOG:  received immediate shutdown request1077pg_graphql-1.1.0> 2026-10-27 12:23:59.706 UTC [3607] LOG:  database system is shut down1078pg_graphql-1.1.0>  done1079pg_graphql-1.1.0> server stopped1080pg_graphql-1.1.0> Running phase: installPhase1081pg_graphql-1.1.0> Executing buildPgrxExtension install1082pg_graphql-1.1.0> Running phase: fixupPhase1083pg_graphql-1.1.0> shrinking RPATHs of ELF executables and libraries in /nix/store/9l1j85mzys4q5grfp6nq3wfabc7byx42-pg_graphql-1.1.01084pg_graphql-1.1.0> shrinking /nix/store/9l1j85mzys4q5grfp6nq3wfabc7byx42-pg_graphql-1.1.0/lib/pg_graphql-1.1.0.so1085pg_graphql-1.1.0> checking for references to /build/ in /nix/store/9l1j85mzys4q5grfp6nq3wfabc7byx42-pg_graphql-1.1.0...1086pg_graphql-1.1.0> patching script interpreter paths in /nix/store/9l1j85mzys4q5grfp6nq3wfabc7byx42-pg_graphql-1.1.01087pg_graphql-1.1.0> stripping (with command strip and flags -S -p) in  /nix/store/9l1j85mzys4q5grfp6nq3wfabc7byx42-pg_graphql-1.1.0/lib1088building '/nix/store/fhmf2803z73lv6ryzq1427gyk0098k16-pg_graphql-1.2.0.drv' on 'ssh-ng://nixbot-remote-build@78.232.36.247'1089building '/nix/store/fhmf2803z73lv6ryzq1427gyk0098k16-pg_graphql-1.2.0.drv'1090pg_graphql-1.2.0> Running phase: unpackPhase1091pg_graphql-1.2.0> unpacking source archive /nix/store/5mypgqbjhpjpz292kan8lqzcvb7w229j-source1092pg_graphql-1.2.0> source root is source1093pg_graphql-1.2.0> Executing cargoSetupPostUnpackHook1094pg_graphql-1.2.0> Finished cargoSetupPostUnpackHook1095pg_graphql-1.2.0> Running phase: patchPhase1096pg_graphql-1.2.0> applying patch /nix/store/wrz2znm0fwyrkpcwb6qri8yj1l0f8zy2-0001-Add-missing-Cargo.lock-1.2.0.patch1097pg_graphql-1.2.0> patching file .gitignore1098pg_graphql-1.2.0> patching file Cargo.lock1099pg_graphql-1.2.0> Executing cargoSetupPostPatchHook1100pg_graphql-1.2.0> Validating consistency between /build/source/Cargo.lock and /build/cargo-vendor-dir/Cargo.lock1101pg_graphql-1.2.0> Finished cargoSetupPostPatchHook1102pg_graphql-1.2.0> Running phase: updateAutotoolsGnuConfigScriptsPhase1103pg_graphql-1.2.0> Running phase: configurePhase1104pg_graphql-1.2.0> Running phase: buildPhase1105pg_graphql-1.2.0> Executing cargo-pgrx buildPhase1106pg_graphql-1.2.0>    Validating /nix/store/bc9327c6474vwmqmhkszkmiz86mba73s-postgresql-15.19/bin/pg_config1107pg_graphql-1.2.0>  Initializing data directory at /build/tmp.nlgN9h20wH/data-151108pg_graphql-1.2.0> waiting for server to start....2026-10-27 12:24:17.632 GMT [90] LOG:  starting PostgreSQL 15.19 on aarch64-unknown-linux-gnu, compiled by gcc (GCC) 15.3.0, 64-bit1109pg_graphql-1.2.0> 2026-10-27 12:24:17.634 GMT [90] LOG:  listening on Unix socket "/build/tmp.u2Mjbi8UJ0/.s.PGSQL.5432"1110pg_graphql-1.2.0> 2026-10-27 12:24:17.641 GMT [93] LOG:  database system was shut down at 2026-10-27 12:24:17 GMT1111pg_graphql-1.2.0> 2026-10-27 12:24:17.646 GMT [90] LOG:  database system is ready to accept connections1112pg_graphql-1.2.0>  done1113pg_graphql-1.2.0> server started1114pg_graphql-1.2.0> createuser: error: connection to server at "localhost" (127.0.0.1), port 5432 failed: Connection refused1115pg_graphql-1.2.0> 	Is the server running on that host and accepting TCP/IP connections?1116pg_graphql-1.2.0> waiting for server to shut down....2026-10-27 12:24:17.718 GMT [90] LOG:  received fast shutdown request1117pg_graphql-1.2.0> 2026-10-27 12:24:17.723 GMT [90] LOG:  aborting any active transactions1118pg_graphql-1.2.0> 2026-10-27 12:24:17.725 GMT [90] LOG:  background worker "logical replication launcher" (PID 96) exited with exit code 11119pg_graphql-1.2.0> 2026-10-27 12:24:17.725 GMT [91] LOG:  shutting down1120pg_graphql-1.2.0> 2026-10-27 12:24:17.731 GMT [91] LOG:  checkpoint starting: shutdown immediate1121pg_graphql-1.2.0> 2026-10-27 12:24:17.787 GMT [91] LOG:  checkpoint complete: wrote 3 buffers (0.0%); 0 WAL file(s) added, 0 removed, 0 recycled; write=0.005 s, sync=0.025 s, total=0.062 s; sync files=2, longest=0.024 s, average=0.013 s; distance=0 kB, estimate=0 kB1122pg_graphql-1.2.0> 2026-10-27 12:24:17.793 GMT [90] LOG:  database system is shut down1123pg_graphql-1.2.0>  done1124pg_graphql-1.2.0> server stopped1125pg_graphql-1.2.0> warning: `/build/source/.cargo/config` is deprecated in favor of `config.toml`1126pg_graphql-1.2.0> note: if you need to support cargo 1.38 or earlier, you can symlink `config` to `config.toml`1127pg_graphql-1.2.0>        Using PgConfig("pg15") and `pg_config` from /nix/store/bc9327c6474vwmqmhkszkmiz86mba73s-postgresql-15.19/bin/pg_config1128pg_graphql-1.2.0>     Building extension with features  pg151129pg_graphql-1.2.0>      Running command "cargo" "build" "--release" "--features" " pg15" "--no-default-features" "--message-format=json-render-diagnostics" "--frozen" "-j" "2"1130pg_graphql-1.2.0> warning: `/build/source/.cargo/config` is deprecated in favor of `config.toml`1131pg_graphql-1.2.0> note: if you need to support cargo 1.38 or earlier, you can symlink `config` to `config.toml`1132pg_graphql-1.2.0>    Compiling proc-macro2 v1.0.951133pg_graphql-1.2.0>    Compiling quote v1.0.281134pg_graphql-1.2.0>    Compiling unicode-ident v1.0.61135pg_graphql-1.2.0>    Compiling syn v1.0.1091136pg_graphql-1.2.0>    Compiling autocfg v1.1.01137building '/nix/store/p0gbqi8bspd8xh2gk8dvfjphn624pyh3-pg_graphql-1.2.2.drv' on 'ssh-ng://nixbot-remote-build@78.232.36.247'1138pg_graphql-1.2.0>    Compiling syn v2.0.431139building '/nix/store/p0gbqi8bspd8xh2gk8dvfjphn624pyh3-pg_graphql-1.2.2.drv'1140pg_graphql-1.2.2> Running phase: unpackPhase1141pg_graphql-1.2.2> unpacking source archive /nix/store/1kbnsadm9z86dc1fxcfgd1bpzf3r816n-source1142pg_graphql-1.2.2> source root is source1143pg_graphql-1.2.2> Executing cargoSetupPostUnpackHook1144pg_graphql-1.2.2> Finished cargoSetupPostUnpackHook1145pg_graphql-1.2.2> Running phase: patchPhase1146pg_graphql-1.2.2> Executing cargoSetupPostPatchHook1147pg_graphql-1.2.2> Validating consistency between /build/source/Cargo.lock and /build/cargo-vendor-dir/Cargo.lock1148pg_graphql-1.2.2> Finished cargoSetupPostPatchHook1149pg_graphql-1.2.2> Running phase: updateAutotoolsGnuConfigScriptsPhase1150pg_graphql-1.2.2> Running phase: configurePhase1151pg_graphql-1.2.2> Running phase: buildPhase1152pg_graphql-1.2.2> Executing cargo-pgrx buildPhase1153pg_graphql-1.2.2>    Validating /nix/store/bc9327c6474vwmqmhkszkmiz86mba73s-postgresql-15.19/bin/pg_config1154pg_graphql-1.2.2>  Initializing data directory at /build/tmp.b9Js8xTXMt/data-151155pg_graphql-1.2.2> waiting for server to start....2026-10-27 12:24:23.976 GMT [88] LOG:  starting PostgreSQL 15.19 on aarch64-unknown-linux-gnu, compiled by gcc (GCC) 15.3.0, 64-bit1156pg_graphql-1.2.2> 2026-10-27 12:24:23.978 GMT [88] LOG:  listening on Unix socket "/build/tmp.N9o34Qlo2m/.s.PGSQL.5432"1157pg_graphql-1.2.2> 2026-10-27 12:24:23.985 GMT [91] LOG:  database system was shut down at 2026-10-27 12:24:23 GMT1158pg_graphql-1.2.2> 2026-10-27 12:24:23.991 GMT [88] LOG:  database system is ready to accept connections1159pg_graphql-1.2.2>  done1160pg_graphql-1.2.2> server started1161pg_graphql-1.2.2> createuser: error: connection to server at "localhost" (127.0.0.1), port 5432 failed: Connection refused1162pg_graphql-1.2.2> 	Is the server running on that host and accepting TCP/IP connections?1163pg_graphql-1.2.2> waiting for server to shut down....2026-10-27 12:24:24.058 GMT [88] LOG:  received fast shutdown request1164pg_graphql-1.2.2> 2026-10-27 12:24:24.061 GMT [88] LOG:  aborting any active transactions1165pg_graphql-1.2.2> 2026-10-27 12:24:24.063 GMT [88] LOG:  background worker "logical replication launcher" (PID 94) exited with exit code 11166pg_graphql-1.2.2> 2026-10-27 12:24:24.064 GMT [89] LOG:  shutting down1167pg_graphql-1.2.2> 2026-10-27 12:24:24.066 GMT [89] LOG:  checkpoint starting: shutdown immediate1168pg_graphql-1.2.2> 2026-10-27 12:24:24.087 GMT [89] LOG:  checkpoint complete: wrote 3 buffers (0.0%); 0 WAL file(s) added, 0 removed, 0 recycled; write=0.012 s, sync=0.002 s, total=0.024 s; sync files=2, longest=0.001 s, average=0.001 s; distance=0 kB, estimate=0 kB1169pg_graphql-1.2.2> 2026-10-27 12:24:24.093 GMT [88] LOG:  database system is shut down1170pg_graphql-1.2.2>  done1171pg_graphql-1.2.2> server stopped1172pg_graphql-1.2.2>        Using PgConfig("pg15") and `pg_config` from /nix/store/bc9327c6474vwmqmhkszkmiz86mba73s-postgresql-15.19/bin/pg_config1173pg_graphql-1.2.2>     Building extension with features  pg151174pg_graphql-1.2.2>      Running command "/nix/store/y779g007dd48i3q1la2xk16y4fa85c1x-rust-default-1.70.0/bin/cargo" "build" "--release" "--features" " pg15" "--no-default-features" "--message-format=json-render-diagnostics" "--frozen" "-j" "2"1175pg_graphql-1.2.2>    Compiling proc-macro2 v1.0.601176pg_graphql-1.2.2>    Compiling quote v1.0.281177pg_graphql-1.2.2>    Compiling unicode-ident v1.0.61178building '/nix/store/2d97540fv1lpdpivdzphhy8am2dyr8r4-pg_graphql-1.2.3.drv' on 'ssh-ng://nixbot-remote-build@78.232.36.247'1179pg_graphql-1.2.2>    Compiling syn v1.0.1091180pg_graphql-1.2.2>    Compiling autocfg v1.1.01181building '/nix/store/2d97540fv1lpdpivdzphhy8am2dyr8r4-pg_graphql-1.2.3.drv'1182pg_graphql-1.2.3> Running phase: unpackPhase1183pg_graphql-1.2.3> unpacking source archive /nix/store/9k236rayr00a1y04snahwigbn8lbh0yg-source1184pg_graphql-1.2.3> source root is source1185pg_graphql-1.2.3> Executing cargoSetupPostUnpackHook1186pg_graphql-1.2.2>    Compiling libc v0.2.1461187pg_graphql-1.2.2>    Compiling syn v2.0.161188pg_graphql-1.2.3> Finished cargoSetupPostUnpackHook1189pg_graphql-1.2.3> Running phase: patchPhase1190pg_graphql-1.2.3> Executing cargoSetupPostPatchHook1191pg_graphql-1.2.3> Validating consistency between /build/source/Cargo.lock and /build/cargo-vendor-dir/Cargo.lock1192pg_graphql-1.2.3> Finished cargoSetupPostPatchHook1193pg_graphql-1.2.3> Running phase: updateAutotoolsGnuConfigScriptsPhase1194pg_graphql-1.2.3> Running phase: configurePhase1195pg_graphql-1.2.3> Running phase: buildPhase1196pg_graphql-1.2.3> Executing cargo-pgrx buildPhase1197pg_graphql-1.2.3>    Validating /nix/store/bc9327c6474vwmqmhkszkmiz86mba73s-postgresql-15.19/bin/pg_config1198pg_graphql-1.2.3>  Initializing data directory at /build/tmp.8lJdaAp0WW/data-151199pg_graphql-1.2.3> waiting for server to start....2026-10-27 12:24:30.160 GMT [88] LOG:  starting PostgreSQL 15.19 on aarch64-unknown-linux-gnu, compiled by gcc (GCC) 15.3.0, 64-bit1200pg_graphql-1.2.3> 2026-10-27 12:24:30.162 GMT [88] LOG:  listening on Unix socket "/build/tmp.4EgGUPbc7x/.s.PGSQL.5432"1201pg_graphql-1.2.3> 2026-10-27 12:24:30.169 GMT [91] LOG:  database system was shut down at 2026-10-27 12:24:29 GMT1202pg_graphql-1.2.3> 2026-10-27 12:24:30.176 GMT [88] LOG:  database system is ready to accept connections1203pg_graphql-1.2.3>  done1204pg_graphql-1.2.3> server started1205pg_graphql-1.2.3> createuser: error: connection to server at "localhost" (127.0.0.1), port 5432 failed: Connection refused1206pg_graphql-1.2.3> 	Is the server running on that host and accepting TCP/IP connections?1207pg_graphql-1.2.3> waiting for server to shut down....2026-10-27 12:24:30.242 GMT [88] LOG:  received fast shutdown request1208pg_graphql-1.2.3> 2026-10-27 12:24:30.245 GMT [88] LOG:  aborting any active transactions1209pg_graphql-1.2.3> 2026-10-27 12:24:30.247 GMT [88] LOG:  background worker "logical replication launcher" (PID 94) exited with exit code 11210pg_graphql-1.2.3> 2026-10-27 12:24:30.248 GMT [89] LOG:  shutting down1211pg_graphql-1.2.3> 2026-10-27 12:24:30.250 GMT [89] LOG:  checkpoint starting: shutdown immediate1212pg_graphql-1.2.3> 2026-10-27 12:24:30.262 GMT [89] LOG:  checkpoint complete: wrote 3 buffers (0.0%); 0 WAL file(s) added, 0 removed, 0 recycled; write=0.004 s, sync=0.002 s, total=0.014 s; sync files=2, longest=0.001 s, average=0.001 s; distance=0 kB, estimate=0 kB1213pg_graphql-1.2.3> 2026-10-27 12:24:30.268 GMT [88] LOG:  database system is shut down1214pg_graphql-1.2.3>  done1215pg_graphql-1.2.3> server stopped1216pg_graphql-1.2.3>        Using PgConfig("pg15") and `pg_config` from /nix/store/bc9327c6474vwmqmhkszkmiz86mba73s-postgresql-15.19/bin/pg_config1217pg_graphql-1.2.3>     Building extension with features  pg151218pg_graphql-1.2.3>      Running command "/nix/store/y779g007dd48i3q1la2xk16y4fa85c1x-rust-default-1.70.0/bin/cargo" "build" "--release" "--features" " pg15" "--no-default-features" "--message-format=json-render-diagnostics" "--frozen" "-j" "2"1219pg_graphql-1.2.3>    Compiling proc-macro2 v1.0.641220pg_graphql-1.2.3>    Compiling quote v1.0.291221pg_graphql-1.2.3>    Compiling unicode-ident v1.0.101222building '/nix/store/mp5hrhajad9d1lrli35zybq5klawxb48-pg_graphql-1.4.1.drv' on 'ssh-ng://nixbot-remote-build@78.232.36.247'1223pg_graphql-1.2.0>    Compiling libc v0.2.1461224pg_graphql-1.2.3>    Compiling autocfg v1.1.01225pg_graphql-1.2.0>    Compiling memchr v2.5.01226pg_graphql-1.2.0>    Compiling log v0.4.171227building '/nix/store/mp5hrhajad9d1lrli35zybq5klawxb48-pg_graphql-1.4.1.drv'1228pg_graphql-1.4.1> Running phase: unpackPhase1229pg_graphql-1.4.1> unpacking source archive /nix/store/0w3m7cz44smb5m9znhghpd9sby64a34f-source1230pg_graphql-1.2.0>    Compiling cfg-if v1.0.01231pg_graphql-1.4.1> source root is source1232pg_graphql-1.4.1> Executing cargoSetupPostUnpackHook1233pg_graphql-1.2.0>    Compiling thiserror v1.0.381234pg_graphql-1.2.3>    Compiling syn v2.0.251235pg_graphql-1.2.3>    Compiling libc v0.2.1471236pg_graphql-1.2.0>    Compiling once_cell v1.18.01237pg_graphql-1.2.0>    Compiling thiserror-impl v1.0.381238pg_graphql-1.4.1> Finished cargoSetupPostUnpackHook1239pg_graphql-1.4.1> Running phase: patchPhase1240pg_graphql-1.4.1> Executing cargoSetupPostPatchHook1241pg_graphql-1.4.1> Validating consistency between /build/source/Cargo.lock and /build/cargo-vendor-dir/Cargo.lock1242pg_graphql-1.4.1> Finished cargoSetupPostPatchHook1243pg_graphql-1.4.1> Running phase: updateAutotoolsGnuConfigScriptsPhase1244pg_graphql-1.4.1> Running phase: configurePhase1245pg_graphql-1.4.1> Running phase: buildPhase1246pg_graphql-1.4.1> Executing cargo-pgrx buildPhase1247pg_graphql-1.4.1>    Validating /nix/store/bc9327c6474vwmqmhkszkmiz86mba73s-postgresql-15.19/bin/pg_config1248pg_graphql-1.4.1>  Initializing data directory at /build/tmp.B6ZXEclojq/data-151249pg_graphql-1.2.0>    Compiling eyre v0.6.81250pg_graphql-1.2.3>    Compiling syn v1.0.1091251pg_graphql-1.2.0>    Compiling tracing-attributes v0.1.301252pg_graphql-1.2.3>    Compiling thiserror v1.0.431253pg_graphql-1.4.1> waiting for server to start....2026-10-27 12:24:34.491 GMT [87] LOG:  starting PostgreSQL 15.19 on aarch64-unknown-linux-gnu, compiled by gcc (GCC) 15.3.0, 64-bit1254pg_graphql-1.4.1> 2026-10-27 12:24:34.494 GMT [87] LOG:  listening on Unix socket "/build/tmp.exuQxTWhmH/.s.PGSQL.5432"1255pg_graphql-1.4.1> 2026-10-27 12:24:34.535 GMT [90] LOG:  database system was shut down at 2026-10-27 12:24:34 GMT1256pg_graphql-1.4.1> 2026-10-27 12:24:34.541 GMT [87] LOG:  database system is ready to accept connections1257pg_graphql-1.4.1>  done1258pg_graphql-1.4.1> server started1259pg_graphql-1.4.1> createuser: error: connection to server at "localhost" (127.0.0.1), port 5432 failed: Connection refused1260pg_graphql-1.4.1> 	Is the server running on that host and accepting TCP/IP connections?1261pg_graphql-1.4.1> waiting for server to shut down....2026-10-27 12:24:34.575 GMT [87] LOG:  received fast shutdown request1262pg_graphql-1.4.1> 2026-10-27 12:24:34.579 GMT [87] LOG:  aborting any active transactions1263pg_graphql-1.4.1> 2026-10-27 12:24:34.581 GMT [87] LOG:  background worker "logical replication launcher" (PID 93) exited with exit code 11264pg_graphql-1.4.1> 2026-10-27 12:24:34.586 GMT [88] LOG:  shutting down1265pg_graphql-1.4.1> 2026-10-27 12:24:34.588 GMT [88] LOG:  checkpoint starting: shutdown immediate1266pg_graphql-1.4.1> 2026-10-27 12:24:34.606 GMT [88] LOG:  checkpoint complete: wrote 3 buffers (0.0%); 0 WAL file(s) added, 0 removed, 0 recycled; write=0.006 s, sync=0.002 s, total=0.020 s; sync files=2, longest=0.001 s, average=0.001 s; distance=0 kB, estimate=0 kB1267pg_graphql-1.4.1> 2026-10-27 12:24:34.613 GMT [87] LOG:  database system is shut down1268pg_graphql-1.4.1>  done1269pg_graphql-1.4.1> server stopped1270pg_graphql-1.2.3>    Compiling serde v1.0.1711271pg_graphql-1.4.1>        Using PgConfig("pg15") and `pg_config` from /nix/store/bc9327c6474vwmqmhkszkmiz86mba73s-postgresql-15.19/bin/pg_config1272pg_graphql-1.4.1>     Building extension with features  pg151273pg_graphql-1.4.1>      Running command "/nix/store/y779g007dd48i3q1la2xk16y4fa85c1x-rust-default-1.70.0/bin/cargo" "build" "--release" "--features" " pg15" "--no-default-features" "--message-format=json-render-diagnostics" "--frozen" "-j" "2"1274pg_graphql-1.4.1>    Compiling proc-macro2 v1.0.671275pg_graphql-1.4.1>    Compiling unicode-ident v1.0.101276pg_graphql-1.4.1>    Compiling libc v0.2.1481277pg_graphql-1.2.3>    Compiling eyre v0.6.81278pg_graphql-1.2.0>    Compiling serde_derive v1.0.1931279pg_graphql-1.4.1>    Compiling syn v1.0.1091280pg_graphql-1.4.1>    Compiling autocfg v1.1.01281pg_graphql-1.2.0>    Compiling indexmap v1.9.21282pg_graphql-1.4.1>    Compiling quote v1.0.331283pg_graphql-1.2.0>    Compiling pin-project-lite v0.2.91284pg_graphql-1.4.1>    Compiling syn v2.0.251285pg_graphql-1.4.1>    Compiling thiserror v1.0.431286pg_graphql-1.4.1>    Compiling serde v1.0.1711287pg_graphql-1.4.1>    Compiling hashbrown v0.14.01288pg_graphql-1.2.0>    Compiling aho-corasick v1.0.11289pg_graphql-1.4.1>    Compiling eyre v0.6.81290pg_graphql-1.4.1>    Compiling equivalent v1.0.01291pg_graphql-1.4.1>    Compiling indexmap v2.0.01292pg_graphql-1.2.2>    Compiling indexmap v1.9.21293pg_graphql-1.2.2>    Compiling serde_derive v1.0.1631294pg_graphql-1.2.0>    Compiling regex-syntax v0.7.21295pg_graphql-1.2.0>    Compiling lazy_static v1.4.01296pg_graphql-1.2.2>    Compiling thiserror v1.0.381297pg_graphql-1.2.0>    Compiling serde v1.0.1931298pg_graphql-1.2.2>    Compiling serde v1.0.1631299pg_graphql-1.2.0>    Compiling serde_json v1.0.961300pg_graphql-1.2.0>    Compiling tinyvec_macros v0.1.01301pg_graphql-1.2.0>    Compiling glob v0.3.11302pg_graphql-1.2.2>    Compiling thiserror-impl v1.0.381303pg_graphql-1.2.0>    Compiling clang-sys v1.4.01304pg_graphql-1.2.0>    Compiling tinyvec v1.6.01305pg_graphql-1.2.3>    Compiling serde_derive v1.0.1711306pg_graphql-1.2.0>    Compiling regex v1.8.41307pg_graphql-1.2.2>    Compiling eyre v0.6.81308pg_graphql-1.2.0>    Compiling tracing-core v0.1.301309pg_graphql-1.2.2>    Compiling hashbrown v0.12.31310pg_graphql-1.2.0>    Compiling regex-syntax v0.6.291311pg_graphql-1.2.3>    Compiling thiserror-impl v1.0.431312pg_graphql-1.2.0>    Compiling indenter v0.3.31313pg_graphql-1.2.0>    Compiling anyhow v1.0.691314pg_graphql-1.2.0>    Compiling ucd-trie v0.1.51315pg_graphql-1.4.1>    Compiling serde_derive v1.0.1711316pg_graphql-1.2.2>    Compiling memchr v2.5.01317pg_graphql-1.2.0>    Compiling pest v2.5.41318pg_graphql-1.2.2>    Compiling glob v0.3.11319pg_graphql-1.2.0>    Compiling regex-automata v0.1.101320pg_graphql-1.2.3>    Compiling indexmap v1.9.31321pg_graphql-1.2.2>    Compiling serde_json v1.0.961322pg_graphql-1.2.3>    Compiling memchr v2.5.01323pg_graphql-1.2.2>    Compiling tinyvec_macros v0.1.01324pg_graphql-1.2.2>    Compiling tinyvec v1.6.01325pg_graphql-1.2.2>    Compiling clang-sys v1.4.01326pg_graphql-1.2.0>    Compiling unicode-normalization v0.1.221327pg_graphql-1.4.1>    Compiling thiserror-impl v1.0.431328pg_graphql-1.2.2>    Compiling toml_datetime v0.6.21329pg_graphql-1.2.2>    Compiling serde_spanned v0.6.21330pg_graphql-1.2.2>    Compiling winnow v0.4.61331pg_graphql-1.2.2>    Compiling indenter v0.3.31332pg_graphql-1.2.2>    Compiling once_cell v1.18.01333pg_graphql-1.2.2>    Compiling anyhow v1.0.691334pg_graphql-1.2.3>    Compiling equivalent v1.0.01335pg_graphql-1.2.3>    Compiling hashbrown v0.14.01336pg_graphql-1.2.2>    Compiling ucd-trie v0.1.51337pg_graphql-1.2.2>    Compiling prettyplease v0.2.61338pg_graphql-1.2.3>    Compiling glob v0.3.11339pg_graphql-1.2.2>    Compiling pest v2.5.41340pg_graphql-1.2.0>    Compiling overload v0.1.11341pg_graphql-1.2.0>    Compiling minimal-lexical v0.2.11342pg_graphql-1.2.0>    Compiling semver v1.0.161343pg_graphql-1.2.3>    Compiling tinyvec_macros v0.1.11344pg_graphql-1.2.3>    Compiling serde_json v1.0.1001345pg_graphql-1.2.3>    Compiling clang-sys v1.6.11346pg_graphql-1.2.2>    Compiling toml_edit v0.19.91347pg_graphql-1.2.0>    Compiling percent-encoding v2.3.01348pg_graphql-1.2.3>    Compiling tinyvec v1.6.01349pg_graphql-1.2.0>    Compiling unicode-bidi v0.3.101350pg_graphql-1.2.3>    Compiling toml_datetime v0.6.31351pg_graphql-1.2.3>    Compiling serde_spanned v0.6.31352pg_graphql-1.2.3>    Compiling indexmap v2.0.01353pg_graphql-1.4.1>    Compiling glob v0.3.11354pg_graphql-1.2.3>    Compiling anyhow v1.0.711355pg_graphql-1.2.3>    Compiling ucd-trie v0.1.61356pg_graphql-1.2.3>    Compiling indenter v0.3.31357pg_graphql-1.4.1>    Compiling serde_json v1.0.1001358pg_graphql-1.2.3>    Compiling winnow v0.4.91359pg_graphql-1.2.2>    Compiling unicode-normalization v0.1.221360pg_graphql-1.2.3>    Compiling once_cell v1.18.01361pg_graphql-1.4.1>    Compiling tinyvec_macros v0.1.11362pg_graphql-1.4.1>    Compiling memchr v2.6.31363pg_graphql-1.2.2>    Compiling cfg-if v1.0.01364pg_graphql-1.2.2>    Compiling percent-encoding v2.3.01365pg_graphql-1.2.2>    Compiling futures-core v0.3.261366pg_graphql-1.2.3>    Compiling pest v2.7.01367pg_graphql-1.4.1>    Compiling tinyvec v1.6.01368pg_graphql-1.2.2>    Compiling unicode-bidi v0.3.101369pg_graphql-1.4.1>    Compiling serde_spanned v0.6.31370pg_graphql-1.2.0>    Compiling idna v0.4.01371pg_graphql-1.4.1>    Compiling toml_datetime v0.6.31372pg_graphql-1.2.0>    Compiling form_urlencoded v1.2.01373pg_graphql-1.4.1>    Compiling clang-sys v1.6.11374pg_graphql-1.2.0>    Compiling tracing v0.1.371375pg_graphql-1.2.2>    Compiling minimal-lexical v0.2.11376pg_graphql-1.2.3>    Compiling toml_edit v0.19.121377pg_graphql-1.2.0>    Compiling nom v7.1.31378pg_graphql-1.4.1>    Compiling indenter v0.3.31379pg_graphql-1.4.1>    Compiling winnow v0.5.151380pg_graphql-1.4.1>    Compiling anyhow v1.0.711381pg_graphql-1.2.2>    Compiling semver v1.0.161382pg_graphql-1.2.0>    Compiling nu-ansi-term v0.46.01383pg_graphql-1.2.2>    Compiling option-ext v0.2.01384pg_graphql-1.2.2>    Compiling dirs-sys v0.4.11385pg_graphql-1.4.1>    Compiling once_cell v1.18.01386pg_graphql-1.2.0>    Compiling matchers v0.1.01387pg_graphql-1.2.2>    Compiling nom v7.1.31388pg_graphql-1.4.1>    Compiling ucd-trie v0.1.61389pg_graphql-1.2.0>    Compiling tracing-log v0.2.01390pg_graphql-1.2.3>    Compiling unicode-normalization v0.1.221391pg_graphql-1.2.2>    Compiling idna v0.4.01392pg_graphql-1.4.1>    Compiling pest v2.7.01393pg_graphql-1.2.0>    Compiling semver-parser v0.10.21394pg_graphql-1.2.3>    Compiling cfg-if v1.0.01395pg_graphql-1.2.3>    Compiling minimal-lexical v0.2.11396pg_graphql-1.2.2>    Compiling form_urlencoded v1.2.01397pg_graphql-1.2.3>    Compiling unicode-bidi v0.3.131398pg_graphql-1.2.0>    Compiling sharded-slab v0.1.71399pg_graphql-1.2.2>    Compiling libloading v0.7.41400pg_graphql-1.2.2>    Compiling toml v0.7.41401pg_graphql-1.4.1>    Compiling toml_edit v0.20.01402pg_graphql-1.2.0>    Compiling dirs-sys v0.3.71403pg_graphql-1.2.0>    Compiling libloading v0.7.41404pg_graphql-1.2.3>    Compiling regex-syntax v0.7.31405pg_graphql-1.2.0>    Compiling thread_local v1.1.91406pg_graphql-1.2.0>    Compiling smallvec v1.10.01407pg_graphql-1.4.1>    Compiling unicode-normalization v0.1.221408pg_graphql-1.2.2>    Compiling semver-parser v0.10.21409pg_graphql-1.2.0>    Compiling futures-core v0.3.261410pg_graphql-1.2.0>    Compiling ryu v1.0.121411pg_graphql-1.2.2>    Compiling slab v0.4.71412pg_graphql-1.2.0>    Compiling hashbrown v0.12.31413pg_graphql-1.4.1>    Compiling futures-core v0.3.281414pg_graphql-1.2.2>    Compiling itoa v1.0.51415pg_graphql-1.2.2>    Compiling futures-channel v0.3.261416pg_graphql-1.4.1>    Compiling semver v1.0.171417pg_graphql-1.2.2>    Compiling ryu v1.0.121418pg_graphql-1.2.0>    Compiling bindgen v0.60.11419pg_graphql-1.4.1>    Compiling unicode-bidi v0.3.131420pg_graphql-1.2.2>    Compiling regex-syntax v0.7.21421pg_graphql-1.2.3>    Compiling percent-encoding v2.3.01422pg_graphql-1.2.3>    Compiling futures-core v0.3.281423pg_graphql-1.2.0>    Compiling itoa v1.0.51424pg_graphql-1.2.2>    Compiling futures-task v0.3.261425pg_graphql-1.2.3>    Compiling option-ext v0.2.01426pg_graphql-1.2.3>    Compiling semver v1.0.171427pg_graphql-1.4.1>    Compiling minimal-lexical v0.2.11428pg_graphql-1.2.2>    Compiling bindgen v0.65.11429pg_graphql-1.2.3>    Compiling dirs-sys v0.4.11430pg_graphql-1.4.1>    Compiling cfg-if v1.0.01431pg_graphql-1.4.1>    Compiling regex-syntax v0.7.51432pg_graphql-1.2.3>    Compiling form_urlencoded v1.2.01433pg_graphql-1.2.3>    Compiling regex-automata v0.3.21434pg_graphql-1.2.3>    Compiling idna v0.4.01435pg_graphql-1.4.1>    Compiling option-ext v0.2.01436pg_graphql-1.2.2>    Compiling regex v1.8.41437pg_graphql-1.2.3>    Compiling nom v7.1.31438pg_graphql-1.4.1>    Compiling percent-encoding v2.3.01439pg_graphql-1.4.1>    Compiling form_urlencoded v1.2.01440pg_graphql-1.4.1>    Compiling regex-automata v0.3.81441pg_graphql-1.2.2>    Compiling semver v0.11.01442pg_graphql-1.2.2>    Compiling pathsearch v0.2.01443pg_graphql-1.4.1>    Compiling libloading v0.7.41444pg_graphql-1.2.3>    Compiling toml v0.7.61445pg_graphql-1.2.2>    Compiling cexpr v0.6.01446pg_graphql-1.2.3>    Compiling libloading v0.7.41447pg_graphql-1.4.1>    Compiling nom v7.1.31448pg_graphql-1.2.3>    Compiling semver-parser v0.10.21449pg_graphql-1.2.2>    Compiling cargo_toml v0.15.31450pg_graphql-1.2.0>    Compiling tracing-subscriber v0.3.181451pg_graphql-1.2.3>    Compiling slab v0.4.81452pg_graphql-1.2.3>    Compiling bindgen v0.66.11453pg_graphql-1.2.3>    Compiling ryu v1.0.141454pg_graphql-1.2.3>    Compiling futures-task v0.3.281455pg_graphql-1.2.3>    Compiling hashbrown v0.12.31456pg_graphql-1.2.3>    Compiling itoa v1.0.81457pg_graphql-1.2.2>    Compiling url v2.4.01458pg_graphql-1.4.1>    Compiling dirs-sys v0.4.11459pg_graphql-1.4.1>    Compiling idna v0.4.01460pg_graphql-1.2.3>    Compiling futures-channel v0.3.281461pg_graphql-1.4.1>    Compiling toml v0.8.01462pg_graphql-1.2.2>    Compiling dirs v5.0.11463pg_graphql-1.4.1>    Compiling semver-parser v0.10.21464pg_graphql-1.4.1>    Compiling slab v0.4.81465pg_graphql-1.2.2>    Compiling getrandom v0.2.81466pg_graphql-1.4.1>    Compiling bindgen v0.68.11467pg_graphql-1.2.0>    Compiling dirs v4.0.01468pg_graphql-1.2.0>    Compiling cexpr v0.6.01469pg_graphql-1.4.1>    Compiling futures-task v0.3.281470pg_graphql-1.4.1>    Compiling itoa v1.0.81471pg_graphql-1.2.3>    Compiling pathsearch v0.2.01472pg_graphql-1.4.1>    Compiling futures-channel v0.3.281473pg_graphql-1.2.3>    Compiling semver v0.11.01474pg_graphql-1.4.1>    Compiling ryu v1.0.141475pg_graphql-1.2.0>    Compiling semver v0.11.01476pg_graphql-1.2.3>    Compiling cargo_toml v0.15.31477pg_graphql-1.2.2>    Compiling pin-project-lite v0.2.91478pg_graphql-1.2.2>    Compiling strsim v0.10.01479pg_graphql-1.2.0>    Compiling pathsearch v0.2.01480pg_graphql-1.2.0>    Compiling url v2.4.01481pg_graphql-1.2.2>    Compiling fixedbitset v0.4.21482pg_graphql-1.2.2>    Compiling peeking_take_while v0.1.21483pg_graphql-1.2.2>    Compiling rustc-hash v1.1.01484pg_graphql-1.2.2>    Compiling unicode-segmentation v1.10.11485pg_graphql-1.4.1>    Compiling semver v0.11.01486pg_graphql-1.2.3>    Compiling cexpr v0.6.01487pg_graphql-1.2.2>    Compiling lazycell v1.3.01488pg_graphql-1.2.2>    Compiling ident_case v1.0.11489pg_graphql-1.2.2>    Compiling bitflags v1.3.21490pg_graphql-1.2.2>    Compiling shlex v1.1.01491pg_graphql-1.4.1>    Compiling pathsearch v0.2.01492pg_graphql-1.2.2>    Compiling lazy_static v1.4.01493pg_graphql-1.2.2>    Compiling owo-colors v3.5.01494pg_graphql-1.4.1>    Compiling cargo_toml v0.16.21495pg_graphql-1.4.1>    Compiling url v2.4.11496pg_graphql-1.2.2>    Compiling futures-util v0.3.261497pg_graphql-1.2.2>    Compiling byteorder v1.4.31498pg_graphql-1.2.3>    Compiling regex v1.9.11499pg_graphql-1.2.2>    Compiling fnv v1.0.71500pg_graphql-1.2.2>    Compiling futures-sink v0.3.261501pg_graphql-1.2.0>    Compiling toml v0.5.111502pg_graphql-1.2.2>    Compiling darling_core v0.13.41503pg_graphql-1.2.3>    Compiling url v2.4.01504pg_graphql-1.2.2>    Compiling pgrx-pg-config v0.9.51505pg_graphql-1.4.1>    Compiling dirs v5.0.11506pg_graphql-1.2.0>    Compiling getrandom v0.2.81507pg_graphql-1.2.3>    Compiling dirs v5.0.11508pg_graphql-1.2.0>    Compiling slab v0.4.71509pg_graphql-1.2.0>    Compiling fixedbitset v0.4.21510pg_graphql-1.2.0>    Compiling owo-colors v3.5.01511pg_graphql-1.2.0>    Compiling lazycell v1.3.01512pg_graphql-1.2.0>    Compiling seq-macro v0.3.21513pg_graphql-1.2.3>    Compiling getrandom v0.2.101514pg_graphql-1.2.3>    Compiling shlex v1.1.01515pg_graphql-1.2.3>    Compiling lazy_static v1.4.01516pg_graphql-1.2.3>    Compiling fixedbitset v0.4.21517pg_graphql-1.2.0>    Compiling shlex v1.1.01518pg_graphql-1.2.3>    Compiling owo-colors v3.5.01519pg_graphql-1.2.0>    Compiling peeking_take_while v0.1.21520pg_graphql-1.2.0>    Compiling rustc-hash v1.1.01521pg_graphql-1.2.0>    Compiling byteorder v1.4.31522pg_graphql-1.2.0>    Compiling futures-channel v0.3.261523pg_graphql-1.2.0>    Compiling bitflags v1.3.21524pg_graphql-1.2.0>    Compiling futures-task v0.3.261525pg_graphql-1.4.1>    Compiling cexpr v0.6.01526pg_graphql-1.2.2>    Compiling convert_case v0.6.01527pg_graphql-1.2.3>    Compiling futures-util v0.3.281528pg_graphql-1.2.3>    Compiling futures-sink v0.3.281529pg_graphql-1.2.3>    Compiling peeking_take_while v0.1.21530pg_graphql-1.2.3>    Compiling lazycell v1.3.01531pg_graphql-1.2.3>    Compiling ident_case v1.0.11532pg_graphql-1.2.2>    Compiling petgraph v0.6.31533pg_graphql-1.2.3>    Compiling rustc-hash v1.1.01534pg_graphql-1.2.3>    Compiling strsim v0.10.01535pg_graphql-1.4.1>    Compiling regex v1.9.51536pg_graphql-1.2.3>    Compiling byteorder v1.4.31537pg_graphql-1.2.3>    Compiling fnv v1.0.71538pg_graphql-1.2.3>    Compiling pin-project-lite v0.2.101539pg_graphql-1.2.3>    Compiling bitflags v2.3.31540pg_graphql-1.4.1>    Compiling getrandom v0.2.101541pg_graphql-1.2.3>    Compiling unicode-segmentation v1.10.11542pg_graphql-1.4.1>    Compiling strsim v0.10.01543pg_graphql-1.2.3>    Compiling convert_case v0.6.01544pg_graphql-1.2.3>    Compiling darling_core v0.13.41545pg_graphql-1.4.1>    Compiling fixedbitset v0.4.21546pg_graphql-1.4.1>    Compiling rustc-hash v1.1.01547pg_graphql-1.4.1>    Compiling futures-util v0.3.281548pg_graphql-1.4.1>    Compiling owo-colors v3.5.01549pg_graphql-1.2.2>    Compiling rustc_version v0.4.01550pg_graphql-1.2.0>    Compiling pgx-pg-config v0.7.11551pg_graphql-1.2.2>    Compiling rustc_version v0.3.31552pg_graphql-1.4.1>    Compiling pin-project-lite v0.2.101553pg_graphql-1.4.1>    Compiling unicode-segmentation v1.10.11554pg_graphql-1.4.1>    Compiling bitflags v2.4.01555pg_graphql-1.2.0>    Compiling petgraph v0.6.31556pg_graphql-1.4.1>    Compiling fnv v1.0.71557pg_graphql-1.4.1>    Compiling ident_case v1.0.11558pg_graphql-1.4.1>    Compiling futures-sink v0.3.281559pg_graphql-1.4.1>    Compiling lazycell v1.3.01560pg_graphql-1.4.1>    Compiling byteorder v1.4.31561pg_graphql-1.4.1>    Compiling lazy_static v1.4.01562pg_graphql-1.4.1>    Compiling shlex v1.2.01563pg_graphql-1.4.1>    Compiling peeking_take_while v0.1.21564pg_graphql-1.2.3>    Compiling pgrx-pg-config v0.9.71565pg_graphql-1.2.0>    Compiling rustc_version v0.4.01566pg_graphql-1.2.2>    Compiling futures-macro v0.3.261567pg_graphql-1.2.0>    Compiling rustc_version v0.3.31568pg_graphql-1.2.0>    Compiling tracing-error v0.2.11569pg_graphql-1.2.3>    Compiling petgraph v0.6.31570pg_graphql-1.2.0>    Compiling memoffset v0.6.51571pg_graphql-1.2.0>    Compiling ident_case v1.0.11572pg_graphql-1.2.0>    Compiling futures-sink v0.3.261573pg_graphql-1.2.2>    Compiling memoffset v0.9.01574pg_graphql-1.2.0>    Compiling unescape v0.1.01575pg_graphql-1.2.2>    Compiling pin-utils v0.1.01576pg_graphql-1.2.2>    Compiling radium v0.7.01577pg_graphql-1.2.0>    Compiling convert_case v0.5.01578pg_graphql-1.2.2>    Compiling futures-io v0.3.261579pg_graphql-1.2.2>    Compiling unescape v0.1.01580pg_graphql-1.2.0>    Compiling fnv v1.0.71581pg_graphql-1.2.0>    Compiling radium v0.7.01582pg_graphql-1.2.0>    Compiling strsim v0.10.01583pg_graphql-1.2.0>    Compiling futures-util v0.3.261584pg_graphql-1.2.0>    Compiling darling_core v0.13.41585pg_graphql-1.2.2>    Compiling pgrx-sql-entity-graph v0.9.51586pg_graphql-1.2.0>    Compiling pgx-sql-entity-graph v0.7.11587pg_graphql-1.4.1>    Compiling darling_core v0.13.41588pg_graphql-1.2.3>    Compiling rustc_version v0.4.01589pg_graphql-1.2.3>    Compiling rustc_version v0.3.31590pg_graphql-1.2.3>    Compiling futures-macro v0.3.281591pg_graphql-1.2.3>    Compiling memoffset v0.9.01592pg_graphql-1.2.3>    Compiling unescape v0.1.01593pg_graphql-1.2.3>    Compiling radium v0.7.01594pg_graphql-1.4.1>    Compiling convert_case v0.6.01595pg_graphql-1.2.3>    Compiling futures-io v0.3.281596pg_graphql-1.2.3>    Compiling pin-utils v0.1.01597pg_graphql-1.4.1>    Compiling pgrx-pg-config v0.10.21598pg_graphql-1.2.2>    Compiling pgrx-pg-sys v0.9.51599pg_graphql-1.2.0>    Compiling atomic-traits v0.3.01600pg_graphql-1.2.0>    Compiling heapless v0.7.161601pg_graphql-1.4.1>    Compiling petgraph v0.6.41602pg_graphql-1.4.1>    Compiling rustc_version v0.4.01603pg_graphql-1.4.1>    Compiling rustc_version v0.3.31604pg_graphql-1.2.2>    Compiling atomic-traits v0.3.01605pg_graphql-1.4.1>    Compiling futures-macro v0.3.281606pg_graphql-1.2.0>    Compiling pgx-pg-sys v0.7.11607pg_graphql-1.2.2>    Compiling heapless v0.7.161608pg_graphql-1.4.1>    Compiling memoffset v0.9.01609pg_graphql-1.2.2>    Compiling darling_macro v0.13.41610pg_graphql-1.4.1>    Compiling unescape v0.1.01611pg_graphql-1.4.1>    Compiling radium v0.7.01612pg_graphql-1.2.2>    Compiling tokio v1.28.11613pg_graphql-1.2.3>    Compiling pgrx-sql-entity-graph v0.9.71614pg_graphql-1.4.1>    Compiling pin-utils v0.1.01615pg_graphql-1.4.1>    Compiling futures-io v0.3.281616pg_graphql-1.2.2>    Compiling tap v1.0.11617pg_graphql-1.2.2>    Compiling either v1.8.11618pg_graphql-1.2.2>    Compiling async-trait v0.1.641619pg_graphql-1.2.2>    Compiling void v1.0.21620pg_graphql-1.2.2>    Compiling unreachable v1.0.01621pg_graphql-1.2.2>    Compiling wyz v0.5.11622pg_graphql-1.2.2>    Compiling darling v0.13.41623pg_graphql-1.2.0>    Compiling futures-macro v0.3.261624pg_graphql-1.4.1>    Compiling pgrx-sql-entity-graph v0.10.21625pg_graphql-1.2.0>    Compiling tap v1.0.11626pg_graphql-1.2.0>    Compiling pin-utils v0.1.01627pg_graphql-1.2.0>    Compiling futures-io v0.3.261628pg_graphql-1.2.3>    Compiling pgrx-pg-sys v0.9.71629pg_graphql-1.4.1>    Compiling atomic-traits v0.3.01630pg_graphql-1.4.1>    Compiling heapless v0.7.161631pg_graphql-1.4.1>    Compiling pgrx-pg-sys v0.10.21632pg_graphql-1.2.3>    Compiling atomic-traits v0.3.01633pg_graphql-1.2.0>    Compiling wyz v0.5.11634pg_graphql-1.2.3>    Compiling heapless v0.7.161635pg_graphql-1.2.3>    Compiling darling_macro v0.13.41636pg_graphql-1.2.3>    Compiling tokio v1.29.11637pg_graphql-1.2.3>    Compiling async-trait v0.1.711638pg_graphql-1.2.3>    Compiling either v1.8.11639pg_graphql-1.2.3>    Compiling void v1.0.21640pg_graphql-1.2.3>    Compiling tap v1.0.11641pg_graphql-1.2.3>    Compiling wyz v0.5.11642pg_graphql-1.2.3>    Compiling unreachable v1.0.01643pg_graphql-1.4.1>    Compiling darling_macro v0.13.41644pg_graphql-1.4.1>    Compiling tokio v1.29.11645pg_graphql-1.4.1>    Compiling tap v1.0.11646pg_graphql-1.4.1>    Compiling async-trait v0.1.711647pg_graphql-1.4.1>    Compiling either v1.8.11648pg_graphql-1.4.1>    Compiling void v1.0.21649pg_graphql-1.4.1>    Compiling unreachable v1.0.01650pg_graphql-1.4.1>    Compiling wyz v0.5.11651pg_graphql-1.2.2>    Compiling pgrx-macros v0.9.51652pg_graphql-1.2.3>    Compiling darling v0.13.41653pg_graphql-1.2.0>    Compiling pgx-macros v0.7.11654pg_graphql-1.2.2>    Compiling futures-executor v0.3.261655pg_graphql-1.2.2>    Compiling hash32 v0.2.11656pg_graphql-1.2.2>    Compiling rand_core v0.6.41657pg_graphql-1.2.2>    Compiling num_cpus v1.15.01658pg_graphql-1.2.0>    Compiling darling_macro v0.13.41659pg_graphql-1.2.2>    Compiling enum-map-derive v0.11.01660pg_graphql-1.2.0>    Compiling hash32 v0.2.11661pg_graphql-1.2.0>    Compiling tokio v1.28.11662pg_graphql-1.2.0>    Compiling async-trait v0.1.641663pg_graphql-1.2.2>    Compiling tokio-macros v2.1.01664pg_graphql-1.2.0>    Compiling void v1.0.21665pg_graphql-1.2.0>    Compiling sptr v0.3.21666pg_graphql-1.2.0>    Compiling either v1.8.11667pg_graphql-1.2.0>    Compiling half v1.8.21668pg_graphql-1.2.0>    Compiling stable_deref_trait v1.2.01669pg_graphql-1.2.0>    Compiling funty v2.0.01670pg_graphql-1.2.0>    Compiling serde_cbor v0.11.21671pg_graphql-1.2.2>    Compiling cached_proc_macro_types v0.1.01672pg_graphql-1.2.2>    Compiling ppv-lite86 v0.2.171673pg_graphql-1.2.0>    Compiling bitvec v1.0.11674pg_graphql-1.2.2>    Compiling sptr v0.3.21675pg_graphql-1.2.2>    Compiling stable_deref_trait v1.2.01676pg_graphql-1.2.2>    Compiling funty v2.0.01677pg_graphql-1.2.2>    Compiling ascii v0.9.31678pg_graphql-1.2.2>    Compiling half v1.8.21679pg_graphql-1.4.1>    Compiling darling v0.13.41680pg_graphql-1.2.2>    Compiling serde_cbor v0.11.21681pg_graphql-1.2.0>    Compiling unreachable v1.0.01682pg_graphql-1.2.0>    Compiling darling v0.13.41683pg_graphql-1.2.2>    Compiling combine v3.8.11684pg_graphql-1.2.0>    Compiling futures-executor v0.3.261685pg_graphql-1.2.0>    Compiling rand_core v0.6.41686pg_graphql-1.2.0>    Compiling uuid v1.3.31687pg_graphql-1.2.0>    Compiling num_cpus v1.15.01688pg_graphql-1.2.0>    Compiling tokio-macros v2.1.01689pg_graphql-1.2.0>    Compiling cached_proc_macro_types v0.1.01690pg_graphql-1.2.0>    Compiling seahash v4.1.01691pg_graphql-1.2.0>    Compiling ascii v0.9.31692pg_graphql-1.2.2>    Compiling bitvec v1.0.11693pg_graphql-1.2.3>    Compiling pgrx-macros v0.9.71694pg_graphql-1.2.0>    Compiling ppv-lite86 v0.2.171695pg_graphql-1.2.0>    Compiling rand_chacha v0.3.11696pg_graphql-1.2.0>    Compiling combine v3.8.11697pg_graphql-1.2.3>    Compiling futures-executor v0.3.281698pg_graphql-1.4.1>    Compiling pgrx-macros v0.10.21699pg_graphql-1.2.3>    Compiling hash32 v0.2.11700pg_graphql-1.2.3>    Compiling rand_core v0.6.41701pg_graphql-1.2.3>    Compiling aho-corasick v1.0.21702pg_graphql-1.2.3>    Compiling num_cpus v1.16.01703pg_graphql-1.2.2>    Compiling rand_chacha v0.3.11704pg_graphql-1.2.3>    Compiling tokio-macros v2.1.01705pg_graphql-1.4.1>    Compiling futures-executor v0.3.281706pg_graphql-1.2.2>    Compiling cached_proc_macro v0.12.01707pg_graphql-1.2.3>    Compiling enum-map-derive v0.12.01708pg_graphql-1.4.1>    Compiling hash32 v0.2.11709pg_graphql-1.4.1>    Compiling rand_core v0.6.41710pg_graphql-1.4.1>    Compiling aho-corasick v1.0.21711pg_graphql-1.2.3>    Compiling funty v2.0.01712pg_graphql-1.2.0>    Compiling cached_proc_macro v0.12.01713pg_graphql-1.2.3>    Compiling ascii v0.9.31714pg_graphql-1.2.3>    Compiling stable_deref_trait v1.2.01715pg_graphql-1.2.3>    Compiling ppv-lite86 v0.2.171716pg_graphql-1.2.3>    Compiling sptr v0.3.21717pg_graphql-1.2.3>    Compiling cached_proc_macro_types v0.1.01718pg_graphql-1.2.3>    Compiling half v1.8.21719pg_graphql-1.4.1>    Compiling num_cpus v1.16.01720pg_graphql-1.4.1>    Compiling enum-map-derive v0.14.01721pg_graphql-1.4.1>    Compiling tokio-macros v2.1.01722pg_graphql-1.4.1>    Compiling ppv-lite86 v0.2.171723pg_graphql-1.4.1>    Compiling funty v2.0.01724pg_graphql-1.4.1>    Compiling cached_proc_macro_types v0.1.01725pg_graphql-1.4.1>    Compiling stable_deref_trait v1.2.01726pg_graphql-1.4.1>    Compiling sptr v0.3.21727pg_graphql-1.4.1>    Compiling half v1.8.21728pg_graphql-1.2.2>    Compiling enum-map v2.5.01729pg_graphql-1.2.2>    Compiling futures v0.3.261730pg_graphql-1.4.1>    Compiling ascii v0.9.31731pg_graphql-1.4.1>    Compiling combine v3.8.11732pg_graphql-1.2.0>    Compiling pgx v0.7.11733pg_graphql-1.2.3>    Compiling serde_cbor v0.11.21734pg_graphql-1.2.2>    Compiling uuid v1.3.31735pg_graphql-1.2.3>    Compiling cached_proc_macro v0.12.01736pg_graphql-1.2.2>    Compiling aho-corasick v1.0.11737pg_graphql-1.2.2>    Compiling seahash v4.1.01738pg_graphql-1.2.2>    Compiling async_once v0.2.61739pg_graphql-1.4.1>    Compiling serde_cbor v0.11.21740pg_graphql-1.2.2>    Compiling seq-macro v0.3.21741pg_graphql-1.2.2>    Compiling bitflags v2.3.21742pg_graphql-1.2.0>    Compiling futures v0.3.261743pg_graphql-1.4.1>    Compiling bitvec v1.0.11744pg_graphql-1.2.3>    Compiling rand_chacha v0.3.11745pg_graphql-1.2.0>    Compiling async_once v0.2.61746pg_graphql-1.2.0>    Compiling cached v0.34.11747pg_graphql-1.2.0>    Compiling pgx-contrib-spiext v0.1.0 (https://github.com/supabase/pgx-contrib-spiext?rev=a346053#a346053d)1748pg_graphql-1.2.0>    Compiling graphql-parser v0.4.01749pg_graphql-1.2.3>    Compiling combine v3.8.11750pg_graphql-1.2.0>    Compiling rand v0.8.51751pg_graphql-1.2.0>    Compiling itertools v0.10.51752pg_graphql-1.2.2>    Compiling cached v0.34.11753pg_graphql-1.2.0>    Compiling base64 v0.13.11754pg_graphql-1.2.3>    Compiling bitvec v1.0.11755pg_graphql-1.4.1>    Compiling cached_proc_macro v0.12.01756pg_graphql-1.2.3>    Compiling enum-map v2.6.01757pg_graphql-1.2.2>    Compiling pgrx v0.9.51758pg_graphql-1.2.3>    Compiling futures v0.3.281759pg_graphql-1.4.1>    Compiling rand_chacha v0.3.11760pg_graphql-1.2.3>    Compiling uuid v1.4.01761pg_graphql-1.4.1>    Compiling enum-map v2.6.31762pg_graphql-1.4.1>    Compiling futures v0.3.281763pg_graphql-1.2.3>    Compiling async_once v0.2.61764pg_graphql-1.2.3>    Compiling seq-macro v0.3.41765pg_graphql-1.2.3>    Compiling seahash v4.1.01766pg_graphql-1.2.3>    Compiling cached v0.34.11767pg_graphql-1.2.3>    Compiling pgrx v0.9.71768pg_graphql-1.4.1>    Compiling uuid v1.4.11769pg_graphql-1.4.1>    Compiling async_once v0.2.61770pg_graphql-1.4.1>    Compiling seahash v4.1.01771pg_graphql-1.4.1>    Compiling hashbrown v0.12.31772pg_graphql-1.4.1>    Compiling seq-macro v0.3.41773pg_graphql-1.2.2>    Compiling rand v0.8.51774pg_graphql-1.4.1>    Compiling cached v0.34.11775pg_graphql-1.4.1>    Compiling pgrx v0.10.21776pg_graphql-1.2.2>    Compiling graphql-parser v0.4.01777pg_graphql-1.2.2>    Compiling itertools v0.10.51778pg_graphql-1.2.2>    Compiling base64 v0.13.11779pg_graphql-1.2.3>    Compiling graphql-parser v0.4.01780pg_graphql-1.4.1>    Compiling rand v0.8.51781pg_graphql-1.2.3>    Compiling rand v0.8.51782pg_graphql-1.4.1>    Compiling graphql-parser v0.4.01783pg_graphql-1.2.3>    Compiling itertools v0.10.51784pg_graphql-1.2.3>    Compiling base64 v0.13.11785pg_graphql-1.4.1>    Compiling itertools v0.10.51786pg_graphql-1.4.1>    Compiling bimap v0.6.31787pg_graphql-1.4.1>    Compiling base64 v0.13.11788pg_graphql-1.2.0>    Compiling pg_graphql v1.2.0 (/build/source)1789pg_graphql-1.2.0> warning: field `alias` is never read1790pg_graphql-1.2.0>   --> src/builder.rs:13:91791pg_graphql-1.2.0>    |1792pg_graphql-1.2.0> 12 | pub struct InsertBuilder {1793pg_graphql-1.2.0>    |            ------------- field in this struct1794pg_graphql-1.2.0> 13 |     pub alias: String,1795pg_graphql-1.2.0>    |         ^^^^^1796pg_graphql-1.2.0>    |1797pg_graphql-1.2.0>    = note: `InsertBuilder` has derived impls for the traits `Debug` and `Clone`, but these are intentionally ignored during dead code analysis1798pg_graphql-1.2.0>    = note: `#[warn(dead_code)]` on by default1799pg_graphql-1.2.0> 1800pg_graphql-1.2.0> warning: field `alias` is never read1801pg_graphql-1.2.0>    --> src/builder.rs:299:91802pg_graphql-1.2.0>     |1803pg_graphql-1.2.0> 298 | pub struct UpdateBuilder {1804pg_graphql-1.2.0>     |            ------------- field in this struct1805pg_graphql-1.2.0> 299 |     pub alias: String,1806pg_graphql-1.2.0>     |         ^^^^^1807pg_graphql-1.2.0>     |1808pg_graphql-1.2.0>     = note: `UpdateBuilder` has derived impls for the traits `Debug` and `Clone`, but these are intentionally ignored during dead code analysis1809pg_graphql-1.2.0> 1810pg_graphql-1.2.0> warning: field `alias` is never read1811pg_graphql-1.2.0>    --> src/builder.rs:456:91812pg_graphql-1.2.0>     |1813pg_graphql-1.2.0> 455 | pub struct DeleteBuilder {1814pg_graphql-1.2.0>     |            ------------- field in this struct1815pg_graphql-1.2.0> 456 |     pub alias: String,1816pg_graphql-1.2.0>     |         ^^^^^1817pg_graphql-1.2.0>     |1818pg_graphql-1.2.0>     = note: `DeleteBuilder` has derived impls for the traits `Debug` and `Clone`, but these are intentionally ignored during dead code analysis1819pg_graphql-1.2.0> 1820pg_graphql-1.2.0> warning: field `schema` is never read1821pg_graphql-1.2.0>     --> src/builder.rs:1550:91822pg_graphql-1.2.0>      |1823pg_graphql-1.2.0> 1549 | pub struct __SchemaBuilder {1824pg_graphql-1.2.0>      |            --------------- field in this struct1825pg_graphql-1.2.0> 1550 |     pub schema: __Schema,1826pg_graphql-1.2.0>      |         ^^^^^^1827pg_graphql-1.2.0>      |1828pg_graphql-1.2.0>      = note: `__SchemaBuilder` has a derived impl for the trait `Clone`, but this is intentionally ignored during dead code analysis1829pg_graphql-1.2.0> 1830pg_graphql-1.2.0> warning: method `arg_map` is never used1831pg_graphql-1.2.0>    --> src/graphql.rs:270:81832pg_graphql-1.2.0>     |1833pg_graphql-1.2.0> 246 | pub trait ___Field {1834pg_graphql-1.2.0>     |           -------- method in this trait1835pg_graphql-1.2.0> ...1836pg_graphql-1.2.0> 270 |     fn arg_map(&self) -> HashMap<String, __InputValue> {1837pg_graphql-1.2.0>     |        ^^^^^^^1838pg_graphql-1.2.0> 1839pg_graphql-1.2.0> warning: `pg_graphql` (lib) generated 5 warnings1840pg_graphql-1.2.0>     Finished `release` profile [optimized] target(s) in 6m 51s1841pg_graphql-1.2.0>   Installing extension1842pg_graphql-1.2.0>      Copying control file to /nix/store/0gym2yjcz54xb1zzx5hfsj7lbpmiwm6d-pg_graphql-1.2.0/nix/store/bc9327c6474vwmqmhkszkmiz86mba73s-postgresql-15.19/share/postgresql/extension/pg_graphql.control1843pg_graphql-1.2.0>      Copying shared library to /nix/store/0gym2yjcz54xb1zzx5hfsj7lbpmiwm6d-pg_graphql-1.2.0/nix/store/bs8w2qsyhnqirvhchz9fnvf86y7j6xyf-postgresql-15.19-lib/lib/pg_graphql.so1844pg_graphql-1.2.0>  Discovering SQL entities1845pg_graphql-1.2.0>   Discovered 4 SQL entities: 0 schemas (0 unique), 1 functions, 0 types, 0 enums, 3 sqls, 0 ords, 0 hashes, 0 aggregates, 0 triggers1846pg_graphql-1.2.0>      Writing SQL entities to /nix/store/0gym2yjcz54xb1zzx5hfsj7lbpmiwm6d-pg_graphql-1.2.0/nix/store/bc9327c6474vwmqmhkszkmiz86mba73s-postgresql-15.19/share/postgresql/extension/pg_graphql--1.2.0.sql1847pg_graphql-1.2.0>     Finished installing pg_graphql1848pg_graphql-1.2.0> buildPhase completed in 7 minutes 6 seconds1849pg_graphql-1.2.0> Running phase: checkPhase1850pg_graphql-1.2.0>    Validating /nix/store/bc9327c6474vwmqmhkszkmiz86mba73s-postgresql-15.19/bin/pg_config1851pg_graphql-1.2.0>  Initializing data directory at /build/tmp.OYqXnTsvER/data-151852pg_graphql-1.2.0> waiting for server to start....2026-10-27 12:31:23.051 GMT [3278] LOG:  starting PostgreSQL 15.19 on aarch64-unknown-linux-gnu, compiled by gcc (GCC) 15.3.0, 64-bit1853pg_graphql-1.2.0> 2026-10-27 12:31:23.053 GMT [3278] LOG:  listening on Unix socket "/build/tmp.ACOOj364FE/.s.PGSQL.5432"1854pg_graphql-1.2.0> 2026-10-27 12:31:23.061 GMT [3281] LOG:  database system was shut down at 2026-10-27 12:31:22 GMT1855pg_graphql-1.2.0> 2026-10-27 12:31:23.066 GMT [3278] LOG:  database system is ready to accept connections1856pg_graphql-1.2.0>  done1857pg_graphql-1.2.0> server started1858pg_graphql-1.2.0> createuser: error: connection to server at "localhost" (127.0.0.1), port 5432 failed: Connection refused1859pg_graphql-1.2.0> 	Is the server running on that host and accepting TCP/IP connections?1860pg_graphql-1.2.0> waiting for server to shut down....2026-10-27 12:31:23.135 GMT [3278] LOG:  received fast shutdown request1861pg_graphql-1.2.0> 2026-10-27 12:31:23.138 GMT [3278] LOG:  aborting any active transactions1862pg_graphql-1.2.0> 2026-10-27 12:31:23.140 GMT [3278] LOG:  background worker "logical replication launcher" (PID 3284) exited with exit code 11863pg_graphql-1.2.0> 2026-10-27 12:31:23.142 GMT [3279] LOG:  shutting down1864pg_graphql-1.2.0> 2026-10-27 12:31:23.144 GMT [3279] LOG:  checkpoint starting: shutdown immediate1865pg_graphql-1.2.0> 2026-10-27 12:31:23.157 GMT [3279] LOG:  checkpoint complete: wrote 3 buffers (0.0%); 0 WAL file(s) added, 0 removed, 0 recycled; write=0.004 s, sync=0.002 s, total=0.015 s; sync files=2, longest=0.001 s, average=0.001 s; distance=0 kB, estimate=0 kB1866pg_graphql-1.2.0> 2026-10-27 12:31:23.163 GMT [3278] LOG:  database system is shut down1867pg_graphql-1.2.0>  done1868pg_graphql-1.2.0> server stopped1869pg_graphql-1.2.0> warning: `/build/source/.cargo/config` is deprecated in favor of `config.toml`1870pg_graphql-1.2.0> note: if you need to support cargo 1.38 or earlier, you can symlink `config` to `config.toml`1871pg_graphql-1.2.0>    Validating /build/tmp.hd4Rj0ojZE/15/bin/pg_config1872pg_graphql-1.2.0> warning: `/build/source/.cargo/config` is deprecated in favor of `config.toml`1873pg_graphql-1.2.0> note: if you need to support cargo 1.38 or earlier, you can symlink `config` to `config.toml`1874pg_graphql-1.2.0>        Using PgConfig("pg15") and `pg_config` from /build/tmp.hd4Rj0ojZE/15/bin/pg_config1875pg_graphql-1.2.0>     Building extension with features pg151876pg_graphql-1.2.0>      Running command "cargo" "build" "--release" "--features" "pg15" "--no-default-features" "--message-format=json-render-diagnostics" "--frozen" "-j" "2"1877pg_graphql-1.2.0> warning: `/build/source/.cargo/config` is deprecated in favor of `config.toml`1878pg_graphql-1.2.0> note: if you need to support cargo 1.38 or earlier, you can symlink `config` to `config.toml`1879pg_graphql-1.2.0> warning: field `alias` is never read1880pg_graphql-1.2.0>   --> src/builder.rs:13:91881pg_graphql-1.2.0>    |1882pg_graphql-1.2.0> 12 | pub struct InsertBuilder {1883pg_graphql-1.2.0>    |            ------------- field in this struct1884pg_graphql-1.2.0> 13 |     pub alias: String,1885pg_graphql-1.2.0>    |         ^^^^^1886pg_graphql-1.2.0>    |1887pg_graphql-1.2.0>    = note: `InsertBuilder` has derived impls for the traits `Debug` and `Clone`, but these are intentionally ignored during dead code analysis1888pg_graphql-1.2.0>    = note: `#[warn(dead_code)]` on by default1889pg_graphql-1.2.0> 1890pg_graphql-1.2.0> warning: field `alias` is never read1891pg_graphql-1.2.0>    --> src/builder.rs:299:91892pg_graphql-1.2.0>     |1893pg_graphql-1.2.0> 298 | pub struct UpdateBuilder {1894pg_graphql-1.2.0>     |            ------------- field in this struct1895pg_graphql-1.2.0> 299 |     pub alias: String,1896pg_graphql-1.2.0>     |         ^^^^^1897pg_graphql-1.2.0>     |1898pg_graphql-1.2.0>     = note: `UpdateBuilder` has derived impls for the traits `Debug` and `Clone`, but these are intentionally ignored during dead code analysis1899pg_graphql-1.2.0> 1900pg_graphql-1.2.0> warning: field `alias` is never read1901pg_graphql-1.2.0>    --> src/builder.rs:456:91902pg_graphql-1.2.0>     |1903pg_graphql-1.2.0> 455 | pub struct DeleteBuilder {1904pg_graphql-1.2.0>     |            ------------- field in this struct1905pg_graphql-1.2.0> 456 |     pub alias: String,1906pg_graphql-1.2.0>     |         ^^^^^1907pg_graphql-1.2.0>     |1908pg_graphql-1.2.0>     = note: `DeleteBuilder` has derived impls for the traits `Debug` and `Clone`, but these are intentionally ignored during dead code analysis1909pg_graphql-1.2.0> 1910pg_graphql-1.2.0> warning: field `schema` is never read1911pg_graphql-1.2.0>     --> src/builder.rs:1550:91912pg_graphql-1.2.0>      |1913pg_graphql-1.2.0> 1549 | pub struct __SchemaBuilder {1914pg_graphql-1.2.0>      |            --------------- field in this struct1915pg_graphql-1.2.0> 1550 |     pub schema: __Schema,1916pg_graphql-1.2.0>      |         ^^^^^^1917pg_graphql-1.2.0>      |1918pg_graphql-1.2.0>      = note: `__SchemaBuilder` has a derived impl for the trait `Clone`, but this is intentionally ignored during dead code analysis1919pg_graphql-1.2.0> 1920pg_graphql-1.2.0> warning: method `arg_map` is never used1921pg_graphql-1.2.0>    --> src/graphql.rs:270:81922pg_graphql-1.2.0>     |1923pg_graphql-1.2.0> 246 | pub trait ___Field {1924pg_graphql-1.2.0>     |           -------- method in this trait1925pg_graphql-1.2.0> ...1926pg_graphql-1.2.0> 270 |     fn arg_map(&self) -> HashMap<String, __InputValue> {1927pg_graphql-1.2.0>     |        ^^^^^^^1928pg_graphql-1.2.0> 1929pg_graphql-1.2.0> warning: `pg_graphql` (lib) generated 5 warnings1930pg_graphql-1.2.0>     Finished `release` profile [optimized] target(s) in 0.16s1931pg_graphql-1.2.0>   Installing extension1932pg_graphql-1.2.0>      Copying control file to /build/tmp.hd4Rj0ojZE/15/share/postgresql/extension/pg_graphql.control1933pg_graphql-1.2.0>      Copying shared library to /build/tmp.hd4Rj0ojZE/15/lib/pg_graphql.so1934pg_graphql-1.2.0>  Discovering SQL entities1935pg_graphql-1.2.0>   Discovered 4 SQL entities: 0 schemas (0 unique), 1 functions, 0 types, 0 enums, 3 sqls, 0 ords, 0 hashes, 0 aggregates, 0 triggers1936pg_graphql-1.2.0>      Writing SQL entities to /build/tmp.hd4Rj0ojZE/15/share/postgresql/extension/pg_graphql--1.2.0.sql1937pg_graphql-1.2.0>     Finished installing pg_graphql1938pg_graphql-1.2.0> ++ mktemp -d1939pg_graphql-1.2.0> + TMPDIR=/build/tmp.vKiDo9wtcC1940pg_graphql-1.2.0> + export PGDATA=/build/tmp.vKiDo9wtcC1941pg_graphql-1.2.0> + PGDATA=/build/tmp.vKiDo9wtcC1942pg_graphql-1.2.0> + export PGHOST=/build/tmp.vKiDo9wtcC1943pg_graphql-1.2.0> + PGHOST=/build/tmp.vKiDo9wtcC1944pg_graphql-1.2.0> + export PGUSER=postgres1945pg_graphql-1.2.0> + PGUSER=postgres1946pg_graphql-1.2.0> + export PGDATABASE=postgres1947pg_graphql-1.2.0> + PGDATABASE=postgres1948pg_graphql-1.2.0> + export PGTZ=UTC1949pg_graphql-1.2.0> + PGTZ=UTC1950pg_graphql-1.2.0> + export PG_COLOR=auto1951pg_graphql-1.2.0> + PG_COLOR=auto1952pg_graphql-1.2.0> + trap 'pg_ctl stop -m i' sigint sigterm exit1953pg_graphql-1.2.0> + rm -rf ''1954pg_graphql-1.2.0> + initdb --no-locale --encoding=UTF8 --nosync -U postgres1955pg_graphql-1.2.0> The files belonging to this database system will be owned by user "nixbld".1956pg_graphql-1.2.0> This user must also own the server process.1957pg_graphql-1.2.0> 1958pg_graphql-1.2.0> The database cluster will be initialized with locale "C".1959pg_graphql-1.2.0> The default text search configuration will be set to "english".1960pg_graphql-1.2.0> 1961pg_graphql-1.2.0> Data page checksums are disabled.1962pg_graphql-1.2.0> 1963pg_graphql-1.2.0> fixing permissions on existing directory /build/tmp.vKiDo9wtcC ... ok1964pg_graphql-1.2.0> creating subdirectories ... ok1965pg_graphql-1.2.0> selecting dynamic shared memory implementation ... posix1966pg_graphql-1.2.0> selecting default max_connections ... 1001967pg_graphql-1.2.0> selecting default shared_buffers ... 128MB1968pg_graphql-1.2.0> selecting default time zone ... UTC1969pg_graphql-1.2.0> creating configuration files ... ok1970pg_graphql-1.2.0> running bootstrap script ... ok1971pg_graphql-1.2.0> performing post-bootstrap initialization ... ok1972pg_graphql-1.2.0> 1973pg_graphql-1.2.0> Sync to disk skipped.1974pg_graphql-1.2.0> The data directory might become corrupt if the operating system crashes.1975pg_graphql-1.2.0> 1976pg_graphql-1.2.0> initdb: warning: enabling "trust" authentication for local connections1977pg_graphql-1.2.0> initdb: hint: You can change this by editing pg_hba.conf or using the option -A, or --auth-local and --auth-host, the next time you run initdb.1978pg_graphql-1.2.0> 1979pg_graphql-1.2.0> Success. You can now start the database server using:1980pg_graphql-1.2.0> 1981pg_graphql-1.2.0>     /build/tmp.hd4Rj0ojZE/15/bin/pg_ctl -D /build/tmp.vKiDo9wtcC -l logfile start1982pg_graphql-1.2.0> 1983pg_graphql-1.2.0> + pg_ctl start -o '-F -c listen_addresses="" -c log_min_messages=WARNING -k /build/tmp.vKiDo9wtcC'1984pg_graphql-1.2.0> waiting for server to start....2026-10-27 12:31:37.269 UTC [3377] LOG:  starting PostgreSQL 15.19 on aarch64-unknown-linux-gnu, compiled by gcc (GCC) 15.3.0, 64-bit1985pg_graphql-1.2.0> 2026-10-27 12:31:37.269 UTC [3377] LOG:  listening on Unix socket "/build/tmp.vKiDo9wtcC/.s.PGSQL.5432"1986pg_graphql-1.2.0> 2026-10-27 12:31:37.271 UTC [3380] LOG:  database system was shut down at 2026-10-27 12:31:37 UTC1987pg_graphql-1.2.0> 2026-10-27 12:31:37.275 UTC [3377] LOG:  database system is ready to accept connections1988pg_graphql-1.2.0>  done1989pg_graphql-1.2.0> server started1990pg_graphql-1.2.0> + createdb contrib_regression1991pg_graphql-1.2.0> + TESTDIR=test1992pg_graphql-1.2.0> +++ pg_config --pgxs1993pg_graphql-1.2.0> ++ dirname /nix/store/bc9327c6474vwmqmhkszkmiz86mba73s-postgresql-15.19/lib/pgxs/src/makefiles/pgxs.mk1994pg_graphql-1.2.0> + PGXS=/nix/store/bc9327c6474vwmqmhkszkmiz86mba73s-postgresql-15.19/lib/pgxs/src/makefiles1995pg_graphql-1.2.0> + REGRESS=/nix/store/bc9327c6474vwmqmhkszkmiz86mba73s-postgresql-15.19/lib/pgxs/src/makefiles/../test/regress/pg_regress1996pg_graphql-1.2.0> ++ ls test/sql1997pg_graphql-1.2.0> ++ sed -e 's/\..*$//'1998pg_graphql-1.2.0> ++ sort1999pg_graphql-1.2.0> + TESTS=$'aliases\nallow_camel_names\nbigint_is_string\nbuiltin_directives\ncomment_directive\ncomment_directive_description\nempty_mutations\nextend_type_with_function\nextend_type_with_generated_column\nfilter_by_node_id\nfragment_on_mutation\nfragment_on_query\ninflection_fields\ninflection_function\ninflection_relationships\ninflection_types\nissue_163\nissue_170\nissue_225\nissue_300\nissue_306\nissue_312\njson_is_stringified\nmax_page_size\nmax_rows_directive\nmulti_column_primary_key\nmultiple_mutations\nmultiple_queries\nmutation_delete\nmutation_delete_variable\nmutation_insert\nmutation_update\nnull_argument\nomit_exotic_types\nomit_weird_names\noperation_name\noverride_enum_name\noverride_field_name\noverride_func_field_name\noverride_relationship_field_name\noverride_type_name\npage_info\npermissions_connection_column\npermissions_node_column\npermissions_table_level\npermissions_types\nprimary_key_is_required\nrelationship_one_to_one\nresolve___schema\nresolve___type\nresolve___typename\nresolve_array_type\nresolve_connection_filter\nresolve_connection_named\nresolve_connection_order_by\nresolve_connection_pagination_args\nresolve_connection_to_conn\nresolve_connection_to_node\nresolve_error_connection_edge_no_field\nresolve_error_connection_edge_node_no_field\nresolve_error_connection_no_field\nresolve_error_from_parser\nresolve_error_mutation_no_field\nresolve_error_node_no_field\nresolve_error_query_no_field\nresolve_fragment\nresolve_graphiql_schema\nresolve_one\nroundtrip_types\nrow_level_security\nsqli_connection\nstring_filters\ntest_error_anon_and_named_operations\ntest_error_invalid_offset\ntest_error_multiple_anon_operations\ntest_error_operation_name_not_found\ntest_error_operation_names_not_unique\ntest_error_parsing\ntest_error_subscription\ntest_query__type\ntotal_count\ntype_bigfloat\ntype_modifier_max_length\ntype_opaque\nviews_integration'2000pg_graphql-1.2.0> + psql -v ON_ERROR_STOP=1 -f test/fixtures.sql -d contrib_regression2001pg_graphql-1.2.0> psql:test/fixtures.sql:1: NOTICE:  extension "pg_graphql" does not exist, skipping2002pg_graphql-1.2.0> DROP EXTENSION2003pg_graphql-1.2.0> CREATE EXTENSION2004pg_graphql-1.2.0> COMMENT2005pg_graphql-1.2.0> CREATE FUNCTION2006pg_graphql-1.2.0> + /nix/store/bc9327c6474vwmqmhkszkmiz86mba73s-postgresql-15.19/lib/pgxs/src/makefiles/../test/regress/pg_regress --use-existing --dbname=contrib_regression --inputdir=test aliases allow_camel_names bigint_is_string builtin_directives comment_directive comment_directive_description empty_mutations extend_type_with_function extend_type_with_generated_column filter_by_node_id fragment_on_mutation fragment_on_query inflection_fields inflection_function inflection_relationships inflection_types issue_163 issue_170 issue_225 issue_300 issue_306 issue_312 json_is_stringified max_page_size max_rows_directive multi_column_primary_key multiple_mutations multiple_queries mutation_delete mutation_delete_variable mutation_insert mutation_update null_argument omit_exotic_types omit_weird_names operation_name override_enum_name override_field_name override_func_field_name override_relationship_field_name override_type_name page_info permissions_connection_column permissions_node_column permissions_table_level permissions_types primary_key_is_required relationship_one_to_one resolve___schema resolve___type resolve___typename resolve_array_type resolve_connection_filter resolve_connection_named resolve_connection_order_by resolve_connection_pagination_args resolve_connection_to_conn resolve_connection_to_node resolve_error_connection_edge_no_field resolve_error_connection_edge_node_no_field resolve_error_connection_no_field resolve_error_from_parser resolve_error_mutation_no_field resolve_error_node_no_field resolve_error_query_no_field resolve_fragment resolve_graphiql_schema resolve_one roundtrip_types row_level_security sqli_connection string_filters test_error_anon_and_named_operations test_error_invalid_offset test_error_multiple_anon_operations test_error_operation_name_not_found test_error_operation_names_not_unique test_error_parsing test_error_subscription test_query__type total_count type_bigfloat type_modifier_max_length type_opaque views_integration2007pg_graphql-1.2.0> (using postmaster on /build/tmp.vKiDo9wtcC, default port)2008pg_graphql-1.2.0> ============== running regression test queries        ==============2009pg_graphql-1.2.0> test aliases                      ... ok           36 ms2010pg_graphql-1.2.0> test allow_camel_names            ... ok           35 ms2011pg_graphql-1.2.0> test bigint_is_string             ... ok           32 ms2012pg_graphql-1.2.0> test builtin_directives           ... ok           32 ms2013pg_graphql-1.2.0> test comment_directive            ... ok           10 ms2014pg_graphql-1.2.0> test comment_directive_description ... ok           28 ms2015pg_graphql-1.2.0> test empty_mutations              ... ok           28 ms2016pg_graphql-1.2.0> test extend_type_with_function    ... ok           32 ms2017pg_graphql-1.2.0> test extend_type_with_generated_column ... ok           30 ms2018pg_graphql-1.2.0> test filter_by_node_id            ... ok           32 ms2019pg_graphql-1.2.0> test fragment_on_mutation         ... ok           28 ms2020pg_graphql-1.2.0> test fragment_on_query            ... ok           28 ms2021pg_graphql-1.2.0> test inflection_fields            ... ok           50 ms2022pg_graphql-1.2.0> test inflection_function          ... ok           50 ms2023pg_graphql-1.2.0> test inflection_relationships     ... ok           74 ms2024pg_graphql-1.2.0> test inflection_types             ... ok           53 ms2025pg_graphql-1.2.0> test issue_163                    ... ok           27 ms2026pg_graphql-1.2.0> test issue_170                    ... ok           28 ms2027pg_graphql-1.2.0> test issue_225                    ... ok           30 ms2028pg_graphql-1.2.0> test issue_300                    ... ok           30 ms2029pg_graphql-1.2.0> test issue_306                    ... ok           31 ms2030pg_graphql-1.2.0> test issue_312                    ... ok           29 ms2031pg_graphql-1.2.0> test json_is_stringified          ... ok           32 ms2032pg_graphql-1.2.0> test max_page_size                ... ok           28 ms2033pg_graphql-1.2.0> test max_rows_directive           ... ok           44 ms2034pg_graphql-1.2.0> test multi_column_primary_key     ... ok           36 ms2035pg_graphql-1.2.0> test multiple_mutations           ... ok           29 ms2036pg_graphql-1.2.0> test multiple_queries             ... ok           29 ms2037pg_graphql-1.2.0> test mutation_delete              ... ok           37 ms2038pg_graphql-1.2.0> test mutation_delete_variable     ... ok           30 ms2039pg_graphql-1.2.0> test mutation_insert              ... ok           39 ms2040pg_graphql-1.2.0> test mutation_update              ... ok           41 ms2041pg_graphql-1.2.0> test null_argument                ... ok           28 ms2042pg_graphql-1.2.0> test omit_exotic_types            ... ok           30 ms2043pg_graphql-1.2.0> test omit_weird_names             ... ok           36 ms2044pg_graphql-1.2.0> test operation_name               ... ok           30 ms2045pg_graphql-1.2.0> test override_enum_name           ... ok           25 ms2046pg_graphql-1.2.0> test override_field_name          ... ok           27 ms2047pg_graphql-1.2.0> test override_func_field_name     ... ok           28 ms2048pg_graphql-1.2.0> test override_relationship_field_name ... ok           31 ms2049pg_graphql-1.2.0> test override_type_name           ... ok           28 ms2050pg_graphql-1.2.0> test page_info                    ... ok           36 ms2051pg_graphql-1.2.0> test permissions_connection_column ... ok           41 ms2052pg_graphql-1.2.0> test permissions_node_column      ... ok           43 ms2053pg_graphql-1.2.0> test permissions_table_level      ... ok           64 ms2054pg_graphql-1.2.0> test permissions_types            ... ok           38 ms2055pg_graphql-1.2.0> test primary_key_is_required      ... ok           36 ms2056pg_graphql-1.2.0> test relationship_one_to_one      ... ok           32 ms2057pg_graphql-1.2.0> test resolve___schema             ... ok           38 ms2058pg_graphql-1.2.0> test resolve___type               ... ok           29 ms2059pg_graphql-1.2.0> test resolve___typename           ... ok           34 ms2060pg_graphql-1.2.0> test resolve_array_type           ... ok           31 ms2061pg_graphql-1.2.0> test resolve_connection_filter    ... ok           51 ms2062pg_graphql-1.2.0> test resolve_connection_named     ... ok           29 ms2063pg_graphql-1.2.0> test resolve_connection_order_by  ... ok           42 ms2064pg_graphql-1.2.0> test resolve_connection_pagination_args ... ok           52 ms2065pg_graphql-1.2.0> test resolve_connection_to_conn   ... ok           34 ms2066pg_graphql-1.2.0> test resolve_connection_to_node   ... ok           33 ms2067pg_graphql-1.2.0> test resolve_error_connection_edge_no_field ... ok           27 ms2068pg_graphql-1.2.0> test resolve_error_connection_edge_node_no_field ... ok           26 ms2069pg_graphql-1.2.0> test resolve_error_connection_no_field ... ok           27 ms2070pg_graphql-1.2.0> test resolve_error_from_parser    ... ok           10 ms2071pg_graphql-1.2.0> test resolve_error_mutation_no_field ... ok           22 ms2072pg_graphql-1.2.0> test resolve_error_node_no_field  ... ok           28 ms2073pg_graphql-1.2.0> test resolve_error_query_no_field ... ok           22 ms2074pg_graphql-1.2.0> test resolve_fragment             ... ok           29 ms2075pg_graphql-1.2.0> test resolve_graphiql_schema      ... ok           67 ms2076pg_graphql-1.2.0> test resolve_one                  ... ok           48 ms2077pg_graphql-1.2.0> test roundtrip_types              ... ok           40 ms2078pg_graphql-1.2.0> test row_level_security           ... ok           30 ms2079pg_graphql-1.2.0> test sqli_connection              ... ok           35 ms2080pg_graphql-1.2.0> test string_filters               ... ok           31 ms2081pg_graphql-1.2.0> test test_error_anon_and_named_operations ... ok           22 ms2082pg_graphql-1.2.0> test test_error_invalid_offset    ... ok           37 ms2083pg_graphql-1.2.0> test test_error_multiple_anon_operations ... ok           21 ms2084pg_graphql-1.2.0> test test_error_operation_name_not_found ... ok           22 ms2085pg_graphql-1.2.0> test test_error_operation_names_not_unique ... ok           22 ms2086pg_graphql-1.2.0> test test_error_parsing           ... ok           10 ms2087pg_graphql-1.2.0> test test_error_subscription      ... ok           21 ms2088pg_graphql-1.2.0> test test_query__type             ... ok           22 ms2089pg_graphql-1.2.0> test total_count                  ... ok           37 ms2090pg_graphql-1.2.0> test type_bigfloat                ... ok           33 ms2091pg_graphql-1.2.0> test type_modifier_max_length     ... ok           30 ms2092pg_graphql-1.2.0> test type_opaque                  ... ok           36 ms2093pg_graphql-1.2.0> test views_integration            ... ok           75 ms2094pg_graphql-1.2.0> 2095pg_graphql-1.2.0> ======================2096pg_graphql-1.2.0>  All 85 tests passed. 2097pg_graphql-1.2.0> ======================2098pg_graphql-1.2.0> 2099pg_graphql-1.2.0> + pg_ctl stop -m i2100pg_graphql-1.2.0> waiting for server to shut down....2026-10-27 12:31:40.413 UTC [3377] LOG:  received immediate shutdown request2101pg_graphql-1.2.0> 2026-10-27 12:31:40.421 UTC [3377] LOG:  database system is shut down2102pg_graphql-1.2.0>  done2103pg_graphql-1.2.0> server stopped2104pg_graphql-1.2.0> Running phase: installPhase2105pg_graphql-1.2.0> Executing buildPgrxExtension install2106pg_graphql-1.2.0> Running phase: fixupPhase2107pg_graphql-1.2.0> shrinking RPATHs of ELF executables and libraries in /nix/store/0gym2yjcz54xb1zzx5hfsj7lbpmiwm6d-pg_graphql-1.2.02108pg_graphql-1.2.0> shrinking /nix/store/0gym2yjcz54xb1zzx5hfsj7lbpmiwm6d-pg_graphql-1.2.0/lib/pg_graphql-1.2.0.so2109pg_graphql-1.2.0> checking for references to /build/ in /nix/store/0gym2yjcz54xb1zzx5hfsj7lbpmiwm6d-pg_graphql-1.2.0...2110pg_graphql-1.2.0> patching script interpreter paths in /nix/store/0gym2yjcz54xb1zzx5hfsj7lbpmiwm6d-pg_graphql-1.2.02111pg_graphql-1.2.0> stripping (with command strip and flags -S -p) in  /nix/store/0gym2yjcz54xb1zzx5hfsj7lbpmiwm6d-pg_graphql-1.2.0/lib2112building '/nix/store/9f94yvgw5hrz2jjzagd543lykidi76w5-pg_graphql-1.4.2.drv' on 'ssh-ng://nixbot-remote-build@78.232.36.247'2113building '/nix/store/9f94yvgw5hrz2jjzagd543lykidi76w5-pg_graphql-1.4.2.drv'2114pg_graphql-1.4.2> Running phase: unpackPhase2115pg_graphql-1.4.2> unpacking source archive /nix/store/djqshp4amvqpxhvjd5r63vy2xnvrhxp0-source2116pg_graphql-1.4.2> source root is source2117pg_graphql-1.4.2> Executing cargoSetupPostUnpackHook2118pg_graphql-1.4.2> Finished cargoSetupPostUnpackHook2119pg_graphql-1.4.2> Running phase: patchPhase2120pg_graphql-1.4.2> Executing cargoSetupPostPatchHook2121pg_graphql-1.4.2> Validating consistency between /build/source/Cargo.lock and /build/cargo-vendor-dir/Cargo.lock2122pg_graphql-1.4.2> Finished cargoSetupPostPatchHook2123pg_graphql-1.4.2> Running phase: updateAutotoolsGnuConfigScriptsPhase2124pg_graphql-1.4.2> Running phase: configurePhase2125pg_graphql-1.4.2> Running phase: buildPhase2126pg_graphql-1.4.2> Executing cargo-pgrx buildPhase2127pg_graphql-1.4.2>    Validating /nix/store/bc9327c6474vwmqmhkszkmiz86mba73s-postgresql-15.19/bin/pg_config2128pg_graphql-1.4.2>  Initializing data directory at /build/tmp.nsUPA9TSOT/data-152129pg_graphql-1.4.2> waiting for server to start....2026-10-27 12:31:49.717 GMT [87] LOG:  starting PostgreSQL 15.19 on aarch64-unknown-linux-gnu, compiled by gcc (GCC) 15.3.0, 64-bit2130pg_graphql-1.4.2> 2026-10-27 12:31:49.725 GMT [87] LOG:  listening on Unix socket "/build/tmp.MzJTyNzXal/.s.PGSQL.5432"2131pg_graphql-1.4.2> 2026-10-27 12:31:49.733 GMT [90] LOG:  database system was shut down at 2026-10-27 12:31:49 GMT2132pg_graphql-1.4.2> 2026-10-27 12:31:49.740 GMT [87] LOG:  database system is ready to accept connections2133pg_graphql-1.4.2>  done2134pg_graphql-1.4.2> server started2135pg_graphql-1.4.2> createuser: error: connection to server at "localhost" (127.0.0.1), port 5432 failed: Connection refused2136pg_graphql-1.4.2> 	Is the server running on that host and accepting TCP/IP connections?2137pg_graphql-1.4.2> waiting for server to shut down....2026-10-27 12:31:49.793 GMT [87] LOG:  received fast shutdown request2138pg_graphql-1.4.2> 2026-10-27 12:31:49.795 GMT [87] LOG:  aborting any active transactions2139pg_graphql-1.4.2> 2026-10-27 12:31:49.797 GMT [87] LOG:  background worker "logical replication launcher" (PID 93) exited with exit code 12140pg_graphql-1.4.2> 2026-10-27 12:31:49.799 GMT [88] LOG:  shutting down2141pg_graphql-1.4.2> 2026-10-27 12:31:49.801 GMT [88] LOG:  checkpoint starting: shutdown immediate2142pg_graphql-1.4.2> 2026-10-27 12:31:49.828 GMT [88] LOG:  checkpoint complete: wrote 3 buffers (0.0%); 0 WAL file(s) added, 0 removed, 0 recycled; write=0.006 s, sync=0.002 s, total=0.029 s; sync files=2, longest=0.001 s, average=0.001 s; distance=0 kB, estimate=0 kB2143pg_graphql-1.4.2> 2026-10-27 12:31:49.834 GMT [87] LOG:  database system is shut down2144pg_graphql-1.4.2>  done2145pg_graphql-1.4.2> server stopped2146pg_graphql-1.4.2>        Using PgConfig("pg15") and `pg_config` from /nix/store/bc9327c6474vwmqmhkszkmiz86mba73s-postgresql-15.19/bin/pg_config2147pg_graphql-1.4.2>     Building extension with features  pg152148pg_graphql-1.4.2>      Running command "/nix/store/y779g007dd48i3q1la2xk16y4fa85c1x-rust-default-1.70.0/bin/cargo" "build" "--release" "--features" " pg15" "--no-default-features" "--message-format=json-render-diagnostics" "--frozen" "-j" "2"2149pg_graphql-1.4.2>    Compiling proc-macro2 v1.0.672150pg_graphql-1.4.2>    Compiling unicode-ident v1.0.102151pg_graphql-1.4.2>    Compiling libc v0.2.1482152pg_graphql-1.4.2>    Compiling syn v1.0.1092153pg_graphql-1.4.2>    Compiling quote v1.0.332154pg_graphql-1.4.2>    Compiling syn v2.0.252155pg_graphql-1.4.2>    Compiling autocfg v1.1.02156pg_graphql-1.4.2>    Compiling thiserror v1.0.432157pg_graphql-1.4.2>    Compiling serde v1.0.1712158pg_graphql-1.4.2>    Compiling eyre v0.6.82159pg_graphql-1.4.2>    Compiling hashbrown v0.14.02160pg_graphql-1.4.2>    Compiling equivalent v1.0.02161pg_graphql-1.4.2>    Compiling indexmap v2.0.02162pg_graphql-1.4.2>    Compiling serde_derive v1.0.1712163pg_graphql-1.4.2>    Compiling thiserror-impl v1.0.432164pg_graphql-1.4.2>    Compiling memchr v2.6.32165pg_graphql-1.4.2>    Compiling serde_json v1.0.1002166pg_graphql-1.4.2>    Compiling glob v0.3.12167pg_graphql-1.4.2>    Compiling tinyvec_macros v0.1.12168pg_graphql-1.4.2>    Compiling tinyvec v1.6.02169pg_graphql-1.4.2>    Compiling clang-sys v1.6.12170pg_graphql-1.4.2>    Compiling serde_spanned v0.6.32171pg_graphql-1.4.2>    Compiling toml_datetime v0.6.32172pg_graphql-1.4.2>    Compiling once_cell v1.18.02173pg_graphql-1.4.2>    Compiling anyhow v1.0.712174pg_graphql-1.4.2>    Compiling ucd-trie v0.1.62175pg_graphql-1.4.2>    Compiling winnow v0.5.152176pg_graphql-1.4.2>    Compiling indenter v0.3.32177pg_graphql-1.4.2>    Compiling pest v2.7.02178pg_graphql-1.4.2>    Compiling toml_edit v0.20.02179pg_graphql-1.4.2>    Compiling unicode-normalization v0.1.222180pg_graphql-1.4.2>    Compiling cfg-if v1.0.02181pg_graphql-1.4.2>    Compiling semver v1.0.172182pg_graphql-1.4.2>    Compiling minimal-lexical v0.2.12183pg_graphql-1.4.2>    Compiling unicode-bidi v0.3.132184pg_graphql-1.4.2>    Compiling regex-syntax v0.7.52185pg_graphql-1.4.2>    Compiling option-ext v0.2.02186pg_graphql-1.4.2>    Compiling percent-encoding v2.3.02187pg_graphql-1.4.2>    Compiling futures-core v0.3.282188pg_graphql-1.4.2>    Compiling form_urlencoded v1.2.02189pg_graphql-1.4.2>    Compiling dirs-sys v0.4.12190pg_graphql-1.4.2>    Compiling libloading v0.7.42191pg_graphql-1.4.2>    Compiling regex-automata v0.3.82192pg_graphql-1.4.2>    Compiling idna v0.4.02193pg_graphql-1.4.2>    Compiling toml v0.8.02194pg_graphql-1.4.2>    Compiling nom v7.1.32195pg_graphql-1.4.2>    Compiling semver-parser v0.10.22196pg_graphql-1.4.2>    Compiling slab v0.4.82197pg_graphql-1.4.2>    Compiling itoa v1.0.82198pg_graphql-1.4.2>    Compiling ryu v1.0.142199pg_graphql-1.4.2>    Compiling futures-task v0.3.282200pg_graphql-1.4.2>    Compiling bindgen v0.68.12201pg_graphql-1.4.2>    Compiling futures-channel v0.3.282202pg_graphql-1.4.2>    Compiling pathsearch v0.2.02203pg_graphql-1.4.2>    Compiling cexpr v0.6.02204pg_graphql-1.4.2>    Compiling semver v0.11.02205pg_graphql-1.4.2>    Compiling cargo_toml v0.16.22206pg_graphql-1.4.2>    Compiling regex v1.9.52207pg_graphql-1.4.2>    Compiling url v2.4.12208pg_graphql-1.4.2>    Compiling dirs v5.0.12209pg_graphql-1.4.2>    Compiling getrandom v0.2.102210pg_graphql-1.4.2>    Compiling futures-sink v0.3.282211pg_graphql-1.4.2>    Compiling lazy_static v1.4.02212pg_graphql-1.4.2>    Compiling byteorder v1.4.32213pg_graphql-1.4.2>    Compiling peeking_take_while v0.1.22214pg_graphql-1.4.2>    Compiling strsim v0.10.02215pg_graphql-1.4.2>    Compiling bitflags v2.4.02216pg_graphql-1.4.2>    Compiling owo-colors v3.5.02217pg_graphql-1.4.2>    Compiling futures-util v0.3.282218pg_graphql-1.4.2>    Compiling fnv v1.0.72219pg_graphql-1.4.2>    Compiling fixedbitset v0.4.22220pg_graphql-1.4.2>    Compiling lazycell v1.3.02221pg_graphql-1.4.2>    Compiling ident_case v1.0.12222pg_graphql-1.4.2>    Compiling shlex v1.2.02223pg_graphql-1.4.2>    Compiling unicode-segmentation v1.10.12224pg_graphql-1.4.2>    Compiling pin-project-lite v0.2.102225pg_graphql-1.4.2>    Compiling rustc-hash v1.1.02226pg_graphql-1.4.2>    Compiling convert_case v0.6.02227pg_graphql-1.4.2>    Compiling darling_core v0.13.42228pg_graphql-1.4.2>    Compiling petgraph v0.6.42229pg_graphql-1.4.2>    Compiling pgrx-pg-config v0.10.22230pg_graphql-1.4.2>    Compiling rustc_version v0.4.02231pg_graphql-1.4.2>    Compiling rustc_version v0.3.32232pg_graphql-1.4.2>    Compiling futures-macro v0.3.282233pg_graphql-1.4.2>    Compiling memoffset v0.9.02234pg_graphql-1.4.2>    Compiling futures-io v0.3.282235pg_graphql-1.4.2>    Compiling radium v0.7.02236pg_graphql-1.4.2>    Compiling pin-utils v0.1.02237pg_graphql-1.4.2>    Compiling unescape v0.1.02238pg_graphql-1.4.2>    Compiling pgrx-sql-entity-graph v0.10.22239pg_graphql-1.4.2>    Compiling atomic-traits v0.3.02240pg_graphql-1.4.2>    Compiling heapless v0.7.162241pg_graphql-1.4.2>    Compiling pgrx-pg-sys v0.10.22242pg_graphql-1.4.2>    Compiling darling_macro v0.13.42243pg_graphql-1.4.2>    Compiling tokio v1.29.12244pg_graphql-1.4.2>    Compiling either v1.8.12245pg_graphql-1.4.2>    Compiling async-trait v0.1.712246pg_graphql-1.4.2>    Compiling tap v1.0.12247pg_graphql-1.4.2>    Compiling void v1.0.22248pg_graphql-1.4.2>    Compiling unreachable v1.0.02249pg_graphql-1.4.2>    Compiling wyz v0.5.12250pg_graphql-1.4.2>    Compiling darling v0.13.42251pg_graphql-1.4.2>    Compiling pgrx-macros v0.10.22252pg_graphql-1.4.2>    Compiling futures-executor v0.3.282253pg_graphql-1.4.2>    Compiling hash32 v0.2.12254pg_graphql-1.4.2>    Compiling rand_core v0.6.42255pg_graphql-1.4.2>    Compiling aho-corasick v1.0.22256pg_graphql-1.4.2>    Compiling num_cpus v1.16.02257pg_graphql-1.4.2>    Compiling enum-map-derive v0.14.02258pg_graphql-1.4.2>    Compiling tokio-macros v2.1.02259pg_graphql-1.4.2>    Compiling funty v2.0.02260pg_graphql-1.4.2>    Compiling stable_deref_trait v1.2.02261pg_graphql-1.4.2>    Compiling cached_proc_macro_types v0.1.02262pg_graphql-1.4.2>    Compiling ascii v0.9.32263pg_graphql-1.4.2>    Compiling ppv-lite86 v0.2.172264pg_graphql-1.4.2>    Compiling sptr v0.3.22265pg_graphql-1.4.2>    Compiling half v1.8.22266pg_graphql-1.4.2>    Compiling serde_cbor v0.11.22267pg_graphql-1.2.2>    Compiling pg_graphql v1.2.2 (/build/source)2268pg_graphql-1.2.3>    Compiling pg_graphql v1.2.3 (/build/source)2269pg_graphql-1.4.1>    Compiling pg_graphql v1.4.1 (/build/source)2270pg_graphql-1.4.2>    Compiling rand_chacha v0.3.12271pg_graphql-1.4.2>    Compiling combine v3.8.12272pg_graphql-1.4.2>    Compiling cached_proc_macro v0.12.02273pg_graphql-1.4.2>    Compiling bitvec v1.0.12274pg_graphql-1.4.2>    Compiling enum-map v2.6.32275pg_graphql-1.4.2>    Compiling futures v0.3.282276pg_graphql-1.4.2>    Compiling uuid v1.4.12277pg_graphql-1.4.2>    Compiling hashbrown v0.12.32278pg_graphql-1.4.2>    Compiling async_once v0.2.62279pg_graphql-1.4.2>    Compiling seahash v4.1.02280pg_graphql-1.4.2>    Compiling seq-macro v0.3.42281pg_graphql-1.4.2>    Compiling cached v0.34.12282pg_graphql-1.4.2>    Compiling pgrx v0.10.22283pg_graphql-1.4.2>    Compiling graphql-parser v0.4.02284pg_graphql-1.4.2>    Compiling rand v0.8.52285pg_graphql-1.4.2>    Compiling itertools v0.10.52286pg_graphql-1.4.2>    Compiling bimap v0.6.32287pg_graphql-1.4.2>    Compiling base64 v0.13.12288pg_graphql-1.2.2>     Finished release [optimized] target(s) in 11m 44s2289pg_graphql-1.2.2>   Installing extension2290pg_graphql-1.2.2>      Copying control file to /nix/store/12y5si10h4pgpckr0hrvc2f4gkcnpvvl-pg_graphql-1.2.2/nix/store/bc9327c6474vwmqmhkszkmiz86mba73s-postgresql-15.19/share/postgresql/extension/pg_graphql.control2291pg_graphql-1.2.2>      Copying shared library to /nix/store/12y5si10h4pgpckr0hrvc2f4gkcnpvvl-pg_graphql-1.2.2/nix/store/bs8w2qsyhnqirvhchz9fnvf86y7j6xyf-postgresql-15.19-lib/lib/pg_graphql.so2292pg_graphql-1.2.2>  Discovering SQL entities2293pg_graphql-1.2.3>     Finished release [optimized] target(s) in 11m 52s2294pg_graphql-1.2.3>   Installing extension2295pg_graphql-1.2.3>      Copying control file to /nix/store/v5mrbs8waccnj7rq033kfgg35309pp8l-pg_graphql-1.2.3/nix/store/bc9327c6474vwmqmhkszkmiz86mba73s-postgresql-15.19/share/postgresql/extension/pg_graphql.control2296pg_graphql-1.2.3>      Copying shared library to /nix/store/v5mrbs8waccnj7rq033kfgg35309pp8l-pg_graphql-1.2.3/nix/store/bs8w2qsyhnqirvhchz9fnvf86y7j6xyf-postgresql-15.19-lib/lib/pg_graphql.so2297pg_graphql-1.2.3>  Discovering SQL entities2298pg_graphql-1.2.2>   Discovered 5 SQL entities: 0 schemas (0 unique), 1 functions, 0 types, 0 enums, 4 sqls, 0 ords, 0 hashes, 0 aggregates, 0 triggers2299pg_graphql-1.2.2>      Writing SQL entities to /nix/store/12y5si10h4pgpckr0hrvc2f4gkcnpvvl-pg_graphql-1.2.2/nix/store/bc9327c6474vwmqmhkszkmiz86mba73s-postgresql-15.19/share/postgresql/extension/pg_graphql--1.2.2.sql2300pg_graphql-1.2.2>     Finished installing pg_graphql2301pg_graphql-1.2.2> buildPhase completed in 12 minutes 3 seconds2302pg_graphql-1.2.2> Running phase: checkPhase2303pg_graphql-1.2.2>    Validating /nix/store/bc9327c6474vwmqmhkszkmiz86mba73s-postgresql-15.19/bin/pg_config2304pg_graphql-1.2.2>  Initializing data directory at /build/tmp.QzA8AvzRh4/data-152305pg_graphql-1.2.2> waiting for server to start....2026-10-27 12:36:26.886 GMT [3979] LOG:  starting PostgreSQL 15.19 on aarch64-unknown-linux-gnu, compiled by gcc (GCC) 15.3.0, 64-bit2306pg_graphql-1.2.2> 2026-10-27 12:36:26.888 GMT [3979] LOG:  listening on Unix socket "/build/tmp.NdBea2N97r/.s.PGSQL.5432"2307pg_graphql-1.2.2> 2026-10-27 12:36:26.896 GMT [3982] LOG:  database system was shut down at 2026-10-27 12:36:26 GMT2308pg_graphql-1.2.2> 2026-10-27 12:36:26.902 GMT [3979] LOG:  database system is ready to accept connections2309pg_graphql-1.2.2>  done2310pg_graphql-1.2.2> server started2311pg_graphql-1.2.2> createuser: error: connection to server at "localhost" (127.0.0.1), port 5432 failed: Connection refused2312pg_graphql-1.2.2> 	Is the server running on that host and accepting TCP/IP connections?2313pg_graphql-1.2.2> waiting for server to shut down....2026-10-27 12:36:26.972 GMT [3979] LOG:  received fast shutdown request2314pg_graphql-1.2.2> 2026-10-27 12:36:26.973 GMT [3979] LOG:  aborting any active transactions2315pg_graphql-1.2.2> 2026-10-27 12:36:26.976 GMT [3979] LOG:  background worker "logical replication launcher" (PID 3985) exited with exit code 12316pg_graphql-1.2.2> 2026-10-27 12:36:26.976 GMT [3980] LOG:  shutting down2317pg_graphql-1.2.2> 2026-10-27 12:36:26.978 GMT [3980] LOG:  checkpoint starting: shutdown immediate2318pg_graphql-1.2.2> 2026-10-27 12:36:26.991 GMT [3980] LOG:  checkpoint complete: wrote 3 buffers (0.0%); 0 WAL file(s) added, 0 removed, 0 recycled; write=0.004 s, sync=0.002 s, total=0.015 s; sync files=2, longest=0.001 s, average=0.001 s; distance=0 kB, estimate=0 kB2319pg_graphql-1.2.2> 2026-10-27 12:36:26.996 GMT [3979] LOG:  database system is shut down2320pg_graphql-1.2.2>  done2321pg_graphql-1.2.2> server stopped2322pg_graphql-1.2.2>    Validating /build/tmp.ue7frPwf8v/15/bin/pg_config2323pg_graphql-1.2.2>  Initializing data directory at /build/tmp.ue7frPwf8v/data-152324pg_graphql-1.2.2>        Using PgConfig("pg15") and `pg_config` from /build/tmp.ue7frPwf8v/15/bin/pg_config2325pg_graphql-1.2.2>     Building extension with features pg152326pg_graphql-1.2.2>      Running command "/nix/store/y779g007dd48i3q1la2xk16y4fa85c1x-rust-default-1.70.0/bin/cargo" "build" "--release" "--features" "pg15" "--no-default-features" "--message-format=json-render-diagnostics" "--frozen" "-j" "2"2327pg_graphql-1.2.2>     Finished release [optimized] target(s) in 0.11s2328pg_graphql-1.2.2>   Installing extension2329pg_graphql-1.2.2>      Copying control file to /build/tmp.ue7frPwf8v/15/share/postgresql/extension/pg_graphql.control2330pg_graphql-1.2.2>      Copying shared library to /build/tmp.ue7frPwf8v/15/lib/pg_graphql.so2331pg_graphql-1.2.2>  Discovering SQL entities2332pg_graphql-1.2.3>   Discovered 5 SQL entities: 0 schemas (0 unique), 1 functions, 0 types, 0 enums, 4 sqls, 0 ords, 0 hashes, 0 aggregates, 0 triggers2333pg_graphql-1.2.3>      Writing SQL entities to /nix/store/v5mrbs8waccnj7rq033kfgg35309pp8l-pg_graphql-1.2.3/nix/store/bc9327c6474vwmqmhkszkmiz86mba73s-postgresql-15.19/share/postgresql/extension/pg_graphql--1.2.3.sql2334pg_graphql-1.2.3>     Finished installing pg_graphql2335pg_graphql-1.2.3> buildPhase completed in 12 minutes 11 seconds2336pg_graphql-1.2.3> Running phase: checkPhase2337pg_graphql-1.2.3>    Validating /nix/store/bc9327c6474vwmqmhkszkmiz86mba73s-postgresql-15.19/bin/pg_config2338pg_graphql-1.2.3>  Initializing data directory at /build/tmp.Yspgn15Agd/data-152339pg_graphql-1.2.3> waiting for server to start....2026-10-27 12:36:41.005 GMT [3947] LOG:  starting PostgreSQL 15.19 on aarch64-unknown-linux-gnu, compiled by gcc (GCC) 15.3.0, 64-bit2340pg_graphql-1.2.3> 2026-10-27 12:36:41.007 GMT [3947] LOG:  listening on Unix socket "/build/tmp.EBqt9xzxNy/.s.PGSQL.5432"2341pg_graphql-1.2.3> 2026-10-27 12:36:41.014 GMT [3950] LOG:  database system was shut down at 2026-10-27 12:36:40 GMT2342pg_graphql-1.2.3> 2026-10-27 12:36:41.020 GMT [3947] LOG:  database system is ready to accept connections2343pg_graphql-1.2.3>  done2344pg_graphql-1.2.3> server started2345pg_graphql-1.2.3> createuser: error: connection to server at "localhost" (127.0.0.1), port 5432 failed: Connection refused2346pg_graphql-1.2.3> 	Is the server running on that host and accepting TCP/IP connections?2347pg_graphql-1.2.3> waiting for server to shut down....2026-10-27 12:36:41.083 GMT [3947] LOG:  received fast shutdown request2348pg_graphql-1.2.3> 2026-10-27 12:36:41.085 GMT [3947] LOG:  aborting any active transactions2349pg_graphql-1.2.3> 2026-10-27 12:36:41.087 GMT [3947] LOG:  background worker "logical replication launcher" (PID 3953) exited with exit code 12350pg_graphql-1.2.3> 2026-10-27 12:36:41.089 GMT [3948] LOG:  shutting down2351pg_graphql-1.2.3> 2026-10-27 12:36:41.091 GMT [3948] LOG:  checkpoint starting: shutdown immediate2352pg_graphql-1.2.3> 2026-10-27 12:36:41.107 GMT [3948] LOG:  checkpoint complete: wrote 3 buffers (0.0%); 0 WAL file(s) added, 0 removed, 0 recycled; write=0.005 s, sync=0.002 s, total=0.019 s; sync files=2, longest=0.001 s, average=0.001 s; distance=0 kB, estimate=0 kB2353pg_graphql-1.2.3> 2026-10-27 12:36:41.113 GMT [3947] LOG:  database system is shut down2354pg_graphql-1.2.3>  done2355pg_graphql-1.2.3> server stopped2356pg_graphql-1.2.3>    Validating /build/tmp.3HB3CEUD6r/15/bin/pg_config2357pg_graphql-1.2.3>  Initializing data directory at /build/tmp.3HB3CEUD6r/data-152358pg_graphql-1.2.3>        Using PgConfig("pg15") and `pg_config` from /build/tmp.3HB3CEUD6r/15/bin/pg_config2359pg_graphql-1.2.3>     Building extension with features pg152360pg_graphql-1.2.3>      Running command "/nix/store/y779g007dd48i3q1la2xk16y4fa85c1x-rust-default-1.70.0/bin/cargo" "build" "--release" "--features" "pg15" "--no-default-features" "--message-format=json-render-diagnostics" "--frozen" "-j" "2"2361pg_graphql-1.2.3>     Finished release [optimized] target(s) in 0.11s2362pg_graphql-1.2.3>   Installing extension2363pg_graphql-1.2.3>      Copying control file to /build/tmp.3HB3CEUD6r/15/share/postgresql/extension/pg_graphql.control2364pg_graphql-1.2.3>      Copying shared library to /build/tmp.3HB3CEUD6r/15/lib/pg_graphql.so2365pg_graphql-1.2.3>  Discovering SQL entities2366pg_graphql-1.2.2>   Discovered 5 SQL entities: 0 schemas (0 unique), 1 functions, 0 types, 0 enums, 4 sqls, 0 ords, 0 hashes, 0 aggregates, 0 triggers2367pg_graphql-1.2.2>      Writing SQL entities to /build/tmp.ue7frPwf8v/15/share/postgresql/extension/pg_graphql--1.2.2.sql2368pg_graphql-1.2.2>     Finished installing pg_graphql2369pg_graphql-1.2.2> ++ mktemp -d2370pg_graphql-1.2.2> + TMPDIR=/build/tmp.piFBbYDSZ62371pg_graphql-1.2.2> + export PGDATA=/build/tmp.piFBbYDSZ62372pg_graphql-1.2.2> + PGDATA=/build/tmp.piFBbYDSZ62373pg_graphql-1.2.2> + export PGHOST=/build/tmp.piFBbYDSZ62374pg_graphql-1.2.2> + PGHOST=/build/tmp.piFBbYDSZ62375pg_graphql-1.2.2> + export PGUSER=postgres2376pg_graphql-1.2.2> + PGUSER=postgres2377pg_graphql-1.2.2> + export PGDATABASE=postgres2378pg_graphql-1.2.2> + PGDATABASE=postgres2379pg_graphql-1.2.2> + export PGTZ=UTC2380pg_graphql-1.2.2> + PGTZ=UTC2381pg_graphql-1.2.2> + export PG_COLOR=auto2382pg_graphql-1.2.2> + PG_COLOR=auto2383pg_graphql-1.2.2> + trap 'pg_ctl stop -m i' sigint sigterm exit2384pg_graphql-1.2.2> + rm -rf ''2385pg_graphql-1.2.2> + initdb --no-locale --encoding=UTF8 --nosync -U postgres2386pg_graphql-1.2.2> The files belonging to this database system will be owned by user "nixbld".2387pg_graphql-1.2.2> This user must also own the server process.2388pg_graphql-1.2.2> 2389pg_graphql-1.2.2> The database cluster will be initialized with locale "C".2390pg_graphql-1.2.2> The default text search configuration will be set to "english".2391pg_graphql-1.2.2> 2392pg_graphql-1.2.2> Data page checksums are disabled.2393pg_graphql-1.2.2> 2394pg_graphql-1.2.2> fixing permissions on existing directory /build/tmp.piFBbYDSZ6 ... ok2395pg_graphql-1.2.2> creating subdirectories ... ok2396pg_graphql-1.2.2> selecting dynamic shared memory implementation ... posix2397pg_graphql-1.2.2> selecting default max_connections ... 1002398pg_graphql-1.2.2> selecting default shared_buffers ... 128MB2399pg_graphql-1.2.2> selecting default time zone ... UTC2400pg_graphql-1.2.2> creating configuration files ... ok2401pg_graphql-1.2.2> running bootstrap script ... ok2402pg_graphql-1.2.2> performing post-bootstrap initialization ... ok2403pg_graphql-1.2.2> 2404pg_graphql-1.2.2> Sync to disk skipped.2405pg_graphql-1.2.2> The data directory might become corrupt if the operating system crashes.2406pg_graphql-1.2.2> 2407pg_graphql-1.2.2> initdb: warning: enabling "trust" authentication for local connections2408pg_graphql-1.2.2> initdb: hint: You can change this by editing pg_hba.conf or using the option -A, or --auth-local and --auth-host, the next time you run initdb.2409pg_graphql-1.2.2> 2410pg_graphql-1.2.2> Success. You can now start the database server using:2411pg_graphql-1.2.2> 2412pg_graphql-1.2.2>     /build/tmp.ue7frPwf8v/15/bin/pg_ctl -D /build/tmp.piFBbYDSZ6 -l logfile start2413pg_graphql-1.2.2> 2414pg_graphql-1.2.2> + pg_ctl start -o '-F -c listen_addresses="" -c log_min_messages=WARNING -k /build/tmp.piFBbYDSZ6'2415pg_graphql-1.2.2> waiting for server to start....2026-10-27 12:36:45.775 UTC [4086] LOG:  starting PostgreSQL 15.19 on aarch64-unknown-linux-gnu, compiled by gcc (GCC) 15.3.0, 64-bit2416pg_graphql-1.2.2> 2026-10-27 12:36:45.775 UTC [4086] LOG:  listening on Unix socket "/build/tmp.piFBbYDSZ6/.s.PGSQL.5432"2417pg_graphql-1.2.2> 2026-10-27 12:36:45.777 UTC [4089] LOG:  database system was shut down at 2026-10-27 12:36:45 UTC2418pg_graphql-1.2.2> 2026-10-27 12:36:45.781 UTC [4086] LOG:  database system is ready to accept connections2419pg_graphql-1.4.1>     Finished release [optimized] target(s) in 12m 10s2420pg_graphql-1.4.1>   Installing extension2421pg_graphql-1.4.1>      Copying control file to /nix/store/kpvimlqj9wn1024z8sqjzwx9k48mszfm-pg_graphql-1.4.1/nix/store/bc9327c6474vwmqmhkszkmiz86mba73s-postgresql-15.19/share/postgresql/extension/pg_graphql.control2422pg_graphql-1.2.2>  done2423pg_graphql-1.2.2> server started2424pg_graphql-1.2.2> + createdb contrib_regression2425pg_graphql-1.2.2> + TESTDIR=test2426pg_graphql-1.2.2> +++ pg_config --pgxs2427pg_graphql-1.2.2> ++ dirname /nix/store/bc9327c6474vwmqmhkszkmiz86mba73s-postgresql-15.19/lib/pgxs/src/makefiles/pgxs.mk2428pg_graphql-1.2.2> + PGXS=/nix/store/bc9327c6474vwmqmhkszkmiz86mba73s-postgresql-15.19/lib/pgxs/src/makefiles2429pg_graphql-1.2.2> + REGRESS=/nix/store/bc9327c6474vwmqmhkszkmiz86mba73s-postgresql-15.19/lib/pgxs/src/makefiles/../test/regress/pg_regress2430pg_graphql-1.2.2> ++ ls test/sql2431pg_graphql-1.2.2> ++ sort2432pg_graphql-1.2.2> ++ sed -e 's/\..*$//'2433pg_graphql-1.2.2> + TESTS=$'aliases\nallow_camel_names\nbigint_is_string\nbuiltin_directives\ncomment_directive\ncomment_directive_description\nempty_mutations\nextend_type_with_function\nextend_type_with_function_relation\nextend_type_with_generated_column\nfilter_by_node_id\nfragment_on_mutation\nfragment_on_query\ninflection_fields\ninflection_function\ninflection_relationships\ninflection_types\nissue_163\nissue_170\nissue_225\nissue_300\nissue_306\nissue_312\nissue_334_ambiguous_function\nissue_339_function_return_json\nissue_339_function_return_table\njson_is_stringified\nmax_page_size\nmax_rows_directive\nmulti_column_primary_key\nmultiple_mutations\nmultiple_queries\nmutation_delete\nmutation_delete_variable\nmutation_insert\nmutation_update\nnull_argument\nomit_exotic_types\nomit_weird_names\noperation_name\noverride_enum_name\noverride_field_name\noverride_func_field_name\noverride_relationship_field_name\noverride_type_name\npage_info\npermissions_connection_column\npermissions_node_column\npermissions_table_level\npermissions_types\nprimary_key_is_required\nrelationship_one_to_one\nresolve___schema\nresolve___type\nresolve___typename\nresolve_array_type\nresolve_connection_filter\nresolve_connection_named\nresolve_connection_order_by\nresolve_connection_pagination_args\nresolve_connection_to_conn\nresolve_connection_to_node\nresolve_error_connection_edge_no_field\nresolve_error_connection_edge_node_no_field\nresolve_error_connection_no_field\nresolve_error_from_parser\nresolve_error_mutation_no_field\nresolve_error_node_no_field\nresolve_error_query_no_field\nresolve_fragment\nresolve_graphiql_schema\nresolve_one\nroundtrip_types\nrow_level_security\nsqli_connection\nstring_filters\ntest_error_anon_and_named_operations\ntest_error_invalid_offset\ntest_error_multiple_anon_operations\ntest_error_mutation_transpilation\ntest_error_operation_name_not_found\ntest_error_operation_names_not_unique\ntest_error_parsing\ntest_error_query_transpilation\ntest_error_subscription\ntest_query__type\ntotal_count\ntype_bigfloat\ntype_modifier_max_length\ntype_opaque\nviews_integration'2434pg_graphql-1.2.2> + psql -v ON_ERROR_STOP=1 -f test/fixtures.sql -d contrib_regression2435pg_graphql-1.2.2> psql:test/fixtures.sql:1: NOTICE:  extension "pg_graphql" does not exist, skipping2436pg_graphql-1.2.2> DROP EXTENSION2437pg_graphql-1.2.2> CREATE EXTENSION2438pg_graphql-1.2.2> COMMENT2439pg_graphql-1.2.2> CREATE FUNCTION2440pg_graphql-1.2.2> + /nix/store/bc9327c6474vwmqmhkszkmiz86mba73s-postgresql-15.19/lib/pgxs/src/makefiles/../test/regress/pg_regress --use-existing --dbname=contrib_regression --inputdir=test aliases allow_camel_names bigint_is_string builtin_directives comment_directive comment_directive_description empty_mutations extend_type_with_function extend_type_with_function_relation extend_type_with_generated_column filter_by_node_id fragment_on_mutation fragment_on_query inflection_fields inflection_function inflection_relationships inflection_types issue_163 issue_170 issue_225 issue_300 issue_306 issue_312 issue_334_ambiguous_function issue_339_function_return_json issue_339_function_return_table json_is_stringified max_page_size max_rows_directive multi_column_primary_key multiple_mutations multiple_queries mutation_delete mutation_delete_variable mutation_insert mutation_update null_argument omit_exotic_types omit_weird_names operation_name override_enum_name override_field_name override_func_field_name override_relationship_field_name override_type_name page_info permissions_connection_column permissions_node_column permissions_table_level permissions_types primary_key_is_required relationship_one_to_one resolve___schema resolve___type resolve___typename resolve_array_type resolve_connection_filter resolve_connection_named resolve_connection_order_by resolve_connection_pagination_args resolve_connection_to_conn resolve_connection_to_node resolve_error_connection_edge_no_field resolve_error_connection_edge_node_no_field resolve_error_connection_no_field resolve_error_from_parser resolve_error_mutation_no_field resolve_error_node_no_field resolve_error_query_no_field resolve_fragment resolve_graphiql_schema resolve_one roundtrip_types row_level_security sqli_connection string_filters test_error_anon_and_named_operations test_error_invalid_offset test_error_multiple_anon_operations test_error_mutation_transpilation test_error_operation_name_not_found test_error_operation_names_not_unique test_error_parsing test_error_query_transpilation test_error_subscription test_query__type total_count type_bigfloat type_modifier_max_length type_opaque views_integration2441pg_graphql-1.2.2> (using postmaster on /build/tmp.piFBbYDSZ6, default port)2442pg_graphql-1.2.2> ============== running regression test queries        ==============2443pg_graphql-1.4.1>      Copying shared library to /nix/store/kpvimlqj9wn1024z8sqjzwx9k48mszfm-pg_graphql-1.4.1/nix/store/bs8w2qsyhnqirvhchz9fnvf86y7j6xyf-postgresql-15.19-lib/lib/pg_graphql.so2444pg_graphql-1.4.1>  Discovering SQL entities2445pg_graphql-1.2.2> test aliases                      ... ok           71 ms2446pg_graphql-1.2.2> test allow_camel_names            ... ok           67 ms2447pg_graphql-1.2.2> test bigint_is_string             ... ok           63 ms2448pg_graphql-1.2.2> test builtin_directives           ... ok           70 ms2449pg_graphql-1.2.2> test comment_directive            ... ok            9 ms2450pg_graphql-1.2.2> test comment_directive_description ... ok           59 ms2451pg_graphql-1.2.2> test empty_mutations              ... ok           59 ms2452pg_graphql-1.2.2> test extend_type_with_function    ... ok           62 ms2453pg_graphql-1.2.2> test extend_type_with_function_relation ... ok          183 ms2454pg_graphql-1.2.2> test extend_type_with_generated_column ... ok           61 ms2455pg_graphql-1.2.2> test filter_by_node_id            ... ok           67 ms2456pg_graphql-1.2.2> test fragment_on_mutation         ... ok           59 ms2457pg_graphql-1.2.2> test fragment_on_query            ... ok           60 ms2458pg_graphql-1.2.2> test inflection_fields            ... ok          164 ms2459pg_graphql-1.2.2> test inflection_function          ... ok          167 ms2460pg_graphql-1.2.2> test inflection_relationships     ... ok          247 ms2461pg_graphql-1.2.2> test inflection_types             ... ok          178 ms2462pg_graphql-1.2.2> test issue_163                    ... ok           60 ms2463pg_graphql-1.2.2> test issue_170                    ... ok           60 ms2464pg_graphql-1.2.2> test issue_225                    ... ok           63 ms2465pg_graphql-1.2.2> test issue_300                    ... ok           62 ms2466pg_graphql-1.2.2> test issue_306                    ... ok           66 ms2467pg_graphql-1.2.2> test issue_312                    ... ok           68 ms2468pg_graphql-1.2.2> test issue_334_ambiguous_function ... ok           63 ms2469pg_graphql-1.2.2> test issue_339_function_return_json ... ok           63 ms2470pg_graphql-1.2.2> test issue_339_function_return_table ... ok           65 ms2471pg_graphql-1.2.2> test json_is_stringified          ... ok           64 ms2472pg_graphql-1.2.2> test max_page_size                ... ok           59 ms2473pg_graphql-1.2.2> test max_rows_directive           ... ok          131 ms2474pg_graphql-1.2.2> test multi_column_primary_key     ... ok           83 ms2475pg_graphql-1.2.2> test multiple_mutations           ... ok           67 ms2476pg_graphql-1.2.2> test multiple_queries             ... ok           60 ms2477pg_graphql-1.2.2> test mutation_delete              ... ok           71 ms2478pg_graphql-1.2.2> test mutation_delete_variable     ... ok           61 ms2479pg_graphql-1.2.2> test mutation_insert              ... ok           71 ms2480pg_graphql-1.2.2> test mutation_update              ... ok           79 ms2481pg_graphql-1.2.2> test null_argument                ... ok           59 ms2482pg_graphql-1.2.2> test omit_exotic_types            ... ok           63 ms2483pg_graphql-1.2.2> test omit_weird_names             ... ok           99 ms2484pg_graphql-1.2.2> test operation_name               ... ok           61 ms2485pg_graphql-1.2.2> test override_enum_name           ... ok           54 ms2486pg_graphql-1.2.2> test override_field_name          ... ok           58 ms2487pg_graphql-1.2.2> test override_func_field_name     ... ok           60 ms2488pg_graphql-1.2.2> test override_relationship_field_name ... ok           78 ms2489pg_graphql-1.2.2> test override_type_name           ... ok           63 ms2490pg_graphql-1.2.2> test page_info                    ... ok          100 ms2491pg_graphql-1.2.2> test permissions_connection_column ... ok          100 ms2492pg_graphql-1.2.2> test permissions_node_column      ... ok          103 ms2493pg_graphql-1.2.2> test permissions_table_level      ... ok          208 ms2494pg_graphql-1.2.2> test permissions_types            ... ok          132 ms2495pg_graphql-1.2.2> test primary_key_is_required      ... ok          114 ms2496pg_graphql-1.2.2> test relationship_one_to_one      ... ok           70 ms2497pg_graphql-1.2.2> test resolve___schema             ... ok           83 ms2498pg_graphql-1.2.2> test resolve___type               ... ok           69 ms2499pg_graphql-1.2.2> test resolve___typename           ... ok           63 ms2500pg_graphql-1.2.2> test resolve_array_type           ... ok           72 ms2501pg_graphql-1.2.2> test resolve_connection_filter    ... ok          106 ms2502pg_graphql-1.2.2> test resolve_connection_named     ... ok           59 ms2503pg_graphql-1.2.2> test resolve_connection_order_by  ... ok           88 ms2504pg_graphql-1.2.2> test resolve_connection_pagination_args ... ok          117 ms2505pg_graphql-1.2.2> test resolve_connection_to_conn   ... ok           67 ms2506pg_graphql-1.2.2> test resolve_connection_to_node   ... ok           71 ms2507pg_graphql-1.2.2> test resolve_error_connection_edge_no_field ... ok           60 ms2508pg_graphql-1.2.2> test resolve_error_connection_edge_node_no_field ... ok           58 ms2509pg_graphql-1.2.2> test resolve_error_connection_no_field ... ok           61 ms2510pg_graphql-1.2.2> test resolve_error_from_parser    ... ok           11 ms2511pg_graphql-1.2.2> test resolve_error_mutation_no_field ... ok           57 ms2512pg_graphql-1.2.2> test resolve_error_node_no_field  ... ok           60 ms2513pg_graphql-1.2.2> test resolve_error_query_no_field ... ok           54 ms2514pg_graphql-1.2.2> test resolve_fragment             ... ok           62 ms2515pg_graphql-1.2.2> test resolve_graphiql_schema      ... ok          104 ms2516pg_graphql-1.2.2> test resolve_one                  ... ok          110 ms2517pg_graphql-1.2.2> test roundtrip_types              ... ok           73 ms2518pg_graphql-1.2.2> test row_level_security           ... ok           61 ms2519pg_graphql-1.2.2> test sqli_connection              ... ok           69 ms2520pg_graphql-1.2.2> test string_filters               ... ok           69 ms2521pg_graphql-1.2.2> test test_error_anon_and_named_operations ... ok           53 ms2522pg_graphql-1.2.2> test test_error_invalid_offset    ... ok           95 ms2523pg_graphql-1.2.2> test test_error_multiple_anon_operations ... ok           64 ms2524pg_graphql-1.2.2> test test_error_mutation_transpilation ... ok           60 ms2525pg_graphql-1.2.2> test test_error_operation_name_not_found ... ok           53 ms2526pg_graphql-1.2.2> test test_error_operation_names_not_unique ... ok           53 ms2527pg_graphql-1.2.2> test test_error_parsing           ... ok           11 ms2528pg_graphql-1.2.2> test test_error_query_transpilation ... ok           62 ms2529pg_graphql-1.2.2> test test_error_subscription      ... ok           54 ms2530pg_graphql-1.2.2> test test_query__type             ... ok           54 ms2531pg_graphql-1.2.2> test total_count                  ... ok           96 ms2532pg_graphql-1.2.2> test type_bigfloat                ... ok           65 ms2533pg_graphql-1.2.2> test type_modifier_max_length     ... ok           62 ms2534pg_graphql-1.2.2> test type_opaque                  ... ok           85 ms2535pg_graphql-1.2.2> test views_integration            ... ok          227 ms2536pg_graphql-1.2.2> 2537pg_graphql-1.2.2> ======================2538pg_graphql-1.2.2>  All 91 tests passed. 2539pg_graphql-1.2.2> ======================2540pg_graphql-1.2.2> 2541pg_graphql-1.2.2> + pg_ctl stop -m i2542pg_graphql-1.2.2> 2026-10-27 12:36:53.294 UTC [4086] LOG:  received immediate shutdown request2543pg_graphql-1.2.2> waiting for server to shut down....2026-10-27 12:36:53.302 UTC [4086] LOG:  database system is shut down2544pg_graphql-1.2.2>  done2545pg_graphql-1.2.2> server stopped2546pg_graphql-1.2.2> Running phase: installPhase2547pg_graphql-1.2.2> Executing buildPgrxExtension install2548pg_graphql-1.2.2> Running phase: fixupPhase2549pg_graphql-1.2.2> shrinking RPATHs of ELF executables and libraries in /nix/store/12y5si10h4pgpckr0hrvc2f4gkcnpvvl-pg_graphql-1.2.22550pg_graphql-1.2.2> shrinking /nix/store/12y5si10h4pgpckr0hrvc2f4gkcnpvvl-pg_graphql-1.2.2/lib/pg_graphql-1.2.2.so2551pg_graphql-1.2.2> checking for references to /build/ in /nix/store/12y5si10h4pgpckr0hrvc2f4gkcnpvvl-pg_graphql-1.2.2...2552pg_graphql-1.2.2> patching script interpreter paths in /nix/store/12y5si10h4pgpckr0hrvc2f4gkcnpvvl-pg_graphql-1.2.22553pg_graphql-1.2.2> stripping (with command strip and flags -S -p) in  /nix/store/12y5si10h4pgpckr0hrvc2f4gkcnpvvl-pg_graphql-1.2.2/lib2554pg_graphql-1.2.3>   Discovered 5 SQL entities: 0 schemas (0 unique), 1 functions, 0 types, 0 enums, 4 sqls, 0 ords, 0 hashes, 0 aggregates, 0 triggers2555pg_graphql-1.2.3>      Writing SQL entities to /build/tmp.3HB3CEUD6r/15/share/postgresql/extension/pg_graphql--1.2.3.sql2556pg_graphql-1.2.3>     Finished installing pg_graphql2557pg_graphql-1.2.3> ++ mktemp -d2558pg_graphql-1.2.3> + TMPDIR=/build/tmp.owWhg9qnrT2559pg_graphql-1.2.3> + export PGDATA=/build/tmp.owWhg9qnrT2560pg_graphql-1.2.3> + PGDATA=/build/tmp.owWhg9qnrT2561pg_graphql-1.2.3> + export PGHOST=/build/tmp.owWhg9qnrT2562pg_graphql-1.2.3> + PGHOST=/build/tmp.owWhg9qnrT2563pg_graphql-1.2.3> + export PGUSER=postgres2564pg_graphql-1.2.3> + PGUSER=postgres2565pg_graphql-1.2.3> + export PGDATABASE=postgres2566pg_graphql-1.2.3> + PGDATABASE=postgres2567pg_graphql-1.2.3> + export PGTZ=UTC2568pg_graphql-1.2.3> + PGTZ=UTC2569pg_graphql-1.2.3> + export PG_COLOR=auto2570pg_graphql-1.2.3> + PG_COLOR=auto2571pg_graphql-1.2.3> + trap 'pg_ctl stop -m i' sigint sigterm exit2572pg_graphql-1.2.3> + rm -rf ''2573pg_graphql-1.2.3> + initdb --no-locale --encoding=UTF8 --nosync -U postgres2574pg_graphql-1.2.3> The files belonging to this database system will be owned by user "nixbld".2575pg_graphql-1.2.3> This user must also own the server process.2576pg_graphql-1.2.3> 2577pg_graphql-1.2.3> The database cluster will be initialized with locale "C".2578pg_graphql-1.2.3> The default text search configuration will be set to "english".2579pg_graphql-1.2.3> 2580pg_graphql-1.2.3> Data page checksums are disabled.2581pg_graphql-1.2.3> 2582pg_graphql-1.2.3> fixing permissions on existing directory /build/tmp.owWhg9qnrT ... ok2583pg_graphql-1.2.3> creating subdirectories ... ok2584pg_graphql-1.2.3> selecting dynamic shared memory implementation ... posix2585pg_graphql-1.2.3> selecting default max_connections ... 1002586pg_graphql-1.2.3> selecting default shared_buffers ... 128MB2587pg_graphql-1.2.3> selecting default time zone ... UTC2588pg_graphql-1.2.3> creating configuration files ... ok2589pg_graphql-1.2.3> running bootstrap script ... ok2590pg_graphql-1.2.3> performing post-bootstrap initialization ... ok2591pg_graphql-1.2.3> 2592pg_graphql-1.2.3> Sync to disk skipped.2593pg_graphql-1.2.3> The data directory might become corrupt if the operating system crashes.2594pg_graphql-1.2.3> 2595pg_graphql-1.2.3> initdb: warning: enabling "trust" authentication for local connections2596pg_graphql-1.2.3> initdb: hint: You can change this by editing pg_hba.conf or using the option -A, or --auth-local and --auth-host, the next time you run initdb.2597pg_graphql-1.2.3> 2598pg_graphql-1.2.3> Success. You can now start the database server using:2599pg_graphql-1.2.3> 2600pg_graphql-1.2.3>     /build/tmp.3HB3CEUD6r/15/bin/pg_ctl -D /build/tmp.owWhg9qnrT -l logfile start2601pg_graphql-1.2.3> 2602pg_graphql-1.2.3> + pg_ctl start -o '-F -c listen_addresses="" -c log_min_messages=WARNING -k /build/tmp.owWhg9qnrT'2603pg_graphql-1.2.3> waiting for server to start....2026-10-27 12:36:59.735 UTC [4054] LOG:  starting PostgreSQL 15.19 on aarch64-unknown-linux-gnu, compiled by gcc (GCC) 15.3.0, 64-bit2604pg_graphql-1.2.3> 2026-10-27 12:36:59.735 UTC [4054] LOG:  listening on Unix socket "/build/tmp.owWhg9qnrT/.s.PGSQL.5432"2605pg_graphql-1.2.3> 2026-10-27 12:36:59.737 UTC [4057] LOG:  database system was shut down at 2026-10-27 12:36:59 UTC2606pg_graphql-1.2.3> 2026-10-27 12:36:59.742 UTC [4054] LOG:  database system is ready to accept connections2607pg_graphql-1.2.3>  done2608pg_graphql-1.2.3> server started2609pg_graphql-1.2.3> + createdb contrib_regression2610pg_graphql-1.2.3> + TESTDIR=test2611pg_graphql-1.2.3> +++ pg_config --pgxs2612pg_graphql-1.2.3> ++ dirname /nix/store/bc9327c6474vwmqmhkszkmiz86mba73s-postgresql-15.19/lib/pgxs/src/makefiles/pgxs.mk2613pg_graphql-1.2.3> + PGXS=/nix/store/bc9327c6474vwmqmhkszkmiz86mba73s-postgresql-15.19/lib/pgxs/src/makefiles2614pg_graphql-1.2.3> + REGRESS=/nix/store/bc9327c6474vwmqmhkszkmiz86mba73s-postgresql-15.19/lib/pgxs/src/makefiles/../test/regress/pg_regress2615pg_graphql-1.2.3> ++ ls test/sql2616pg_graphql-1.2.3> ++ sed -e 's/\..*$//'2617pg_graphql-1.2.3> ++ sort2618pg_graphql-1.2.3> + TESTS=$'aliases\nallow_camel_names\nbigint_is_string\nbuiltin_directives\ncomment_directive\ncomment_directive_description\nempty_mutations\nextend_type_with_function\nextend_type_with_function_relation\nextend_type_with_generated_column\nfilter_by_node_id\nfragment_on_mutation\nfragment_on_query\ninflection_fields\ninflection_function\ninflection_relationships\ninflection_types\nissue_163\nissue_170\nissue_225\nissue_300\nissue_306\nissue_312\nissue_334_ambiguous_function\nissue_339_function_return_json\nissue_339_function_return_table\nissue_373\nissue_377_enum_search_path\njson_is_stringified\nmax_page_size\nmax_rows_directive\nmulti_column_primary_key\nmultiple_mutations\nmultiple_queries\nmutation_delete\nmutation_delete_variable\nmutation_insert\nmutation_update\nnull_argument\nomit_exotic_types\nomit_weird_names\noperation_name\noverride_enum_name\noverride_field_name\noverride_func_field_name\noverride_relationship_field_name\noverride_type_name\npage_info\npermissions_connection_column\npermissions_node_column\npermissions_table_level\npermissions_types\nprimary_key_is_required\nrelationship_one_to_one\nresolve___schema\nresolve___type\nresolve___typename\nresolve_array_type\nresolve_connection_filter\nresolve_connection_named\nresolve_connection_order_by\nresolve_connection_pagination_args\nresolve_connection_to_conn\nresolve_connection_to_node\nresolve_error_connection_edge_no_field\nresolve_error_connection_edge_node_no_field\nresolve_error_connection_no_field\nresolve_error_from_parser\nresolve_error_mutation_no_field\nresolve_error_node_no_field\nresolve_error_query_no_field\nresolve_fragment\nresolve_graphiql_schema\nresolve_one\nroundtrip_types\nrow_level_security\nsqli_connection\nstring_filters\ntest_error_anon_and_named_operations\ntest_error_invalid_offset\ntest_error_multiple_anon_operations\ntest_error_mutation_transpilation\ntest_error_operation_name_not_found\ntest_error_operation_names_not_unique\ntest_error_parsing\ntest_error_query_transpilation\ntest_error_subscription\ntest_query__type\ntotal_count\ntype_bigfloat\ntype_modifier_max_length\ntype_opaque\nviews_integration'2619pg_graphql-1.2.3> + psql -v ON_ERROR_STOP=1 -f test/fixtures.sql -d contrib_regression2620pg_graphql-1.2.3> psql:test/fixtures.sql:1: NOTICE:  extension "pg_graphql" does not exist, skipping2621pg_graphql-1.2.3> DROP EXTENSION2622pg_graphql-1.2.3> CREATE EXTENSION2623pg_graphql-1.2.3> COMMENT2624pg_graphql-1.2.3> CREATE FUNCTION2625pg_graphql-1.2.3> + /nix/store/bc9327c6474vwmqmhkszkmiz86mba73s-postgresql-15.19/lib/pgxs/src/makefiles/../test/regress/pg_regress --use-existing --dbname=contrib_regression --inputdir=test aliases allow_camel_names bigint_is_string builtin_directives comment_directive comment_directive_description empty_mutations extend_type_with_function extend_type_with_function_relation extend_type_with_generated_column filter_by_node_id fragment_on_mutation fragment_on_query inflection_fields inflection_function inflection_relationships inflection_types issue_163 issue_170 issue_225 issue_300 issue_306 issue_312 issue_334_ambiguous_function issue_339_function_return_json issue_339_function_return_table issue_373 issue_377_enum_search_path json_is_stringified max_page_size max_rows_directive multi_column_primary_key multiple_mutations multiple_queries mutation_delete mutation_delete_variable mutation_insert mutation_update null_argument omit_exotic_types omit_weird_names operation_name override_enum_name override_field_name override_func_field_name override_relationship_field_name override_type_name page_info permissions_connection_column permissions_node_column permissions_table_level permissions_types primary_key_is_required relationship_one_to_one resolve___schema resolve___type resolve___typename resolve_array_type resolve_connection_filter resolve_connection_named resolve_connection_order_by resolve_connection_pagination_args resolve_connection_to_conn resolve_connection_to_node resolve_error_connection_edge_no_field resolve_error_connection_edge_node_no_field resolve_error_connection_no_field resolve_error_from_parser resolve_error_mutation_no_field resolve_error_node_no_field resolve_error_query_no_field resolve_fragment resolve_graphiql_schema resolve_one roundtrip_types row_level_security sqli_connection string_filters test_error_anon_and_named_operations test_error_invalid_offset test_error_multiple_anon_operations test_error_mutation_transpilation test_error_operation_name_not_found test_error_operation_names_not_unique test_error_parsing test_error_query_transpilation test_error_subscription test_query__type total_count type_bigfloat type_modifier_max_length type_opaque views_integration2626pg_graphql-1.2.3> (using postmaster on /build/tmp.owWhg9qnrT, default port)2627pg_graphql-1.2.3> ============== running regression test queries        ==============2628pg_graphql-1.2.3> test aliases                      ... ok           73 ms2629pg_graphql-1.2.3> test allow_camel_names            ... ok           70 ms2630pg_graphql-1.2.3> test bigint_is_string             ... ok           66 ms2631pg_graphql-1.2.3> test builtin_directives           ... ok           74 ms2632pg_graphql-1.2.3> test comment_directive            ... ok           10 ms2633pg_graphql-1.2.3> test comment_directive_description ... ok           61 ms2634pg_graphql-1.2.3> test empty_mutations              ... ok           63 ms2635pg_graphql-1.2.3> test extend_type_with_function    ... ok           63 ms2636pg_graphql-1.2.3> test extend_type_with_function_relation ... ok          186 ms2637pg_graphql-1.2.3> test extend_type_with_generated_column ... ok           61 ms2638pg_graphql-1.2.3> test filter_by_node_id            ... ok           66 ms2639pg_graphql-1.2.3> test fragment_on_mutation         ... ok           59 ms2640pg_graphql-1.2.3> test fragment_on_query            ... ok           60 ms2641pg_graphql-1.2.3> test inflection_fields            ... ok          165 ms2642pg_graphql-1.2.3> test inflection_function          ... ok          165 ms2643pg_graphql-1.2.3> test inflection_relationships     ... ok          256 ms2644pg_graphql-1.2.3> test inflection_types             ... ok          169 ms2645pg_graphql-1.2.3> test issue_163                    ... ok           60 ms2646pg_graphql-1.2.3> test issue_170                    ... ok           62 ms2647pg_graphql-1.2.3> test issue_225                    ... ok           63 ms2648pg_graphql-1.2.3> test issue_300                    ... ok           62 ms2649pg_graphql-1.2.3> test issue_306                    ... ok           66 ms2650pg_graphql-1.2.3> test issue_312                    ... ok           61 ms2651pg_graphql-1.2.3> test issue_334_ambiguous_function ... ok           63 ms2652pg_graphql-1.2.3> test issue_339_function_return_json ... ok           61 ms2653pg_graphql-1.2.3> test issue_339_function_return_table ... ok           61 ms2654pg_graphql-1.2.3> test issue_373                    ... ok           64 ms2655pg_graphql-1.2.3> test issue_377_enum_search_path   ... ok          101 ms2656pg_graphql-1.2.3> test json_is_stringified          ... ok           68 ms2657pg_graphql-1.4.1>   Discovered 5 SQL entities: 0 schemas (0 unique), 1 functions, 0 types, 0 enums, 4 sqls, 0 ords, 0 hashes, 0 aggregates, 0 triggers2658pg_graphql-1.4.1>      Writing SQL entities to /nix/store/kpvimlqj9wn1024z8sqjzwx9k48mszfm-pg_graphql-1.4.1/nix/store/bc9327c6474vwmqmhkszkmiz86mba73s-postgresql-15.19/share/postgresql/extension/pg_graphql--1.4.1.sql2659pg_graphql-1.4.1>     Finished installing pg_graphql2660pg_graphql-1.4.1> buildPhase completed in 12 minutes 29 seconds2661pg_graphql-1.4.1> Running phase: checkPhase2662pg_graphql-1.4.1>    Validating /nix/store/bc9327c6474vwmqmhkszkmiz86mba73s-postgresql-15.19/bin/pg_config2663pg_graphql-1.4.1>  Initializing data directory at /build/tmp.yZHB82usFU/data-152664pg_graphql-1.2.3> test max_page_size                ... ok           62 ms2665pg_graphql-1.2.3> test max_rows_directive           ... ok          136 ms2666pg_graphql-1.2.3> test multi_column_primary_key     ... ok           74 ms2667pg_graphql-1.2.3> test multiple_mutations           ... ok           65 ms2668pg_graphql-1.2.3> test multiple_queries             ... ok           63 ms2669pg_graphql-1.2.3> test mutation_delete              ... ok           75 ms2670pg_graphql-1.2.3> test mutation_delete_variable     ... ok           68 ms2671pg_graphql-1.2.3> test mutation_insert              ... ok           74 ms2672pg_graphql-1.2.3> test mutation_update              ... ok           80 ms2673pg_graphql-1.2.3> test null_argument                ... ok           63 ms2674pg_graphql-1.4.1> waiting for server to start....2026-10-27 12:37:03.237 GMT [3743] LOG:  starting PostgreSQL 15.19 on aarch64-unknown-linux-gnu, compiled by gcc (GCC) 15.3.0, 64-bit2675pg_graphql-1.4.1> 2026-10-27 12:37:03.239 GMT [3743] LOG:  listening on Unix socket "/build/tmp.L5Brw0VYxK/.s.PGSQL.5432"2676pg_graphql-1.2.3> test omit_exotic_types            ... ok           65 ms2677pg_graphql-1.4.1> 2026-10-27 12:37:03.246 GMT [3746] LOG:  database system was shut down at 2026-10-27 12:37:03 GMT2678pg_graphql-1.4.1> 2026-10-27 12:37:03.252 GMT [3743] LOG:  database system is ready to accept connections2679pg_graphql-1.4.1>  done2680pg_graphql-1.4.1> server started2681pg_graphql-1.4.1> createuser: error: connection to server at "localhost" (127.0.0.1), port 5432 failed: Connection refused2682pg_graphql-1.4.1> 	Is the server running on that host and accepting TCP/IP connections?2683pg_graphql-1.4.1> waiting for server to shut down....2026-10-27 12:37:03.322 GMT [3743] LOG:  received fast shutdown request2684pg_graphql-1.4.1> 2026-10-27 12:37:03.324 GMT [3743] LOG:  aborting any active transactions2685pg_graphql-1.4.1> 2026-10-27 12:37:03.326 GMT [3743] LOG:  background worker "logical replication launcher" (PID 3749) exited with exit code 12686pg_graphql-1.4.1> 2026-10-27 12:37:03.328 GMT [3744] LOG:  shutting down2687pg_graphql-1.4.1> 2026-10-27 12:37:03.330 GMT [3744] LOG:  checkpoint starting: shutdown immediate2688pg_graphql-1.2.3> test omit_weird_names             ... ok           97 ms2689pg_graphql-1.4.1> 2026-10-27 12:37:03.373 GMT [3744] LOG:  checkpoint complete: wrote 3 buffers (0.0%); 0 WAL file(s) added, 0 removed, 0 recycled; write=0.021 s, sync=0.005 s, total=0.045 s; sync files=2, longest=0.004 s, average=0.003 s; distance=0 kB, estimate=0 kB2690pg_graphql-1.4.1> 2026-10-27 12:37:03.383 GMT [3743] LOG:  database system is shut down2691pg_graphql-1.2.3> test operation_name               ... ok           70 ms2692pg_graphql-1.4.1>  done2693pg_graphql-1.4.1> server stopped2694pg_graphql-1.2.3> test override_enum_name           ... ok           55 ms2695pg_graphql-1.2.3> test override_field_name          ... ok           60 ms2696pg_graphql-1.2.3> test override_func_field_name     ... ok           61 ms2697pg_graphql-1.4.1>    Validating /build/tmp.7AdHfJyoc1/15/bin/pg_config2698pg_graphql-1.4.1>  Initializing data directory at /build/tmp.7AdHfJyoc1/data-152699pg_graphql-1.2.3> test override_relationship_field_name ... ok           64 ms2700pg_graphql-1.2.3> test override_type_name           ... ok           60 ms2701pg_graphql-1.2.3> test page_info                    ... ok           72 ms2702pg_graphql-1.2.3> test permissions_connection_column ... ok          102 ms2703pg_graphql-1.2.3> test permissions_node_column      ... ok          105 ms2704pg_graphql-1.2.3> test permissions_table_level      ... ok          210 ms2705pg_graphql-1.2.3> test permissions_types            ... ok          129 ms2706pg_graphql-1.2.3> test primary_key_is_required      ... ok          115 ms2707pg_graphql-1.2.3> test relationship_one_to_one      ... ok           67 ms2708pg_graphql-1.4.1>        Using PgConfig("pg15") and `pg_config` from /build/tmp.7AdHfJyoc1/15/bin/pg_config2709pg_graphql-1.4.1>     Building extension with features pg152710pg_graphql-1.4.1>      Running command "/nix/store/y779g007dd48i3q1la2xk16y4fa85c1x-rust-default-1.70.0/bin/cargo" "build" "--release" "--features" "pg15" "--no-default-features" "--message-format=json-render-diagnostics" "--frozen" "-j" "2"2711pg_graphql-1.2.3> test resolve___schema             ... ok           73 ms2712pg_graphql-1.2.3> test resolve___type               ... ok           60 ms2713pg_graphql-1.4.1>     Finished release [optimized] target(s) in 0.14s2714pg_graphql-1.4.1>   Installing extension2715pg_graphql-1.4.1>      Copying control file to /build/tmp.7AdHfJyoc1/15/share/postgresql/extension/pg_graphql.control2716pg_graphql-1.2.3> test resolve___typename           ... ok           64 ms2717pg_graphql-1.2.3> test resolve_array_type           ... ok           64 ms2718pg_graphql-1.4.1>      Copying shared library to /build/tmp.7AdHfJyoc1/15/lib/pg_graphql.so2719pg_graphql-1.4.1>  Discovering SQL entities2720pg_graphql-1.2.3> test resolve_connection_filter    ... ok          110 ms2721pg_graphql-1.2.3> test resolve_connection_named     ... ok           59 ms2722pg_graphql-1.2.3> test resolve_connection_order_by  ... ok           89 ms2723pg_graphql-1.2.3> test resolve_connection_pagination_args ... ok          123 ms2724pg_graphql-1.2.3> test resolve_connection_to_conn   ... ok           66 ms2725pg_graphql-1.2.3> test resolve_connection_to_node   ... ok           65 ms2726pg_graphql-1.2.3> test resolve_error_connection_edge_no_field ... ok           59 ms2727pg_graphql-1.2.3> test resolve_error_connection_edge_node_no_field ... ok           58 ms2728pg_graphql-1.2.3> test resolve_error_connection_no_field ... ok           57 ms2729pg_graphql-1.2.3> test resolve_error_from_parser    ... ok           11 ms2730pg_graphql-1.2.3> test resolve_error_mutation_no_field ... ok           54 ms2731pg_graphql-1.2.3> test resolve_error_node_no_field  ... ok           59 ms2732pg_graphql-1.2.3> test resolve_error_query_no_field ... ok           56 ms2733pg_graphql-1.2.3> test resolve_fragment             ... ok           61 ms2734pg_graphql-1.2.3> test resolve_graphiql_schema      ... ok          102 ms2735pg_graphql-1.2.3> test resolve_one                  ... ok          109 ms2736pg_graphql-1.2.3> test roundtrip_types              ... ok           73 ms2737pg_graphql-1.2.3> test row_level_security           ... ok           64 ms2738pg_graphql-1.2.3> test sqli_connection              ... ok           69 ms2739pg_graphql-1.2.3> test string_filters               ... ok           69 ms2740pg_graphql-1.2.3> test test_error_anon_and_named_operations ... ok           53 ms2741pg_graphql-1.2.3> test test_error_invalid_offset    ... ok           96 ms2742pg_graphql-1.2.3> test test_error_multiple_anon_operations ... ok           54 ms2743pg_graphql-1.2.3> test test_error_mutation_transpilation ... ok           65 ms2744pg_graphql-1.2.3> test test_error_operation_name_not_found ... ok           55 ms2745pg_graphql-1.2.3> test test_error_operation_names_not_unique ... ok           54 ms2746pg_graphql-1.2.3> test test_error_parsing           ... ok           13 ms2747pg_graphql-1.2.3> test test_error_query_transpilation ... ok           61 ms2748pg_graphql-1.2.3> test test_error_subscription      ... ok           53 ms2749pg_graphql-1.2.3> test test_query__type             ... ok           53 ms2750pg_graphql-1.2.3> test total_count                  ... ok           96 ms2751pg_graphql-1.2.3> test type_bigfloat                ... ok           63 ms2752pg_graphql-1.2.3> test type_modifier_max_length     ... ok           61 ms2753pg_graphql-1.2.3> test type_opaque                  ... ok           64 ms2754pg_graphql-1.2.3> test views_integration            ... ok          222 ms2755pg_graphql-1.2.3> 2756pg_graphql-1.2.3> ======================2757pg_graphql-1.2.3>  All 93 tests passed. 2758pg_graphql-1.2.3> ======================2759pg_graphql-1.2.3> 2760pg_graphql-1.2.3> + pg_ctl stop -m i2761pg_graphql-1.2.3> waiting for server to shut down....2026-10-27 12:37:07.344 UTC [4054] LOG:  received immediate shutdown request2762pg_graphql-1.2.3> 2026-10-27 12:37:07.353 UTC [4054] LOG:  database system is shut down2763pg_graphql-1.2.3>  done2764pg_graphql-1.2.3> server stopped2765pg_graphql-1.2.3> Running phase: installPhase2766pg_graphql-1.2.3> Executing buildPgrxExtension install2767pg_graphql-1.2.3> Running phase: fixupPhase2768pg_graphql-1.2.3> shrinking RPATHs of ELF executables and libraries in /nix/store/v5mrbs8waccnj7rq033kfgg35309pp8l-pg_graphql-1.2.32769pg_graphql-1.2.3> shrinking /nix/store/v5mrbs8waccnj7rq033kfgg35309pp8l-pg_graphql-1.2.3/lib/pg_graphql-1.2.3.so2770pg_graphql-1.2.3> checking for references to /build/ in /nix/store/v5mrbs8waccnj7rq033kfgg35309pp8l-pg_graphql-1.2.3...2771pg_graphql-1.2.3> patching script interpreter paths in /nix/store/v5mrbs8waccnj7rq033kfgg35309pp8l-pg_graphql-1.2.32772pg_graphql-1.2.3> stripping (with command strip and flags -S -p) in  /nix/store/v5mrbs8waccnj7rq033kfgg35309pp8l-pg_graphql-1.2.3/lib2773pg_graphql-1.4.1>   Discovered 5 SQL entities: 0 schemas (0 unique), 1 functions, 0 types, 0 enums, 4 sqls, 0 ords, 0 hashes, 0 aggregates, 0 triggers2774pg_graphql-1.4.1>      Writing SQL entities to /build/tmp.7AdHfJyoc1/15/share/postgresql/extension/pg_graphql--1.4.1.sql2775pg_graphql-1.4.1>     Finished installing pg_graphql2776pg_graphql-1.4.1> ++ mktemp -d2777pg_graphql-1.4.1> + TMPDIR=/build/tmp.DahRZcTo7g2778pg_graphql-1.4.1> + export PGDATA=/build/tmp.DahRZcTo7g2779pg_graphql-1.4.1> + PGDATA=/build/tmp.DahRZcTo7g2780pg_graphql-1.4.1> + export PGHOST=/build/tmp.DahRZcTo7g2781pg_graphql-1.4.1> + PGHOST=/build/tmp.DahRZcTo7g2782pg_graphql-1.4.1> + export PGUSER=postgres2783pg_graphql-1.4.1> + PGUSER=postgres2784pg_graphql-1.4.1> + export PGDATABASE=postgres2785pg_graphql-1.4.1> + PGDATABASE=postgres2786pg_graphql-1.4.1> + export PGTZ=UTC2787pg_graphql-1.4.1> + PGTZ=UTC2788pg_graphql-1.4.1> + export PG_COLOR=auto2789pg_graphql-1.4.1> + PG_COLOR=auto2790pg_graphql-1.4.1> + trap 'pg_ctl stop -m i' sigint sigterm exit2791pg_graphql-1.4.1> + rm -rf /build/tmp.DahRZcTo7g2792pg_graphql-1.4.1> + initdb --no-locale --encoding=UTF8 --nosync -U postgres2793pg_graphql-1.4.1> The files belonging to this database system will be owned by user "nixbld".2794pg_graphql-1.4.1> This user must also own the server process.2795pg_graphql-1.4.1> 2796pg_graphql-1.4.1> The database cluster will be initialized with locale "C".2797pg_graphql-1.4.1> The default text search configuration will be set to "english".2798pg_graphql-1.4.1> 2799pg_graphql-1.4.1> Data page checksums are disabled.2800pg_graphql-1.4.1> 2801pg_graphql-1.4.1> creating directory /build/tmp.DahRZcTo7g ... ok2802pg_graphql-1.4.1> creating subdirectories ... ok2803pg_graphql-1.4.1> selecting dynamic shared memory implementation ... posix2804pg_graphql-1.4.1> selecting default max_connections ... 1002805pg_graphql-1.4.1> selecting default shared_buffers ... 128MB2806pg_graphql-1.4.1> selecting default time zone ... UTC2807pg_graphql-1.4.1> creating configuration files ... ok2808pg_graphql-1.4.1> running bootstrap script ... ok2809pg_graphql-1.4.1> performing post-bootstrap initialization ... ok2810pg_graphql-1.4.1> 2811pg_graphql-1.4.1> Sync to disk skipped.2812pg_graphql-1.4.1> The data directory might become corrupt if the operating system crashes.2813pg_graphql-1.4.1> 2814pg_graphql-1.4.1> initdb: warning: enabling "trust" authentication for local connections2815pg_graphql-1.4.1> initdb: hint: You can change this by editing pg_hba.conf or using the option -A, or --auth-local and --auth-host, the next time you run initdb.2816pg_graphql-1.4.1> 2817pg_graphql-1.4.1> Success. You can now start the database server using:2818pg_graphql-1.4.1> 2819pg_graphql-1.4.1>     /build/tmp.7AdHfJyoc1/15/bin/pg_ctl -D /build/tmp.DahRZcTo7g -l logfile start2820pg_graphql-1.4.1> 2821pg_graphql-1.4.1> + pg_ctl start -o '-F -c listen_addresses="" -c log_min_messages=WARNING -k /build/tmp.DahRZcTo7g'2822pg_graphql-1.4.1> waiting for server to start....2026-10-27 12:37:22.536 UTC [3848] LOG:  starting PostgreSQL 15.19 on aarch64-unknown-linux-gnu, compiled by gcc (GCC) 15.3.0, 64-bit2823pg_graphql-1.4.1> 2026-10-27 12:37:22.536 UTC [3848] LOG:  listening on Unix socket "/build/tmp.DahRZcTo7g/.s.PGSQL.5432"2824pg_graphql-1.4.1> 2026-10-27 12:37:22.538 UTC [3851] LOG:  database system was shut down at 2026-10-27 12:37:22 UTC2825pg_graphql-1.4.1> 2026-10-27 12:37:22.542 UTC [3848] LOG:  database system is ready to accept connections2826pg_graphql-1.4.1>  done2827pg_graphql-1.4.1> server started2828pg_graphql-1.4.1> + createdb contrib_regression2829pg_graphql-1.4.1> + TESTDIR=test2830pg_graphql-1.4.1> +++ pg_config --pgxs2831pg_graphql-1.4.1> ++ dirname /nix/store/bc9327c6474vwmqmhkszkmiz86mba73s-postgresql-15.19/lib/pgxs/src/makefiles/pgxs.mk2832pg_graphql-1.4.1> + PGXS=/nix/store/bc9327c6474vwmqmhkszkmiz86mba73s-postgresql-15.19/lib/pgxs/src/makefiles2833pg_graphql-1.4.1> + REGRESS=/nix/store/bc9327c6474vwmqmhkszkmiz86mba73s-postgresql-15.19/lib/pgxs/src/makefiles/../test/regress/pg_regress2834pg_graphql-1.4.1> + '[' 0 -ne 0 ']'2835pg_graphql-1.4.1> ++ ls test/sql2836pg_graphql-1.4.1> ++ sed -e 's/\..*$//'2837pg_graphql-1.4.1> ++ sort2838pg_graphql-1.4.1> + TESTS=$'aliases\nallow_camel_names\nbigint_is_string\nbuiltin_directives\ncomment_directive\ncomment_directive_description\ncompound_filters\nempty_mutations\nenum_mappings\nextend_type_with_function\nextend_type_with_function_relation\nextend_type_with_generated_column\nfilter_by_node_id\nfragment_on_mutation\nfragment_on_query\nfunction_calls\nfunction_calls_unsupported\ninflection_fields\ninflection_function\ninflection_relationships\ninflection_types\nissue_163\nissue_170\nissue_225\nissue_300\nissue_306\nissue_312\nissue_334_ambiguous_function\nissue_339_function_return_json\nissue_339_function_return_table\nissue_353_too_many_fields\nissue_370_citext_as_string\nissue_373\nissue_377_enum_search_path\njson_is_stringified\nmax_page_size\nmax_rows_directive\nmulti_column_primary_key\nmultiple_mutations\nmultiple_queries\nmutation_delete\nmutation_delete_variable\nmutation_insert\nmutation_update\nnull_argument\nomit_exotic_types\nomit_weird_names\noperation_name\noverride_enum_name\noverride_field_name\noverride_func_field_name\noverride_relationship_field_name\noverride_type_name\npage_info\npermissions_connection_column\npermissions_functions\npermissions_node_column\npermissions_table_level\npermissions_types\nprimary_key_is_required\nrelationship_one_to_one\nresolve___schema\nresolve___type\nresolve___typename\nresolve_array_type\nresolve_connection_filter\nresolve_connection_named\nresolve_connection_order_by\nresolve_connection_pagination_args\nresolve_connection_to_conn\nresolve_connection_to_node\nresolve_error_connection_edge_no_field\nresolve_error_connection_edge_node_no_field\nresolve_error_connection_no_field\nresolve_error_from_parser\nresolve_error_mutation_no_field\nresolve_error_node_no_field\nresolve_error_query_no_field\nresolve_fragment\nresolve_graphiql_schema\nresolve_one\nroundtrip_types\nrow_level_security\nsqli_connection\nstring_filters\ntest_error_anon_and_named_operations\ntest_error_invalid_offset\ntest_error_multiple_anon_operations\ntest_error_mutation_transpilation\ntest_error_operation_name_not_found\ntest_error_operation_names_not_unique\ntest_error_parsing\ntest_error_query_transpilation\ntest_error_subscription\ntest_query__type\ntotal_count\ntype_bigfloat\ntype_modifier_max_length\ntype_opaque\nviews_integration'2839pg_graphql-1.4.1> + psql -v ON_ERROR_STOP=1 -f test/fixtures.sql -d contrib_regression2840pg_graphql-1.4.1> psql:test/fixtures.sql:1: NOTICE:  extension "pg_graphql" does not exist, skipping2841pg_graphql-1.4.1> DROP EXTENSION2842pg_graphql-1.4.1> CREATE EXTENSION2843pg_graphql-1.4.1> COMMENT2844pg_graphql-1.4.1> CREATE FUNCTION2845pg_graphql-1.4.1> + /nix/store/bc9327c6474vwmqmhkszkmiz86mba73s-postgresql-15.19/lib/pgxs/src/makefiles/../test/regress/pg_regress --use-existing --dbname=contrib_regression --inputdir=test aliases allow_camel_names bigint_is_string builtin_directives comment_directive comment_directive_description compound_filters empty_mutations enum_mappings extend_type_with_function extend_type_with_function_relation extend_type_with_generated_column filter_by_node_id fragment_on_mutation fragment_on_query function_calls function_calls_unsupported inflection_fields inflection_function inflection_relationships inflection_types issue_163 issue_170 issue_225 issue_300 issue_306 issue_312 issue_334_ambiguous_function issue_339_function_return_json issue_339_function_return_table issue_353_too_many_fields issue_370_citext_as_string issue_373 issue_377_enum_search_path json_is_stringified max_page_size max_rows_directive multi_column_primary_key multiple_mutations multiple_queries mutation_delete mutation_delete_variable mutation_insert mutation_update null_argument omit_exotic_types omit_weird_names operation_name override_enum_name override_field_name override_func_field_name override_relationship_field_name override_type_name page_info permissions_connection_column permissions_functions permissions_node_column permissions_table_level permissions_types primary_key_is_required relationship_one_to_one resolve___schema resolve___type resolve___typename resolve_array_type resolve_connection_filter resolve_connection_named resolve_connection_order_by resolve_connection_pagination_args resolve_connection_to_conn resolve_connection_to_node resolve_error_connection_edge_no_field resolve_error_connection_edge_node_no_field resolve_error_connection_no_field resolve_error_from_parser resolve_error_mutation_no_field resolve_error_node_no_field resolve_error_query_no_field resolve_fragment resolve_graphiql_schema resolve_one roundtrip_types row_level_security sqli_connection string_filters test_error_anon_and_named_operations test_error_invalid_offset test_error_multiple_anon_operations test_error_mutation_transpilation test_error_operation_name_not_found test_error_operation_names_not_unique test_error_parsing test_error_query_transpilation test_error_subscription test_query__type total_count type_bigfloat type_modifier_max_length type_opaque views_integration2846pg_graphql-1.4.1> (using postmaster on /build/tmp.DahRZcTo7g, default port)2847pg_graphql-1.4.1> ============== running regression test queries        ==============2848pg_graphql-1.4.1> test aliases                      ... ok           58 ms2849pg_graphql-1.4.1> test allow_camel_names            ... ok           59 ms2850pg_graphql-1.4.1> test bigint_is_string             ... ok           57 ms2851pg_graphql-1.4.1> test builtin_directives           ... ok           68 ms2852pg_graphql-1.4.1> test comment_directive            ... ok           10 ms2853pg_graphql-1.4.1> test comment_directive_description ... ok           52 ms2854pg_graphql-1.4.1> test compound_filters             ... ok          256 ms2855pg_graphql-1.4.1> test empty_mutations              ... ok           49 ms2856pg_graphql-1.4.1> test enum_mappings                ... ok           57 ms2857pg_graphql-1.4.1> test extend_type_with_function    ... ok           53 ms2858pg_graphql-1.4.1> test extend_type_with_function_relation ... ok          142 ms2859pg_graphql-1.4.1> test extend_type_with_generated_column ... ok           51 ms2860pg_graphql-1.4.1> test filter_by_node_id            ... ok           58 ms2861pg_graphql-1.4.1> test fragment_on_mutation         ... ok           49 ms2862pg_graphql-1.4.1> test fragment_on_query            ... ok           50 ms2863pg_graphql-1.4.1> test function_calls               ... ok         1319 ms2864pg_graphql-1.4.1> test function_calls_unsupported   ... ok          293 ms2865pg_graphql-1.4.1> test inflection_fields            ... ok          125 ms2866pg_graphql-1.4.1> test inflection_function          ... ok          128 ms2867pg_graphql-1.4.1> test inflection_relationships     ... ok          191 ms2868pg_graphql-1.4.1> test inflection_types             ... ok          130 ms2869pg_graphql-1.4.1> test issue_163                    ... ok           51 ms2870pg_graphql-1.4.1> test issue_170                    ... ok           56 ms2871pg_graphql-1.4.1> test issue_225                    ... ok           55 ms2872pg_graphql-1.4.1> test issue_300                    ... ok           52 ms2873pg_graphql-1.4.1> test issue_306                    ... ok           60 ms2874pg_graphql-1.4.1> test issue_312                    ... ok           53 ms2875pg_graphql-1.4.1> test issue_334_ambiguous_function ... ok           55 ms2876pg_graphql-1.4.1> test issue_339_function_return_json ... ok           52 ms2877pg_graphql-1.4.1> test issue_339_function_return_table ... ok           49 ms2878pg_graphql-1.4.1> test issue_353_too_many_fields    ... ok           61 ms2879pg_graphql-1.4.1> test issue_370_citext_as_string   ... ok           66 ms2880pg_graphql-1.4.1> test issue_373                    ... ok           54 ms2881pg_graphql-1.4.1> test issue_377_enum_search_path   ... ok           79 ms2882pg_graphql-1.4.1> test json_is_stringified          ... ok           55 ms2883pg_graphql-1.4.1> test max_page_size                ... ok           50 ms2884pg_graphql-1.4.1> test max_rows_directive           ... ok          105 ms2885pg_graphql-1.4.1> test multi_column_primary_key     ... ok           63 ms2886pg_graphql-1.4.1> test multiple_mutations           ... ok           54 ms2887pg_graphql-1.4.1> test multiple_queries             ... ok           52 ms2888pg_graphql-1.4.1> test mutation_delete              ... ok           63 ms2889pg_graphql-1.4.1> test mutation_delete_variable     ... ok           52 ms2890pg_graphql-1.4.1> test mutation_insert              ... ok           63 ms2891pg_graphql-1.4.1> test mutation_update              ... ok           67 ms2892pg_graphql-1.4.1> test null_argument                ... ok           50 ms2893pg_graphql-1.4.1> test omit_exotic_types            ... ok           51 ms2894pg_graphql-1.4.1> test omit_weird_names             ... ok           75 ms2895pg_graphql-1.4.1> test operation_name               ... ok           51 ms2896pg_graphql-1.4.1> test override_enum_name           ... ok           46 ms2897pg_graphql-1.4.1> test override_field_name          ... ok           48 ms2898pg_graphql-1.4.1> test override_func_field_name     ... ok           51 ms2899pg_graphql-1.4.1> test override_relationship_field_name ... ok           52 ms2900pg_graphql-1.4.1> test override_type_name           ... ok           49 ms2901pg_graphql-1.4.1> test page_info                    ... ok           62 ms2902pg_graphql-1.4.1> test permissions_connection_column ... ok           79 ms2903pg_graphql-1.4.1> test permissions_functions        ... ok           73 ms2904pg_graphql-1.4.1> test permissions_node_column      ... ok           88 ms2905pg_graphql-1.4.1> test permissions_table_level      ... ok          169 ms2906pg_graphql-1.4.1> test permissions_types            ... ok          123 ms2907pg_graphql-1.4.1> test primary_key_is_required      ... ok           84 ms2908pg_graphql-1.4.1> test relationship_one_to_one      ... ok           60 ms2909pg_graphql-1.4.1> test resolve___schema             ... ok           65 ms2910pg_graphql-1.4.1> test resolve___type               ... ok           54 ms2911pg_graphql-1.4.1> test resolve___typename           ... ok           54 ms2912pg_graphql-1.4.1> test resolve_array_type           ... ok           54 ms2913pg_graphql-1.4.1> test resolve_connection_filter    ... ok          108 ms2914pg_graphql-1.4.1> test resolve_connection_named     ... ok           48 ms2915pg_graphql-1.4.1> test resolve_connection_order_by  ... ok           84 ms2916pg_graphql-1.4.1> test resolve_connection_pagination_args ... ok          101 ms2917pg_graphql-1.4.1> test resolve_connection_to_conn   ... ok           59 ms2918pg_graphql-1.4.1> test resolve_connection_to_node   ... ok           54 ms2919pg_graphql-1.4.1> test resolve_error_connection_edge_no_field ... ok           48 ms2920pg_graphql-1.4.1> test resolve_error_connection_edge_node_no_field ... ok           49 ms2921pg_graphql-1.4.1> test resolve_error_connection_no_field ... ok           48 ms2922pg_graphql-1.4.1> test resolve_error_from_parser    ... ok           14 ms2923pg_graphql-1.4.1> test resolve_error_mutation_no_field ... ok           44 ms2924pg_graphql-1.4.1> test resolve_error_node_no_field  ... ok           50 ms2925pg_graphql-1.4.1> test resolve_error_query_no_field ... ok           44 ms2926pg_graphql-1.4.1> test resolve_fragment             ... ok           51 ms2927pg_graphql-1.4.1> test resolve_graphiql_schema      ... ok          104 ms2928pg_graphql-1.4.1> test resolve_one                  ... ok           88 ms2929pg_graphql-1.4.1> test roundtrip_types              ... ok           64 ms2930pg_graphql-1.4.1> test row_level_security           ... ok           62 ms2931pg_graphql-1.4.1> test sqli_connection              ... ok           59 ms2932pg_graphql-1.4.1> test string_filters               ... ok           60 ms2933pg_graphql-1.4.1> test test_error_anon_and_named_operations ... ok           44 ms2934pg_graphql-1.4.1> test test_error_invalid_offset    ... ok           75 ms2935pg_graphql-1.4.1> test test_error_multiple_anon_operations ... ok           44 ms2936pg_graphql-1.4.1> test test_error_mutation_transpilation ... ok           51 ms2937pg_graphql-1.4.1> test test_error_operation_name_not_found ... ok           47 ms2938pg_graphql-1.4.1> test test_error_operation_names_not_unique ... ok           44 ms2939pg_graphql-1.4.1> test test_error_parsing           ... ok           12 ms2940pg_graphql-1.4.1> test test_error_query_transpilation ... ok           53 ms2941pg_graphql-1.4.1> test test_error_subscription      ... ok           44 ms2942pg_graphql-1.4.1> test test_query__type             ... ok           46 ms2943pg_graphql-1.4.1> test total_count                  ... ok           77 ms2944pg_graphql-1.4.1> test type_bigfloat                ... ok           54 ms2945pg_graphql-1.4.1> test type_modifier_max_length     ... ok           54 ms2946pg_graphql-1.4.1> test type_opaque                  ... ok           55 ms2947pg_graphql-1.4.1> test views_integration            ... ok          174 ms2948pg_graphql-1.4.1> 2949pg_graphql-1.4.1> =======================2950pg_graphql-1.4.1>  All 100 tests passed. 2951pg_graphql-1.4.1> =======================2952pg_graphql-1.4.1> 2953pg_graphql-1.4.1> + pg_ctl stop -m i2954pg_graphql-1.4.1> waiting for server to shut down....2026-10-27 12:37:31.062 UTC [3848] LOG:  received immediate shutdown request2955pg_graphql-1.4.1> 2026-10-27 12:37:31.073 UTC [3848] LOG:  database system is shut down2956pg_graphql-1.4.1>  done2957pg_graphql-1.4.1> server stopped2958pg_graphql-1.4.1> Running phase: installPhase2959pg_graphql-1.4.1> Executing buildPgrxExtension install2960pg_graphql-1.4.1> Running phase: fixupPhase2961pg_graphql-1.4.1> shrinking RPATHs of ELF executables and libraries in /nix/store/kpvimlqj9wn1024z8sqjzwx9k48mszfm-pg_graphql-1.4.12962pg_graphql-1.4.1> shrinking /nix/store/kpvimlqj9wn1024z8sqjzwx9k48mszfm-pg_graphql-1.4.1/lib/pg_graphql-1.4.1.so2963pg_graphql-1.4.1> checking for references to /build/ in /nix/store/kpvimlqj9wn1024z8sqjzwx9k48mszfm-pg_graphql-1.4.1...2964pg_graphql-1.4.1> patching script interpreter paths in /nix/store/kpvimlqj9wn1024z8sqjzwx9k48mszfm-pg_graphql-1.4.12965pg_graphql-1.4.1> stripping (with command strip and flags -S -p) in  /nix/store/kpvimlqj9wn1024z8sqjzwx9k48mszfm-pg_graphql-1.4.1/lib2966pg_graphql-1.4.2>    Compiling pg_graphql v1.4.2 (/build/source)2967pg_graphql-1.4.2>     Finished release [optimized] target(s) in 12m 03s2968pg_graphql-1.4.2>   Installing extension2969pg_graphql-1.4.2>      Copying control file to /nix/store/z3n7x35y8rxw4whww3k50m4i3fw2951l-pg_graphql-1.4.2/nix/store/bc9327c6474vwmqmhkszkmiz86mba73s-postgresql-15.19/share/postgresql/extension/pg_graphql.control2970pg_graphql-1.4.2>      Copying shared library to /nix/store/z3n7x35y8rxw4whww3k50m4i3fw2951l-pg_graphql-1.4.2/nix/store/bs8w2qsyhnqirvhchz9fnvf86y7j6xyf-postgresql-15.19-lib/lib/pg_graphql.so2971pg_graphql-1.4.2>  Discovering SQL entities2972pg_graphql-1.4.2>   Discovered 5 SQL entities: 0 schemas (0 unique), 1 functions, 0 types, 0 enums, 4 sqls, 0 ords, 0 hashes, 0 aggregates, 0 triggers2973pg_graphql-1.4.2>      Writing SQL entities to /nix/store/z3n7x35y8rxw4whww3k50m4i3fw2951l-pg_graphql-1.4.2/nix/store/bc9327c6474vwmqmhkszkmiz86mba73s-postgresql-15.19/share/postgresql/extension/pg_graphql--1.4.2.sql2974pg_graphql-1.4.2>     Finished installing pg_graphql2975pg_graphql-1.4.2> buildPhase completed in 12 minutes 22 seconds2976pg_graphql-1.4.2> Running phase: checkPhase2977pg_graphql-1.4.2>    Validating /nix/store/bc9327c6474vwmqmhkszkmiz86mba73s-postgresql-15.19/bin/pg_config2978pg_graphql-1.4.2>  Initializing data directory at /build/tmp.RwpnclLCp6/data-152979pg_graphql-1.4.2> waiting for server to start....2026-10-27 12:44:10.941 GMT [3743] LOG:  starting PostgreSQL 15.19 on aarch64-unknown-linux-gnu, compiled by gcc (GCC) 15.3.0, 64-bit2980pg_graphql-1.4.2> 2026-10-27 12:44:10.943 GMT [3743] LOG:  listening on Unix socket "/build/tmp.3NKllZrJvL/.s.PGSQL.5432"2981pg_graphql-1.4.2> 2026-10-27 12:44:10.949 GMT [3746] LOG:  database system was shut down at 2026-10-27 12:44:10 GMT2982pg_graphql-1.4.2> 2026-10-27 12:44:10.955 GMT [3743] LOG:  database system is ready to accept connections2983pg_graphql-1.4.2>  done2984pg_graphql-1.4.2> server started2985pg_graphql-1.4.2> createuser: error: connection to server at "localhost" (127.0.0.1), port 5432 failed: Connection refused2986pg_graphql-1.4.2> 	Is the server running on that host and accepting TCP/IP connections?2987pg_graphql-1.4.2> waiting for server to shut down....2026-10-27 12:44:10.982 GMT [3743] LOG:  received fast shutdown request2988pg_graphql-1.4.2> 2026-10-27 12:44:10.984 GMT [3743] LOG:  aborting any active transactions2989pg_graphql-1.4.2> 2026-10-27 12:44:10.986 GMT [3743] LOG:  background worker "logical replication launcher" (PID 3749) exited with exit code 12990pg_graphql-1.4.2> 2026-10-27 12:44:10.986 GMT [3744] LOG:  shutting down2991pg_graphql-1.4.2> 2026-10-27 12:44:10.987 GMT [3744] LOG:  checkpoint starting: shutdown immediate2992pg_graphql-1.4.2> 2026-10-27 12:44:10.999 GMT [3744] LOG:  checkpoint complete: wrote 3 buffers (0.0%); 0 WAL file(s) added, 0 removed, 0 recycled; write=0.004 s, sync=0.002 s, total=0.013 s; sync files=2, longest=0.001 s, average=0.001 s; distance=0 kB, estimate=0 kB2993pg_graphql-1.4.2> 2026-10-27 12:44:11.004 GMT [3743] LOG:  database system is shut down2994pg_graphql-1.4.2>  done2995pg_graphql-1.4.2> server stopped2996pg_graphql-1.4.2>    Validating /build/tmp.r73eZQYKcG/15/bin/pg_config2997pg_graphql-1.4.2>  Initializing data directory at /build/tmp.r73eZQYKcG/data-152998pg_graphql-1.4.2>        Using PgConfig("pg15") and `pg_config` from /build/tmp.r73eZQYKcG/15/bin/pg_config2999pg_graphql-1.4.2>     Building extension with features pg153000pg_graphql-1.4.2>      Running command "/nix/store/y779g007dd48i3q1la2xk16y4fa85c1x-rust-default-1.70.0/bin/cargo" "build" "--release" "--features" "pg15" "--no-default-features" "--message-format=json-render-diagnostics" "--frozen" "-j" "2"3001pg_graphql-1.4.2>     Finished release [optimized] target(s) in 0.13s3002pg_graphql-1.4.2>   Installing extension3003pg_graphql-1.4.2>      Copying control file to /build/tmp.r73eZQYKcG/15/share/postgresql/extension/pg_graphql.control3004pg_graphql-1.4.2>      Copying shared library to /build/tmp.r73eZQYKcG/15/lib/pg_graphql.so3005pg_graphql-1.4.2>  Discovering SQL entities3006pg_graphql-1.4.2>   Discovered 5 SQL entities: 0 schemas (0 unique), 1 functions, 0 types, 0 enums, 4 sqls, 0 ords, 0 hashes, 0 aggregates, 0 triggers3007pg_graphql-1.4.2>      Writing SQL entities to /build/tmp.r73eZQYKcG/15/share/postgresql/extension/pg_graphql--1.4.2.sql3008pg_graphql-1.4.2>     Finished installing pg_graphql3009pg_graphql-1.4.2> ++ mktemp -d3010pg_graphql-1.4.2> + TMPDIR=/build/tmp.iM665157Ok3011pg_graphql-1.4.2> + export PGDATA=/build/tmp.iM665157Ok3012pg_graphql-1.4.2> + PGDATA=/build/tmp.iM665157Ok3013pg_graphql-1.4.2> + export PGHOST=/build/tmp.iM665157Ok3014pg_graphql-1.4.2> + PGHOST=/build/tmp.iM665157Ok3015pg_graphql-1.4.2> + export PGUSER=postgres3016pg_graphql-1.4.2> + PGUSER=postgres3017pg_graphql-1.4.2> + export PGDATABASE=postgres3018pg_graphql-1.4.2> + PGDATABASE=postgres3019pg_graphql-1.4.2> + export PGTZ=UTC3020pg_graphql-1.4.2> + PGTZ=UTC3021pg_graphql-1.4.2> + export PG_COLOR=auto3022pg_graphql-1.4.2> + PG_COLOR=auto3023pg_graphql-1.4.2> + trap 'pg_ctl stop -m i' sigint sigterm exit3024pg_graphql-1.4.2> + rm -rf /build/tmp.iM665157Ok3025pg_graphql-1.4.2> + initdb --no-locale --encoding=UTF8 --nosync -U postgres3026pg_graphql-1.4.2> The files belonging to this database system will be owned by user "nixbld".3027pg_graphql-1.4.2> This user must also own the server process.3028pg_graphql-1.4.2> 3029pg_graphql-1.4.2> The database cluster will be initialized with locale "C".3030pg_graphql-1.4.2> The default text search configuration will be set to "english".3031pg_graphql-1.4.2> 3032pg_graphql-1.4.2> Data page checksums are disabled.3033pg_graphql-1.4.2> 3034pg_graphql-1.4.2> creating directory /build/tmp.iM665157Ok ... ok3035pg_graphql-1.4.2> creating subdirectories ... ok3036pg_graphql-1.4.2> selecting dynamic shared memory implementation ... posix3037pg_graphql-1.4.2> selecting default max_connections ... 1003038pg_graphql-1.4.2> selecting default shared_buffers ... 128MB3039pg_graphql-1.4.2> selecting default time zone ... UTC3040pg_graphql-1.4.2> creating configuration files ... ok3041pg_graphql-1.4.2> running bootstrap script ... ok3042pg_graphql-1.4.2> performing post-bootstrap initialization ... ok3043pg_graphql-1.4.2> 3044pg_graphql-1.4.2> Sync to disk skipped.3045pg_graphql-1.4.2> The data directory might become corrupt if the operating system crashes.3046pg_graphql-1.4.2> 3047pg_graphql-1.4.2> initdb: warning: enabling "trust" authentication for local connections3048pg_graphql-1.4.2> initdb: hint: You can change this by editing pg_hba.conf or using the option -A, or --auth-local and --auth-host, the next time you run initdb.3049pg_graphql-1.4.2> 3050pg_graphql-1.4.2> Success. You can now start the database server using:3051pg_graphql-1.4.2> 3052pg_graphql-1.4.2>     /build/tmp.r73eZQYKcG/15/bin/pg_ctl -D /build/tmp.iM665157Ok -l logfile start3053pg_graphql-1.4.2> 3054pg_graphql-1.4.2> + pg_ctl start -o '-F -c listen_addresses="" -c log_min_messages=WARNING -k /build/tmp.iM665157Ok'3055pg_graphql-1.4.2> waiting for server to start....2026-10-27 12:44:29.481 UTC [3848] LOG:  starting PostgreSQL 15.19 on aarch64-unknown-linux-gnu, compiled by gcc (GCC) 15.3.0, 64-bit3056pg_graphql-1.4.2> 2026-10-27 12:44:29.481 UTC [3848] LOG:  listening on Unix socket "/build/tmp.iM665157Ok/.s.PGSQL.5432"3057pg_graphql-1.4.2> 2026-10-27 12:44:29.483 UTC [3851] LOG:  database system was shut down at 2026-10-27 12:44:29 UTC3058pg_graphql-1.4.2> 2026-10-27 12:44:29.487 UTC [3848] LOG:  database system is ready to accept connections3059pg_graphql-1.4.2>  done3060pg_graphql-1.4.2> server started3061pg_graphql-1.4.2> + createdb contrib_regression3062pg_graphql-1.4.2> + TESTDIR=test3063pg_graphql-1.4.2> +++ pg_config --pgxs3064pg_graphql-1.4.2> ++ dirname /nix/store/bc9327c6474vwmqmhkszkmiz86mba73s-postgresql-15.19/lib/pgxs/src/makefiles/pgxs.mk3065pg_graphql-1.4.2> + PGXS=/nix/store/bc9327c6474vwmqmhkszkmiz86mba73s-postgresql-15.19/lib/pgxs/src/makefiles3066pg_graphql-1.4.2> + REGRESS=/nix/store/bc9327c6474vwmqmhkszkmiz86mba73s-postgresql-15.19/lib/pgxs/src/makefiles/../test/regress/pg_regress3067pg_graphql-1.4.2> + '[' 0 -ne 0 ']'3068pg_graphql-1.4.2> ++ ls test/sql3069pg_graphql-1.4.2> ++ sed -e 's/\..*$//'3070pg_graphql-1.4.2> ++ sort3071pg_graphql-1.4.2> + TESTS=$'aliases\nallow_camel_names\nbigint_is_string\nbuiltin_directives\ncomment_directive\ncomment_directive_description\ncompound_filters\nempty_mutations\nenum_mappings\nextend_type_with_function\nextend_type_with_function_relation\nextend_type_with_generated_column\nfilter_by_node_id\nfragment_on_mutation\nfragment_on_query\nfunction_calls\nfunction_calls_unsupported\ninflection_fields\ninflection_function\ninflection_relationships\ninflection_types\nissue_163\nissue_170\nissue_225\nissue_300\nissue_306\nissue_312\nissue_334_ambiguous_function\nissue_339_function_return_json\nissue_339_function_return_table\nissue_353_too_many_fields\nissue_370_citext_as_string\nissue_373\nissue_377_enum_search_path\njson_is_stringified\nmax_page_size\nmax_rows_directive\nmulti_column_primary_key\nmultiple_mutations\nmultiple_queries\nmutation_delete\nmutation_delete_variable\nmutation_insert\nmutation_update\nnull_argument\nomit_exotic_types\nomit_weird_names\noperation_name\noverride_enum_name\noverride_field_name\noverride_func_field_name\noverride_relationship_field_name\noverride_type_name\npage_info\npermissions_connection_column\npermissions_functions\npermissions_node_column\npermissions_table_level\npermissions_types\nprimary_key_is_required\nrelationship_one_to_one\nresolve___schema\nresolve___type\nresolve___typename\nresolve_array_type\nresolve_connection_filter\nresolve_connection_named\nresolve_connection_order_by\nresolve_connection_pagination_args\nresolve_connection_to_conn\nresolve_connection_to_node\nresolve_error_connection_edge_no_field\nresolve_error_connection_edge_node_no_field\nresolve_error_connection_no_field\nresolve_error_from_parser\nresolve_error_mutation_no_field\nresolve_error_node_no_field\nresolve_error_query_no_field\nresolve_fragment\nresolve_graphiql_schema\nresolve_one\nroundtrip_types\nrow_level_security\nsqli_connection\nstring_filters\ntest_error_anon_and_named_operations\ntest_error_invalid_offset\ntest_error_multiple_anon_operations\ntest_error_mutation_transpilation\ntest_error_operation_name_not_found\ntest_error_operation_names_not_unique\ntest_error_parsing\ntest_error_query_transpilation\ntest_error_subscription\ntest_query__type\ntotal_count\ntype_bigfloat\ntype_modifier_max_length\ntype_opaque\nviews_integration'3072pg_graphql-1.4.2> + psql -v ON_ERROR_STOP=1 -f test/fixtures.sql -d contrib_regression3073pg_graphql-1.4.2> psql:test/fixtures.sql:1: NOTICE:  extension "pg_graphql" does not exist, skipping3074pg_graphql-1.4.2> DROP EXTENSION3075pg_graphql-1.4.2> CREATE EXTENSION3076pg_graphql-1.4.2> COMMENT3077pg_graphql-1.4.2> CREATE FUNCTION3078pg_graphql-1.4.2> + /nix/store/bc9327c6474vwmqmhkszkmiz86mba73s-postgresql-15.19/lib/pgxs/src/makefiles/../test/regress/pg_regress --use-existing --dbname=contrib_regression --inputdir=test aliases allow_camel_names bigint_is_string builtin_directives comment_directive comment_directive_description compound_filters empty_mutations enum_mappings extend_type_with_function extend_type_with_function_relation extend_type_with_generated_column filter_by_node_id fragment_on_mutation fragment_on_query function_calls function_calls_unsupported inflection_fields inflection_function inflection_relationships inflection_types issue_163 issue_170 issue_225 issue_300 issue_306 issue_312 issue_334_ambiguous_function issue_339_function_return_json issue_339_function_return_table issue_353_too_many_fields issue_370_citext_as_string issue_373 issue_377_enum_search_path json_is_stringified max_page_size max_rows_directive multi_column_primary_key multiple_mutations multiple_queries mutation_delete mutation_delete_variable mutation_insert mutation_update null_argument omit_exotic_types omit_weird_names operation_name override_enum_name override_field_name override_func_field_name override_relationship_field_name override_type_name page_info permissions_connection_column permissions_functions permissions_node_column permissions_table_level permissions_types primary_key_is_required relationship_one_to_one resolve___schema resolve___type resolve___typename resolve_array_type resolve_connection_filter resolve_connection_named resolve_connection_order_by resolve_connection_pagination_args resolve_connection_to_conn resolve_connection_to_node resolve_error_connection_edge_no_field resolve_error_connection_edge_node_no_field resolve_error_connection_no_field resolve_error_from_parser resolve_error_mutation_no_field resolve_error_node_no_field resolve_error_query_no_field resolve_fragment resolve_graphiql_schema resolve_one roundtrip_types row_level_security sqli_connection string_filters test_error_anon_and_named_operations test_error_invalid_offset test_error_multiple_anon_operations test_error_mutation_transpilation test_error_operation_name_not_found test_error_operation_names_not_unique test_error_parsing test_error_query_transpilation test_error_subscription test_query__type total_count type_bigfloat type_modifier_max_length type_opaque views_integration3079pg_graphql-1.4.2> (using postmaster on /build/tmp.iM665157Ok, default port)3080pg_graphql-1.4.2> ============== running regression test queries        ==============3081pg_graphql-1.4.2> test aliases                      ... ok           58 ms3082pg_graphql-1.4.2> test allow_camel_names            ... ok           57 ms3083pg_graphql-1.4.2> test bigint_is_string             ... ok           55 ms3084pg_graphql-1.4.2> test builtin_directives           ... ok           66 ms3085pg_graphql-1.4.2> test comment_directive            ... ok           10 ms3086pg_graphql-1.4.2> test comment_directive_description ... ok           48 ms3087pg_graphql-1.4.2> test compound_filters             ... ok          250 ms3088pg_graphql-1.4.2> test empty_mutations              ... ok           49 ms3089pg_graphql-1.4.2> test enum_mappings                ... ok           56 ms3090pg_graphql-1.4.2> test extend_type_with_function    ... ok           53 ms3091pg_graphql-1.4.2> test extend_type_with_function_relation ... ok          141 ms3092pg_graphql-1.4.2> test extend_type_with_generated_column ... ok           53 ms3093pg_graphql-1.4.2> test filter_by_node_id            ... ok          107 ms3094pg_graphql-1.4.2> test fragment_on_mutation         ... ok           49 ms3095pg_graphql-1.4.2> test fragment_on_query            ... ok           50 ms3096pg_graphql-1.4.2> test function_calls               ... ok         1328 ms3097pg_graphql-1.4.2> test function_calls_unsupported   ... ok          288 ms3098pg_graphql-1.4.2> test inflection_fields            ... ok          126 ms3099pg_graphql-1.4.2> test inflection_function          ... ok          126 ms3100pg_graphql-1.4.2> test inflection_relationships     ... ok          186 ms3101pg_graphql-1.4.2> test inflection_types             ... ok          125 ms3102pg_graphql-1.4.2> test issue_163                    ... ok           51 ms3103pg_graphql-1.4.2> test issue_170                    ... ok           52 ms3104pg_graphql-1.4.2> test issue_225                    ... ok           54 ms3105pg_graphql-1.4.2> test issue_300                    ... ok           51 ms3106pg_graphql-1.4.2> test issue_306                    ... ok           56 ms3107pg_graphql-1.4.2> test issue_312                    ... ok           51 ms3108pg_graphql-1.4.2> test issue_334_ambiguous_function ... ok           56 ms3109pg_graphql-1.4.2> test issue_339_function_return_json ... ok           50 ms3110pg_graphql-1.4.2> test issue_339_function_return_table ... ok           49 ms3111pg_graphql-1.4.2> test issue_353_too_many_fields    ... ok           60 ms3112pg_graphql-1.4.2> test issue_370_citext_as_string   ... ok           66 ms3113pg_graphql-1.4.2> test issue_373                    ... ok           53 ms3114pg_graphql-1.4.2> test issue_377_enum_search_path   ... ok           76 ms3115pg_graphql-1.4.2> test json_is_stringified          ... ok           54 ms3116pg_graphql-1.4.2> test max_page_size                ... ok           49 ms3117pg_graphql-1.4.2> test max_rows_directive           ... ok          102 ms3118pg_graphql-1.4.2> test multi_column_primary_key     ... ok           61 ms3119pg_graphql-1.4.2> test multiple_mutations           ... ok           51 ms3120pg_graphql-1.4.2> test multiple_queries             ... ok           50 ms3121pg_graphql-1.4.2> test mutation_delete              ... ok           62 ms3122pg_graphql-1.4.2> test mutation_delete_variable     ... ok           52 ms3123pg_graphql-1.4.2> test mutation_insert              ... ok           62 ms3124pg_graphql-1.4.2> test mutation_update              ... ok           64 ms3125pg_graphql-1.4.2> test null_argument                ... ok           52 ms3126pg_graphql-1.4.2> test omit_exotic_types            ... ok           52 ms3127pg_graphql-1.4.2> test omit_weird_names             ... ok           75 ms3128pg_graphql-1.4.2> test operation_name               ... ok           52 ms3129pg_graphql-1.4.2> test override_enum_name           ... ok           46 ms3130pg_graphql-1.4.2> test override_field_name          ... ok           49 ms3131pg_graphql-1.4.2> test override_func_field_name     ... ok           50 ms3132pg_graphql-1.4.2> test override_relationship_field_name ... ok           51 ms3133pg_graphql-1.4.2> test override_type_name           ... ok           48 ms3134pg_graphql-1.4.2> test page_info                    ... ok           63 ms3135pg_graphql-1.4.2> test permissions_connection_column ... ok           80 ms3136pg_graphql-1.4.2> test permissions_functions        ... ok           76 ms3137pg_graphql-1.4.2> test permissions_node_column      ... ok           83 ms3138pg_graphql-1.4.2> test permissions_table_level      ... ok          164 ms3139pg_graphql-1.4.2> test permissions_types            ... ok           99 ms3140pg_graphql-1.4.2> test primary_key_is_required      ... ok           78 ms3141pg_graphql-1.4.2> test relationship_one_to_one      ... ok           54 ms3142pg_graphql-1.4.2> test resolve___schema             ... ok           58 ms3143pg_graphql-1.4.2> test resolve___type               ... ok           49 ms3144pg_graphql-1.4.2> test resolve___typename           ... ok           52 ms3145pg_graphql-1.4.2> test resolve_array_type           ... ok           53 ms3146pg_graphql-1.4.2> test resolve_connection_filter    ... ok          108 ms3147pg_graphql-1.4.2> test resolve_connection_named     ... ok           51 ms3148pg_graphql-1.4.2> test resolve_connection_order_by  ... ok           84 ms3149pg_graphql-1.4.2> test resolve_connection_pagination_args ... ok          103 ms3150pg_graphql-1.4.2> test resolve_connection_to_conn   ... ok           61 ms3151pg_graphql-1.4.2> test resolve_connection_to_node   ... ok           54 ms3152pg_graphql-1.4.2> test resolve_error_connection_edge_no_field ... ok           47 ms3153pg_graphql-1.4.2> test resolve_error_connection_edge_node_no_field ... ok           49 ms3154pg_graphql-1.4.2> test resolve_error_connection_no_field ... ok           47 ms3155pg_graphql-1.4.2> test resolve_error_from_parser    ... ok           11 ms3156pg_graphql-1.4.2> test resolve_error_mutation_no_field ... ok           43 ms3157pg_graphql-1.4.2> test resolve_error_node_no_field  ... ok           50 ms3158pg_graphql-1.4.2> test resolve_error_query_no_field ... ok           45 ms3159pg_graphql-1.4.2> test resolve_fragment             ... ok           52 ms3160pg_graphql-1.4.2> test resolve_graphiql_schema      ... ok          108 ms3161pg_graphql-1.4.2> test resolve_one                  ... ok          118 ms3162pg_graphql-1.4.2> test roundtrip_types              ... ok           67 ms3163pg_graphql-1.4.2> test row_level_security           ... ok           52 ms3164pg_graphql-1.4.2> test sqli_connection              ... ok           70 ms3165pg_graphql-1.4.2> test string_filters               ... ok           63 ms3166pg_graphql-1.4.2> test test_error_anon_and_named_operations ... ok           52 ms3167pg_graphql-1.4.2> test test_error_invalid_offset    ... ok           76 ms3168pg_graphql-1.4.2> test test_error_multiple_anon_operations ... ok           44 ms3169pg_graphql-1.4.2> test test_error_mutation_transpilation ... ok           52 ms3170pg_graphql-1.4.2> test test_error_operation_name_not_found ... ok           49 ms3171pg_graphql-1.4.2> test test_error_operation_names_not_unique ... ok           43 ms3172pg_graphql-1.4.2> test test_error_parsing           ... ok           11 ms3173pg_graphql-1.4.2> test test_error_query_transpilation ... ok           52 ms3174pg_graphql-1.4.2> test test_error_subscription      ... ok           46 ms3175pg_graphql-1.4.2> test test_query__type             ... ok           47 ms3176pg_graphql-1.4.2> test total_count                  ... ok           77 ms3177pg_graphql-1.4.2> test type_bigfloat                ... ok           53 ms3178pg_graphql-1.4.2> test type_modifier_max_length     ... ok           57 ms3179pg_graphql-1.4.2> test type_opaque                  ... ok           62 ms3180pg_graphql-1.4.2> test views_integration            ... ok          189 ms3181pg_graphql-1.4.2> 3182pg_graphql-1.4.2> =======================3183pg_graphql-1.4.2>  All 100 tests passed. 3184pg_graphql-1.4.2> =======================3185pg_graphql-1.4.2> 3186pg_graphql-1.4.2> + pg_ctl stop -m i3187pg_graphql-1.4.2> waiting for server to shut down....2026-10-27 12:44:38.088 UTC [3848] LOG:  received immediate shutdown request3188pg_graphql-1.4.2> 2026-10-27 12:44:38.096 UTC [3848] LOG:  database system is shut down3189pg_graphql-1.4.2>  done3190pg_graphql-1.4.2> server stopped3191pg_graphql-1.4.2> Running phase: installPhase3192pg_graphql-1.4.2> Executing buildPgrxExtension install3193pg_graphql-1.4.2> Running phase: fixupPhase3194pg_graphql-1.4.2> shrinking RPATHs of ELF executables and libraries in /nix/store/z3n7x35y8rxw4whww3k50m4i3fw2951l-pg_graphql-1.4.23195pg_graphql-1.4.2> shrinking /nix/store/z3n7x35y8rxw4whww3k50m4i3fw2951l-pg_graphql-1.4.2/lib/pg_graphql-1.4.2.so3196pg_graphql-1.4.2> checking for references to /build/ in /nix/store/z3n7x35y8rxw4whww3k50m4i3fw2951l-pg_graphql-1.4.2...3197pg_graphql-1.4.2> patching script interpreter paths in /nix/store/z3n7x35y8rxw4whww3k50m4i3fw2951l-pg_graphql-1.4.23198pg_graphql-1.4.2> stripping (with command strip and flags -S -p) in  /nix/store/z3n7x35y8rxw4whww3k50m4i3fw2951l-pg_graphql-1.4.2/lib3199building '/nix/store/nn3gvzw04p5gppbms1jhgwvvpwg9rxky-postgresql-15-pg_graphql.drv' on 'ssh-ng://nixbot-remote-build@78.232.36.247'3200building '/nix/store/nn3gvzw04p5gppbms1jhgwvvpwg9rxky-postgresql-15-pg_graphql.drv'3201postgresql-15-pg_graphql> structuredAttrs is enabled3202postgresql-15-pg_graphql> created 427 symlinks in user environment3203building '/nix/store/gn9gvx9pbizdr9x4aa6j8qz1xwp7n2jq-postgresql-17-pg_graphql.drv' on 'ssh-ng://nixbot-remote-build@78.232.36.247'3204building '/nix/store/gn9gvx9pbizdr9x4aa6j8qz1xwp7n2jq-postgresql-17-pg_graphql.drv'3205postgresql-17-pg_graphql> structuredAttrs is enabled3206postgresql-17-pg_graphql> created 371 symlinks in user environment3207building '/nix/store/4zmm4z81ggmr1wg7vpwcqj5s4vfvcb0k-postgresql-configfile-check.drv' on 'ssh-ng://nixbot-remote-build@78.232.36.247'3208building '/nix/store/4zmm4z81ggmr1wg7vpwcqj5s4vfvcb0k-postgresql-configfile-check.drv'3209postgresql-configfile-check> 2026-10-27 13:05:13.827 GMT [5] LOG:  skipping missing configuration file "/nix/store/llnsla351ai6z2b836920617br34n8qg-postgresql.conf/postgresql.auto.conf"3210building '/nix/store/vbc32y6rjmg6c049nf02b04ky97c52h9-postgresql-configfile-check.drv' on 'ssh-ng://nixbot-remote-build@78.232.36.247'3211building '/nix/store/vbc32y6rjmg6c049nf02b04ky97c52h9-postgresql-configfile-check.drv'3212postgresql-configfile-check> 2026-10-27 13:06:04.713 GMT [5] LOG:  skipping missing configuration file "/nix/store/llnsla351ai6z2b836920617br34n8qg-postgresql.conf/postgresql.auto.conf"3213building '/nix/store/h0vz8s5khv2crkc4qxxrjbffgw9458gm-postgresql-orioledb-17-pg_graphql.drv' on 'ssh-ng://nixbot-remote-build@78.232.36.247'3214building '/nix/store/h0vz8s5khv2crkc4qxxrjbffgw9458gm-postgresql-orioledb-17-pg_graphql.drv'3215postgresql-orioledb-17-pg_graphql> structuredAttrs is enabled3216postgresql-orioledb-17-pg_graphql> created 398 symlinks in user environment