these 3 derivations will be built: /nix/store/7hqilg8yfks48v630gdxnwfjfjj7bglm-start-postgres-server-test.drv /nix/store/ba8k1jhqpskf2zcmmffj1wlf735v4b1q-postgres-orioledb-17-check-harness.drv /nix/store/lnbsbj3fgkk3h1bck94ry0m0p1pm7ayi-run-check-harness-psql-orioledb-17.drv error: Cannot build '/nix/store/lnbsbj3fgkk3h1bck94ry0m0p1pm7ayi-run-check-harness-psql-orioledb-17.drv'. Reason: builder failed with exit code 1. Output paths: /nix/store/5pq0idrhv7yflas7lwzargsibnwwnqwy-run-check-harness-psql-orioledb-17 Last 25 log lines: > test z_orioledb-17_docs-cascades-deletes ... FAILED 86 ms > test z_orioledb-17_docs-full-text-search ... FAILED 31 ms > test z_orioledb-17_docs-functions ... FAILED 338 ms > test z_orioledb-17_docs-indexes ... FAILED 83 ms > test z_orioledb-17_docs-partitioning ... FAILED 42 ms > test z_orioledb-17_ext_interface ... FAILED 113 ms > test z_orioledb-17_extensions_schema ... FAILED 9 ms > test z_orioledb-17_intarray_ltree_query ... FAILED 8 ms > test z_orioledb-17_pg_stat_monitor ... FAILED 8 ms > test z_orioledb-17_pgroonga ... FAILED 55 ms > test z_orioledb-17_pgvector ... FAILED 18 ms > test z_orioledb-17_verify_orioledb ... FAILED 16 ms > test z_orioledb-17_wal_summarize ... FAILED 9 ms > > ======================== > 68 of 68 tests failed. > ======================== > > The differences that caused some tests to fail can be viewed in the > file "/nix/store/5pq0idrhv7yflas7lwzargsibnwwnqwy-run-check-harness-psql-orioledb-17/regression_output/regression.diffs". A copy of the test summary that you see > above is saved in the file "/nix/store/5pq0idrhv7yflas7lwzargsibnwwnqwy-run-check-harness-psql-orioledb-17/regression_output/regression.out". > > 2026-10-27 10:51:33 [ERROR] pg_regress tests failed > 2026-10-27 10:51:33 [ERROR] An error occurred. Exit code: 1 > 2026-10-27 10:51:33 [ERROR] Debug logs: For full logs, run: nix log /nix/store/lnbsbj3fgkk3h1bck94ry0m0p1pm7ayi-run-check-harness-psql-orioledb-17.drv