these 3 derivations will be built: /nix/store/d7jngw8x94g22295p1dsf236nlcxjlww-start-postgres-server-test.drv /nix/store/mj33pka4qrphf7jsqf69q41c6k0c59kw-postgres-orioledb-17-check-harness.drv /nix/store/16dv4wwar2y6159az8w594hkbskkwczs-run-check-harness-psql-orioledb-17.drv error: Cannot build '/nix/store/16dv4wwar2y6159az8w594hkbskkwczs-run-check-harness-psql-orioledb-17.drv'. Reason: builder failed with exit code 1. Output paths: /nix/store/y2laqbyrrdcbmh7s6nafykch1sc1zqix-run-check-harness-psql-orioledb-17 Last 25 log lines: > test z_orioledb-17_docs-cascades-deletes ... ok 87 ms > test z_orioledb-17_docs-full-text-search ... ok 32 ms > test z_orioledb-17_docs-functions ... ok 38 ms > test z_orioledb-17_docs-indexes ... ok 26 ms > test z_orioledb-17_docs-partitioning ... ok 41 ms > test z_orioledb-17_ext_interface ... FAILED 107 ms > test z_orioledb-17_extensions_schema ... FAILED 11 ms > test z_orioledb-17_intarray_ltree_query ... ok 9 ms > test z_orioledb-17_pg_stat_monitor ... ok 7 ms > test z_orioledb-17_pgroonga ... ok 54 ms > test z_orioledb-17_pgvector ... ok 17 ms > test z_orioledb-17_verify_orioledb ... ok 15 ms > test z_orioledb-17_wal_summarize ... ok 8 ms > > ======================= > 4 of 67 tests failed. > ======================= > > The differences that caused some tests to fail can be viewed in the > file "/nix/store/y2laqbyrrdcbmh7s6nafykch1sc1zqix-run-check-harness-psql-orioledb-17/regression_output/regression.diffs". A copy of the test summary that you see > above is saved in the file "/nix/store/y2laqbyrrdcbmh7s6nafykch1sc1zqix-run-check-harness-psql-orioledb-17/regression_output/regression.out". > > 2026-10-26 12:46:29 [ERROR] pg_regress tests failed > 2026-10-26 12:46:30 [ERROR] An error occurred. Exit code: 1 > 2026-10-26 12:46:30 [ERROR] Debug logs: For full logs, run: nix log /nix/store/16dv4wwar2y6159az8w594hkbskkwczs-run-check-harness-psql-orioledb-17.drv