these 3 derivations will be built: /nix/store/f33c24c9v1xr51ccbpn96v5alpxp0h95-start-postgres-server-test.drv /nix/store/jf7y6z1pmrzaq5jafl63259m7r0742lm-postgres-17-check-harness.drv /nix/store/qdafir1nzlaam2fibgv3xnbk7hs7zva9-run-check-harness-psql-17.drv error: Cannot build '/nix/store/qdafir1nzlaam2fibgv3xnbk7hs7zva9-run-check-harness-psql-17.drv'. Reason: builder failed with exit code 1. Output paths: /nix/store/y6qiv906ba2c1kjw8sqn9mgcnpvaghxi-run-check-harness-psql-17 Last 25 log lines: > test security ... FAILED 9 ms > test storage ... ok 13 ms > test supautils_reserved_roles ... ok 7 ms > test supautils_restrict_versions ... ok 75 ms > test vault ... ok 24 ms > test wal2json ... ok 13 ms > test z_17_ext_interface ... FAILED 106 ms > test z_17_intarray_ltree_query ... ok 15 ms > test z_17_pg_stat_monitor ... ok 7 ms > test z_17_pgvector ... ok 12 ms > test z_17_roles ... ok 13 ms > test z_17_rum ... ok 15 ms > test z_17_wal_summarize ... ok 9 ms > > ======================= > 4 of 70 tests failed. > ======================= > > The differences that caused some tests to fail can be viewed in the > file "/nix/store/y6qiv906ba2c1kjw8sqn9mgcnpvaghxi-run-check-harness-psql-17/regression_output/regression.diffs". A copy of the test summary that you see > above is saved in the file "/nix/store/y6qiv906ba2c1kjw8sqn9mgcnpvaghxi-run-check-harness-psql-17/regression_output/regression.out". > > 2026-10-26 12:46:32 [ERROR] pg_regress tests failed > 2026-10-26 12:46:32 [ERROR] An error occurred. Exit code: 1 > 2026-10-26 12:46:32 [ERROR] Debug logs: For full logs, run: nix log /nix/store/qdafir1nzlaam2fibgv3xnbk7hs7zva9-run-check-harness-psql-17.drv