this derivation will be built: /nix/store/xxvgwxvs67iw03k86iqfxn9x8mq67828-run-check-harness-psql-orioledb-17.drv these 2 paths will be fetched (23.1 KiB download, 91.7 KiB unpacked): /nix/store/dv0xv5rdjsw6q61whz7jv9zy9cn8cc63-postgres-orioledb-17-check-harness /nix/store/2qdpaackh6a68526ghfril0pgalh0bn8-start-postgres-server-test error: Cannot build '/nix/store/xxvgwxvs67iw03k86iqfxn9x8mq67828-run-check-harness-psql-orioledb-17.drv'. Reason: builder failed with exit code 1. Output paths: /nix/store/2fb55jdiqhvq36kq3yqm06igli69zgrp-run-check-harness-psql-orioledb-17 Last 25 log lines: > test wal2json ... ok 19 ms > test z_orioledb-17_docs-cascades-deletes ... ok 87 ms > test z_orioledb-17_docs-full-text-search ... ok 31 ms > test z_orioledb-17_docs-functions ... ok 356 ms > test z_orioledb-17_docs-indexes ... ok 30 ms > test z_orioledb-17_docs-partitioning ... ok 39 ms > test z_orioledb-17_ext_interface ... ok 115 ms > test z_orioledb-17_extensions_schema ... ok 10 ms > test z_orioledb-17_intarray_ltree_query ... ok 10 ms > test z_orioledb-17_pg_stat_monitor ... ok 9 ms > test z_orioledb-17_pgroonga ... ok 56 ms > test z_orioledb-17_pgvector ... ok 16 ms > test z_orioledb-17_verify_orioledb ... ok 17 ms > > ======================= > 1 of 66 tests failed. > ======================= > > The differences that caused some tests to fail can be viewed in the > file "/nix/store/2fb55jdiqhvq36kq3yqm06igli69zgrp-run-check-harness-psql-orioledb-17/regression_output/regression.diffs". A copy of the test summary that you see > above is saved in the file "/nix/store/2fb55jdiqhvq36kq3yqm06igli69zgrp-run-check-harness-psql-orioledb-17/regression_output/regression.out". > > 2026-10-26 08:32:26 [ERROR] pg_regress tests failed > 2026-10-26 08:32:26 [ERROR] An error occurred. Exit code: 1 > 2026-10-26 08:32:26 [ERROR] Debug logs: For full logs, run: nix log /nix/store/xxvgwxvs67iw03k86iqfxn9x8mq67828-run-check-harness-psql-orioledb-17.drv