nixbot

builds

supabase/postgres build #347 failed

branch develop · PR #2521 · commit 2f09416000 · · took 5m 48s · eval 1m 49s

11 failed
failed attributes
status attribute duration
failed checks.aarch64-linux.ext-pgjwt 4m 26s
setup: /nix/store/gw54gals5qrz09ps6kaj0ddv2vfm05y7-unit-supabase-db-init.service /nix/store/5sj0vxm1criqfiw2sniks24h8bh06mfi-user-units /nix/store/zgyvixp …
setup:
  /nix/store/gw54gals5qrz09ps6kaj0ddv2vfm05y7-unit-supabase-db-init.service
  /nix/store/5sj0vxm1criqfiw2sniks24h8bh06mfi-user-units
  /nix/store/zgyvixp1jj2v0ih3nryi8ysdkrylcyf6-user-units
  /nix/store/zqngf1mr61hbr0y2by81q99wzp83jh9s-user-units
cannot build on 'ssh-ng://nixbot-remote-build@78.232.36.247': error: failed to start SSH connection to '78.232.36.247'
Failed to find a machine for remote build!
derivation: 40m1yl0x70dnqaf0q5kvsbls0q0fmg0h-nixos-test-driver-pgjwt.drv
required (system, features): (aarch64-linux, [])
3 available machines:
(systems, maxjobs, supportedFeatures, mandatoryFeatures)
([aarch64-darwin], 2, [apple-virt, big-parallel, kvm, nixos-test], [])
([aarch64-linux], 4, [benchmark, big-parallel, kvm, nixos-test, uid-range], [kvm])
([aarch64-linux], 8, [benchmark, big-parallel, nixos-test, uid-range], [])
error: Cannot build '/nix/store/40m1yl0x70dnqaf0q5kvsbls0q0fmg0h-nixos-test-driver-pgjwt.drv'.
       Reason: platform mismatch
       Required system: 'aarch64-linux'
       Current system: 'x86_64-linux'
error: Cannot build '/nix/store/4pwcj0mzbf7g4saly1q8qhcpa0myr2jz-vm-test-run-pgjwt.drv'.
       Reason: 1 dependency failed.
       Output paths:
         /nix/store/9qp4c5v35hwf5gsv88926v146g35hbnp-vm-test-run-pgjwt
failed checks.aarch64-linux.ext-pgmq 4m 31s
setup: /nix/store/gw54gals5qrz09ps6kaj0ddv2vfm05y7-unit-supabase-db-init.service /nix/store/5sj0vxm1criqfiw2sniks24h8bh06mfi-user-units /nix/store/zgyvixp …
setup:
  /nix/store/gw54gals5qrz09ps6kaj0ddv2vfm05y7-unit-supabase-db-init.service
  /nix/store/5sj0vxm1criqfiw2sniks24h8bh06mfi-user-units
  /nix/store/zgyvixp1jj2v0ih3nryi8ysdkrylcyf6-user-units
  /nix/store/zqngf1mr61hbr0y2by81q99wzp83jh9s-user-units
cannot build on 'ssh-ng://nixbot-remote-build@78.232.36.247': error: failed to start SSH connection to '78.232.36.247'
Failed to find a machine for remote build!
derivation: wvxbvf7m7mwripk4dckjml0p2qjn201s-nixos-test-driver-pgmq.drv
required (system, features): (aarch64-linux, [])
3 available machines:
(systems, maxjobs, supportedFeatures, mandatoryFeatures)
([aarch64-darwin], 2, [apple-virt, big-parallel, kvm, nixos-test], [])
([aarch64-linux], 4, [benchmark, big-parallel, kvm, nixos-test, uid-range], [kvm])
([aarch64-linux], 8, [benchmark, big-parallel, nixos-test, uid-range], [])
error: Cannot build '/nix/store/wvxbvf7m7mwripk4dckjml0p2qjn201s-nixos-test-driver-pgmq.drv'.
       Reason: platform mismatch
       Required system: 'aarch64-linux'
       Current system: 'x86_64-linux'
error: Cannot build '/nix/store/shml2lqinq8c9dc8i54kmh4i1gvbdirx-vm-test-run-pgmq.drv'.
       Reason: 1 dependency failed.
       Output paths:
         /nix/store/sh9w9fwrrslzq9vk3j1rzya82jf4sd0p-vm-test-run-pgmq
failed checks.aarch64-linux.ext-pg_plan_filter 2m 20s
setup: cannot build on 'ssh-ng://nixbot-remote-build@78.232.36.247': error: failed to start SSH connection to '78.232.36.247' Failed to find a machine for remot …
setup:
cannot build on 'ssh-ng://nixbot-remote-build@78.232.36.247': error: failed to start SSH connection to '78.232.36.247'
Failed to find a machine for remote build!
derivation: 54pgpdkglgqlllfvbh2sfppsi0r5mjab-unit-supabase-db-init.service.drv
required (system, features): (aarch64-linux, [])
3 available machines:
(systems, maxjobs, supportedFeatures, mandatoryFeatures)
([aarch64-darwin], 2, [apple-virt, big-parallel, kvm, nixos-test], [])
([aarch64-linux], 4, [benchmark, big-parallel, kvm, nixos-test, uid-range], [kvm])
([aarch64-linux], 8, [benchmark, big-parallel, nixos-test, uid-range], [])
error: Cannot build '/nix/store/54pgpdkglgqlllfvbh2sfppsi0r5mjab-unit-supabase-db-init.service.drv'.
       Reason: platform mismatch
       Required system: 'aarch64-linux'
       Current system: 'x86_64-linux'
error: Cannot build '/nix/store/5vj01ys2mvrhfj5pj9jyq3y70g0lh2d8-system-units.drv'.
       Reason: 1 dependency failed.
       Output paths:
         /nix/store/nnz3f1kv6hpcmnq4sjfpda72qf8mgnhn-system-units
error: Cannot build '/nix/store/yz0w5ihmydyn9hwfsk8zz58dw541py53-etc.drv'.
       Reason: 1 dependency failed.
       Output paths:
         /nix/store/wk78x8v0ghnvclk2q6qsdy3g2fphxlh6-etc
error: Cannot build '/nix/store/j1arhzcbr934dvrn77yrgai1yif4zq20-nixos-system-server-test.drv'.
       Reason: 1 dependency failed.
       Output paths:
         /nix/store/7p62q7dxsiywngq5jyrvfjl4pi52195j-nixos-system-server-test
error: Cannot build '/nix/store/2a985xfyd90n7add6zmzvkspgj4gdpm9-nixos-test-driver-plan_filter.drv'.
       Reason: 1 dependency failed.
       Output paths:
         /nix/store/k31b4qdy5nai8h5h9ixjc1k26s7642lg-nixos-test-driver-plan_filter
error: Cannot build '/nix/store/zjzm9lznhyjbzqizsy1yr1x0hm0nmqrn-vm-test-run-plan_filter.drv'.
       Reason: 1 dependency failed.
       Output paths:
         /nix/store/g2y40d9n1hi45scx79plykmrrpg7pb8q-vm-test-run-plan_filter
failed checks.aarch64-linux.ext-pgroonga 2m 16s
setup: error: Cannot build '/nix/store/6ivxikl7hvd35kldw0nsw9c2m6m5051z-nixos-system-server-test.drv'. Reason: 2 dependencies failed. Output paths …
setup:
error: Cannot build '/nix/store/6ivxikl7hvd35kldw0nsw9c2m6m5051z-nixos-system-server-test.drv'.
       Reason: 2 dependencies failed.
       Output paths:
         /nix/store/bgdlmjrj3qqj0xqhdishybjsr81s1z4n-nixos-system-server-test
error: Cannot build '/nix/store/fkjjial6r26n1qsad0m29apyp7xxhn28-nixos-system-server-test.drv'.
       Reason: 2 dependencies failed.
       Output paths:
         /nix/store/pw7gr6c8mqnxhmxaafpcqq708xsjlsim-nixos-system-server-test
error: Cannot build '/nix/store/n9kjnbfpc62s6ns7va9nabjfxxawmwj3-nixos-system-server-test.drv'.
       Reason: 4 dependencies failed.
       Output paths:
         /nix/store/yb1ablck45mfwmf62k0xy79c8kgmz3vs-nixos-system-server-test
error: Cannot build '/nix/store/6p21yn8s7hlpl54jzmg4j9g63b0wx1qj-closure-info.drv'.
       Reason: 1 dependency failed.
       Output paths:
         /nix/store/9gj45r15d30vfg0fg99vnl4wl7jjwhik-closure-info
error: Cannot build '/nix/store/pz32qhzn9xivbhdw6imk5zcbfr2wvdnw-run-nixos-vm.drv'.
       Reason: 2 dependencies failed.
       Output paths:
         /nix/store/aia4qrc1h36mhgl58psc563xarj2rpp5-run-nixos-vm
error: Cannot build '/nix/store/hcm91zwzaddch8caz7d4m5549kja1q5w-nixos-vm.drv'.
       Reason: 2 dependencies failed.
       Output paths:
         /nix/store/1998xblf6mkrdnji856sf85sw2cwlywa-nixos-vm
error: Cannot build '/nix/store/fxjy9kpx0v3d77i74w6avllpbw08xv2a-nixos-test-driver-pgroonga.drv'.
       Reason: 2 dependencies failed.
       Output paths:
         /nix/store/l25g5krnqsk6wmhv3vbpxg1pc27bj3g7-nixos-test-driver-pgroonga
error: Cannot build '/nix/store/fhbkry8gr6qgx8wankv29kcpw3lms450-vm-test-run-pgroonga.drv'.
       Reason: 1 dependency failed.
       Output paths:
         /nix/store/3gg0sr47wjpiplvabnz42xiv2hr7v8x8-vm-test-run-pgroonga
failed checks.aarch64-linux.ext-pgrouting 4m 55s
setup: /nix/store/gw54gals5qrz09ps6kaj0ddv2vfm05y7-unit-supabase-db-init.service /nix/store/5sj0vxm1criqfiw2sniks24h8bh06mfi-user-units /nix/store/zgyvixp …
setup:
  /nix/store/gw54gals5qrz09ps6kaj0ddv2vfm05y7-unit-supabase-db-init.service
  /nix/store/5sj0vxm1criqfiw2sniks24h8bh06mfi-user-units
  /nix/store/zgyvixp1jj2v0ih3nryi8ysdkrylcyf6-user-units
  /nix/store/zqngf1mr61hbr0y2by81q99wzp83jh9s-user-units
cannot build on 'ssh-ng://nixbot-remote-build@78.232.36.247': error: failed to start SSH connection to '78.232.36.247'
Failed to find a machine for remote build!
derivation: 291l4iwh9skz0r0q2xvj1pva2cl7c3nb-nixos-test-driver-pgrouting.drv
required (system, features): (aarch64-linux, [])
3 available machines:
(systems, maxjobs, supportedFeatures, mandatoryFeatures)
([aarch64-darwin], 2, [apple-virt, big-parallel, kvm, nixos-test], [])
([aarch64-linux], 4, [benchmark, big-parallel, kvm, nixos-test, uid-range], [kvm])
([aarch64-linux], 8, [benchmark, big-parallel, nixos-test, uid-range], [])
error: Cannot build '/nix/store/291l4iwh9skz0r0q2xvj1pva2cl7c3nb-nixos-test-driver-pgrouting.drv'.
       Reason: platform mismatch
       Required system: 'aarch64-linux'
       Current system: 'x86_64-linux'
error: Cannot build '/nix/store/2l362mdrbhk3adwfzvss0rhanzm4qs2b-vm-test-run-pgrouting.drv'.
       Reason: 1 dependency failed.
       Output paths:
         /nix/store/8wapqcz2182wxwzh3nsc9k9ahhg6zff4-vm-test-run-pgrouting
failed checks.aarch64-linux.ext-pgsodium 4m 26s
setup: /nix/store/gw54gals5qrz09ps6kaj0ddv2vfm05y7-unit-supabase-db-init.service /nix/store/5sj0vxm1criqfiw2sniks24h8bh06mfi-user-units /nix/store/zgyvixp …
setup:
  /nix/store/gw54gals5qrz09ps6kaj0ddv2vfm05y7-unit-supabase-db-init.service
  /nix/store/5sj0vxm1criqfiw2sniks24h8bh06mfi-user-units
  /nix/store/zgyvixp1jj2v0ih3nryi8ysdkrylcyf6-user-units
  /nix/store/zqngf1mr61hbr0y2by81q99wzp83jh9s-user-units
cannot build on 'ssh-ng://nixbot-remote-build@78.232.36.247': error: failed to start SSH connection to '78.232.36.247'
Failed to find a machine for remote build!
derivation: dsy42qmkdq0qmlwbsp0yas18qvvm0kqm-nixos-test-driver-pgsodium.drv
required (system, features): (aarch64-linux, [])
3 available machines:
(systems, maxjobs, supportedFeatures, mandatoryFeatures)
([aarch64-darwin], 2, [apple-virt, big-parallel, kvm, nixos-test], [])
([aarch64-linux], 4, [benchmark, big-parallel, kvm, nixos-test, uid-range], [kvm])
([aarch64-linux], 8, [benchmark, big-parallel, nixos-test, uid-range], [])
error: Cannot build '/nix/store/dsy42qmkdq0qmlwbsp0yas18qvvm0kqm-nixos-test-driver-pgsodium.drv'.
       Reason: platform mismatch
       Required system: 'aarch64-linux'
       Current system: 'x86_64-linux'
error: Cannot build '/nix/store/r34q8id9xyg4mwzv0a7dk16mqhkf2c0z-vm-test-run-pgsodium.drv'.
       Reason: 1 dependency failed.
       Output paths:
         /nix/store/3qhjzlf2qm2xmv901id81vz98733d7gi-vm-test-run-pgsodium
failed checks.aarch64-linux.ext-timescaledb 4m 9s
setup: /nix/store/myhm2m5k802s2l6v009bhx25h9nc91fw-nixos-vm /nix/store/d8687bv0iwkh4vjbjqn1pnx10f87g8vi-run-nixos-vm /nix/store/nnz3f1kv6hpcmnq4sjfpda72qf …
setup:
  /nix/store/myhm2m5k802s2l6v009bhx25h9nc91fw-nixos-vm
  /nix/store/d8687bv0iwkh4vjbjqn1pnx10f87g8vi-run-nixos-vm
  /nix/store/nnz3f1kv6hpcmnq4sjfpda72qf8mgnhn-system-units
  /nix/store/36hf3dsaxa6gk3bpjbf9r0w9i3j2ilmk-unit-supabase-db-init.service
cannot build on 'ssh-ng://nixbot-remote-build@78.232.36.247': error: failed to start SSH connection to '78.232.36.247'
Failed to find a machine for remote build!
derivation: fb5dw7sx73a98vbpdw6v40fpq1rn8pzg-nixos-test-driver-timescaledb.drv
required (system, features): (aarch64-linux, [])
3 available machines:
(systems, maxjobs, supportedFeatures, mandatoryFeatures)
([aarch64-darwin], 2, [apple-virt, big-parallel, kvm, nixos-test], [])
([aarch64-linux], 4, [benchmark, big-parallel, kvm, nixos-test, uid-range], [kvm])
([aarch64-linux], 8, [benchmark, big-parallel, nixos-test, uid-range], [])
error: Cannot build '/nix/store/fb5dw7sx73a98vbpdw6v40fpq1rn8pzg-nixos-test-driver-timescaledb.drv'.
       Reason: platform mismatch
       Required system: 'aarch64-linux'
       Current system: 'x86_64-linux'
error: Cannot build '/nix/store/awg5dcn9i43pz0fskablp35z03l955gx-vm-test-run-timescaledb.drv'.
       Reason: 1 dependency failed.
       Output paths:
         /nix/store/74nng721b36zx19gnv2kqjkca9va5a7p-vm-test-run-timescaledb
failed checks.aarch64-linux.ext-vault 4m 35s
setup: /nix/store/wfxpb3awvxl6nx1zwfrkmig49gzykym4-nixos-vm /nix/store/ixx5vfw2ql65bs0r3rgq8rm3nl8jv5rb-run-nixos-vm /nix/store/nnz3f1kv6hpcmnq4sjfpda72qf …
setup:
  /nix/store/wfxpb3awvxl6nx1zwfrkmig49gzykym4-nixos-vm
  /nix/store/ixx5vfw2ql65bs0r3rgq8rm3nl8jv5rb-run-nixos-vm
  /nix/store/nnz3f1kv6hpcmnq4sjfpda72qf8mgnhn-system-units
  /nix/store/36hf3dsaxa6gk3bpjbf9r0w9i3j2ilmk-unit-supabase-db-init.service
cannot build on 'ssh-ng://nixbot-remote-build@78.232.36.247': error: failed to start SSH connection to '78.232.36.247'
Failed to find a machine for remote build!
derivation: gd3csrb1f974s27l13x8gasypqh48pmr-nixos-test-driver-supabase_vault.drv
required (system, features): (aarch64-linux, [])
3 available machines:
(systems, maxjobs, supportedFeatures, mandatoryFeatures)
([aarch64-darwin], 2, [apple-virt, big-parallel, kvm, nixos-test], [])
([aarch64-linux], 4, [benchmark, big-parallel, kvm, nixos-test, uid-range], [kvm])
([aarch64-linux], 8, [benchmark, big-parallel, nixos-test, uid-range], [])
error: Cannot build '/nix/store/gd3csrb1f974s27l13x8gasypqh48pmr-nixos-test-driver-supabase_vault.drv'.
       Reason: platform mismatch
       Required system: 'aarch64-linux'
       Current system: 'x86_64-linux'
error: Cannot build '/nix/store/3i4flhm1sdfrdrnzvd5xi9qjk3vxlivy-vm-test-run-supabase_vault.drv'.
       Reason: 1 dependency failed.
       Output paths:
         /nix/store/04a6vlas22rmirh22iwxcaalqx8nxyfg-vm-test-run-supabase_vault
failed checks.aarch64-linux.ext-wrappers 2m 16s
setup: these 2 derivations will be built: /nix/store/ii4gmnvff15id31hy2y6lwy9dvfmy4qy-nixos-test-driver-wrappers.drv /nix/store/5rldpz8nhl5iysqqdhva59r05kc5 …
setup:
these 2 derivations will be built:
  /nix/store/ii4gmnvff15id31hy2y6lwy9dvfmy4qy-nixos-test-driver-wrappers.drv
  /nix/store/5rldpz8nhl5iysqqdhva59r05kc58y1p-vm-test-run-wrappers.drv
cannot build on 'ssh-ng://nixbot-remote-build@78.232.36.247': error: failed to start SSH connection to '78.232.36.247'
Failed to find a machine for remote build!
derivation: ii4gmnvff15id31hy2y6lwy9dvfmy4qy-nixos-test-driver-wrappers.drv
required (system, features): (aarch64-linux, [])
3 available machines:
(systems, maxjobs, supportedFeatures, mandatoryFeatures)
([aarch64-darwin], 2, [apple-virt, big-parallel, kvm, nixos-test], [])
([aarch64-linux], 4, [benchmark, big-parallel, kvm, nixos-test, uid-range], [kvm])
([aarch64-linux], 8, [benchmark, big-parallel, nixos-test, uid-range], [])
error: Cannot build '/nix/store/ii4gmnvff15id31hy2y6lwy9dvfmy4qy-nixos-test-driver-wrappers.drv'.
       Reason: platform mismatch
       Required system: 'aarch64-linux'
       Current system: 'x86_64-linux'
error: Cannot build '/nix/store/5rldpz8nhl5iysqqdhva59r05kc58y1p-vm-test-run-wrappers.drv'.
       Reason: 1 dependency failed.
       Output paths:
         /nix/store/z1p6bj4iyfzcx2cks593fj5w7ynnd79x-vm-test-run-wrappers
failed checks.aarch64-linux.ext-wrappers-regression-PSQL-1387 4m 9s
setup: /nix/store/myhm2m5k802s2l6v009bhx25h9nc91fw-nixos-vm /nix/store/d8687bv0iwkh4vjbjqn1pnx10f87g8vi-run-nixos-vm /nix/store/nnz3f1kv6hpcmnq4sjfpda72qf …
setup:
  /nix/store/myhm2m5k802s2l6v009bhx25h9nc91fw-nixos-vm
  /nix/store/d8687bv0iwkh4vjbjqn1pnx10f87g8vi-run-nixos-vm
  /nix/store/nnz3f1kv6hpcmnq4sjfpda72qf8mgnhn-system-units
  /nix/store/36hf3dsaxa6gk3bpjbf9r0w9i3j2ilmk-unit-supabase-db-init.service
cannot build on 'ssh-ng://nixbot-remote-build@78.232.36.247': error: failed to start SSH connection to '78.232.36.247'
Failed to find a machine for remote build!
derivation: 68nkkajycw0hl8dgm5rck2qgdyhb6dwl-nixos-test-driver-wrappers-regression-PSQL-1387.drv
required (system, features): (aarch64-linux, [])
3 available machines:
(systems, maxjobs, supportedFeatures, mandatoryFeatures)
([aarch64-darwin], 2, [apple-virt, big-parallel, kvm, nixos-test], [])
([aarch64-linux], 4, [benchmark, big-parallel, kvm, nixos-test, uid-range], [kvm])
([aarch64-linux], 8, [benchmark, big-parallel, nixos-test, uid-range], [])
error: Cannot build '/nix/store/68nkkajycw0hl8dgm5rck2qgdyhb6dwl-nixos-test-driver-wrappers-regression-PSQL-1387.drv'.
       Reason: platform mismatch
       Required system: 'aarch64-linux'
       Current system: 'x86_64-linux'
error: Cannot build '/nix/store/25ii4rh263pv521z7a4yxvxhmy5lznwl-vm-test-run-wrappers-regression-PSQL-1387.drv'.
       Reason: 1 dependency failed.
       Output paths:
         /nix/store/5q7nfm1zr8vl8iami75n2x45x5b9al8g-vm-test-run-wrappers-regression-PSQL-1387
failed checks.aarch64-linux.treefmt 2m 12s
setup: this derivation will be built: /nix/store/qxd3hb5cd6l73an9m7v1bx5v0jkdn6fv-treefmt-check.drv cannot build on 'ssh-ng://nixbot-remote-build@78.232.36.24 …
setup:
this derivation will be built:
  /nix/store/qxd3hb5cd6l73an9m7v1bx5v0jkdn6fv-treefmt-check.drv
cannot build on 'ssh-ng://nixbot-remote-build@78.232.36.247': error: failed to start SSH connection to '78.232.36.247'
Failed to find a machine for remote build!
derivation: qxd3hb5cd6l73an9m7v1bx5v0jkdn6fv-treefmt-check.drv
required (system, features): (aarch64-linux, [])
3 available machines:
(systems, maxjobs, supportedFeatures, mandatoryFeatures)
([aarch64-darwin], 2, [apple-virt, big-parallel, kvm, nixos-test], [])
([aarch64-linux], 4, [benchmark, big-parallel, kvm, nixos-test, uid-range], [kvm])
([aarch64-linux], 8, [benchmark, big-parallel, nixos-test, uid-range], [])
error: Cannot build '/nix/store/qxd3hb5cd6l73an9m7v1bx5v0jkdn6fv-treefmt-check.drv'.
       Reason: platform mismatch
       Required system: 'aarch64-linux'
       Current system: 'x86_64-linux'
79 succeeded
succeeded attributes
status attribute duration
loading…
36 already built
skipped attributes
status attribute duration
loading…