nixbot

builds

supabase/postgres build #336 failed

branch develop · PR #2553 · commit 417b3a6093 · · took 4m 21s · eval 3m 58s

20 failed
failed attributes
status attribute duration
failed checks.aarch64-linux.ext-index_advisor 1s
nixos-test-driver-index_advisor: Running type check (enable/disable: config.skipTypeCheck) See https://nixos.org/manual/nixos/stable/#test-opt-skipTypeCheck tes …
nixos-test-driver-index_advisor:
Running type check (enable/disable: config.skipTypeCheck)
See https://nixos.org/manual/nixos/stable/#test-opt-skipTypeCheck
testScriptWithTypes:60: error: Unexpected indent  [syntax]
        from pathlib import Path
        ^
Found 1 error in 1 file (errors prevented further checking)
failed checks.aarch64-linux.ext-pgjwt 2s
nixos-test-driver-pgjwt: Running type check (enable/disable: config.skipTypeCheck) See https://nixos.org/manual/nixos/stable/#test-opt-skipTypeCheck testScriptW …
nixos-test-driver-pgjwt:
Running type check (enable/disable: config.skipTypeCheck)
See https://nixos.org/manual/nixos/stable/#test-opt-skipTypeCheck
testScriptWithTypes:60: error: Unexpected indent  [syntax]
        from pathlib import Path
        ^
Found 1 error in 1 file (errors prevented further checking)
failed checks.aarch64-linux.ext-pgmq 1s
nixos-test-driver-pgmq: Running type check (enable/disable: config.skipTypeCheck) See https://nixos.org/manual/nixos/stable/#test-opt-skipTypeCheck testScriptWi …
nixos-test-driver-pgmq:
Running type check (enable/disable: config.skipTypeCheck)
See https://nixos.org/manual/nixos/stable/#test-opt-skipTypeCheck
testScriptWithTypes:60: error: Unexpected indent  [syntax]
        from pathlib import Path
        ^
Found 1 error in 1 file (errors prevented further checking)
failed checks.aarch64-linux.ext-pg_repack 1s
nixos-test-driver-pg_repack: Running type check (enable/disable: config.skipTypeCheck) See https://nixos.org/manual/nixos/stable/#test-opt-skipTypeCheck testScr …
nixos-test-driver-pg_repack:
Running type check (enable/disable: config.skipTypeCheck)
See https://nixos.org/manual/nixos/stable/#test-opt-skipTypeCheck
testScriptWithTypes:60: error: Unexpected indent  [syntax]
        from pathlib import Path
        ^
Found 1 error in 1 file (errors prevented further checking)
failed checks.aarch64-linux.ext-pgroonga 1s
nixos-test-driver-pgroonga: Running type check (enable/disable: config.skipTypeCheck) See https://nixos.org/manual/nixos/stable/#test-opt-skipTypeCheck testScri …
nixos-test-driver-pgroonga:
Running type check (enable/disable: config.skipTypeCheck)
See https://nixos.org/manual/nixos/stable/#test-opt-skipTypeCheck
testScriptWithTypes:60: error: Unexpected indent  [syntax]
        from pathlib import Path
        ^
Found 1 error in 1 file (errors prevented further checking)
failed checks.aarch64-linux.ext-pgrouting 1s
nixos-test-driver-pgrouting: Running type check (enable/disable: config.skipTypeCheck) See https://nixos.org/manual/nixos/stable/#test-opt-skipTypeCheck testScr …
nixos-test-driver-pgrouting:
Running type check (enable/disable: config.skipTypeCheck)
See https://nixos.org/manual/nixos/stable/#test-opt-skipTypeCheck
testScriptWithTypes:60: error: Unexpected indent  [syntax]
        from pathlib import Path
        ^
Found 1 error in 1 file (errors prevented further checking)
failed checks.aarch64-linux.ext-pgsodium 1s
nixos-test-driver-pgsodium: Running type check (enable/disable: config.skipTypeCheck) See https://nixos.org/manual/nixos/stable/#test-opt-skipTypeCheck testScri …
nixos-test-driver-pgsodium:
Running type check (enable/disable: config.skipTypeCheck)
See https://nixos.org/manual/nixos/stable/#test-opt-skipTypeCheck
testScriptWithTypes:60: error: Unexpected indent  [syntax]
        from pathlib import Path
        ^
Found 1 error in 1 file (errors prevented further checking)
failed checks.aarch64-linux.ext-plpgsql_check 1s
nixos-test-driver-plpgsql_check: Running type check (enable/disable: config.skipTypeCheck) See https://nixos.org/manual/nixos/stable/#test-opt-skipTypeCheck tes …
nixos-test-driver-plpgsql_check:
Running type check (enable/disable: config.skipTypeCheck)
See https://nixos.org/manual/nixos/stable/#test-opt-skipTypeCheck
testScriptWithTypes:60: error: Unexpected indent  [syntax]
        from pathlib import Path
        ^
Found 1 error in 1 file (errors prevented further checking)
failed checks.aarch64-linux.ext-postgis 2s
nixos-test-driver-postgis: Running type check (enable/disable: config.skipTypeCheck) See https://nixos.org/manual/nixos/stable/#test-opt-skipTypeCheck testScrip …
nixos-test-driver-postgis:
Running type check (enable/disable: config.skipTypeCheck)
See https://nixos.org/manual/nixos/stable/#test-opt-skipTypeCheck
testScriptWithTypes:60: error: Unexpected indent  [syntax]
        from pathlib import Path
        ^
Found 1 error in 1 file (errors prevented further checking)
failed checks.aarch64-linux.ext-vault 2s
nixos-test-driver-supabase_vault: Running type check (enable/disable: config.skipTypeCheck) See https://nixos.org/manual/nixos/stable/#test-opt-skipTypeCheck te …
nixos-test-driver-supabase_vault:
Running type check (enable/disable: config.skipTypeCheck)
See https://nixos.org/manual/nixos/stable/#test-opt-skipTypeCheck
testScriptWithTypes:60: error: Unexpected indent  [syntax]
        from pathlib import Path
        ^
Found 1 error in 1 file (errors prevented further checking)
failed checks.x86_64-linux.ext-index_advisor 0s
nixos-test-driver-index_advisor: Running type check (enable/disable: config.skipTypeCheck) See https://nixos.org/manual/nixos/stable/#test-opt-skipTypeCheck tes …
nixos-test-driver-index_advisor:
Running type check (enable/disable: config.skipTypeCheck)
See https://nixos.org/manual/nixos/stable/#test-opt-skipTypeCheck
testScriptWithTypes:60: error: Unexpected indent  [syntax]
        from pathlib import Path
        ^
Found 1 error in 1 file (errors prevented further checking)
failed checks.x86_64-linux.ext-pgjwt 0s
nixos-test-driver-pgjwt: Running type check (enable/disable: config.skipTypeCheck) See https://nixos.org/manual/nixos/stable/#test-opt-skipTypeCheck testScriptW …
nixos-test-driver-pgjwt:
Running type check (enable/disable: config.skipTypeCheck)
See https://nixos.org/manual/nixos/stable/#test-opt-skipTypeCheck
testScriptWithTypes:60: error: Unexpected indent  [syntax]
        from pathlib import Path
        ^
Found 1 error in 1 file (errors prevented further checking)
failed checks.x86_64-linux.ext-pgmq 0s
nixos-test-driver-pgmq: Running type check (enable/disable: config.skipTypeCheck) See https://nixos.org/manual/nixos/stable/#test-opt-skipTypeCheck testScriptWi …
nixos-test-driver-pgmq:
Running type check (enable/disable: config.skipTypeCheck)
See https://nixos.org/manual/nixos/stable/#test-opt-skipTypeCheck
testScriptWithTypes:60: error: Unexpected indent  [syntax]
        from pathlib import Path
        ^
Found 1 error in 1 file (errors prevented further checking)
failed checks.x86_64-linux.ext-pg_repack 0s
nixos-test-driver-pg_repack: Running type check (enable/disable: config.skipTypeCheck) See https://nixos.org/manual/nixos/stable/#test-opt-skipTypeCheck testScr …
nixos-test-driver-pg_repack:
Running type check (enable/disable: config.skipTypeCheck)
See https://nixos.org/manual/nixos/stable/#test-opt-skipTypeCheck
testScriptWithTypes:60: error: Unexpected indent  [syntax]
        from pathlib import Path
        ^
Found 1 error in 1 file (errors prevented further checking)
failed checks.x86_64-linux.ext-pgroonga 0s
nixos-test-driver-pgroonga: Running type check (enable/disable: config.skipTypeCheck) See https://nixos.org/manual/nixos/stable/#test-opt-skipTypeCheck testScri …
nixos-test-driver-pgroonga:
Running type check (enable/disable: config.skipTypeCheck)
See https://nixos.org/manual/nixos/stable/#test-opt-skipTypeCheck
testScriptWithTypes:60: error: Unexpected indent  [syntax]
        from pathlib import Path
        ^
Found 1 error in 1 file (errors prevented further checking)
failed checks.x86_64-linux.ext-pgrouting 0s
nixos-test-driver-pgrouting: Running type check (enable/disable: config.skipTypeCheck) See https://nixos.org/manual/nixos/stable/#test-opt-skipTypeCheck testScr …
nixos-test-driver-pgrouting:
Running type check (enable/disable: config.skipTypeCheck)
See https://nixos.org/manual/nixos/stable/#test-opt-skipTypeCheck
testScriptWithTypes:60: error: Unexpected indent  [syntax]
        from pathlib import Path
        ^
Found 1 error in 1 file (errors prevented further checking)
failed checks.x86_64-linux.ext-pgsodium 0s
nixos-test-driver-pgsodium: Running type check (enable/disable: config.skipTypeCheck) See https://nixos.org/manual/nixos/stable/#test-opt-skipTypeCheck testScri …
nixos-test-driver-pgsodium:
Running type check (enable/disable: config.skipTypeCheck)
See https://nixos.org/manual/nixos/stable/#test-opt-skipTypeCheck
testScriptWithTypes:60: error: Unexpected indent  [syntax]
        from pathlib import Path
        ^
Found 1 error in 1 file (errors prevented further checking)
failed checks.x86_64-linux.ext-plpgsql_check 0s
nixos-test-driver-plpgsql_check: Running type check (enable/disable: config.skipTypeCheck) See https://nixos.org/manual/nixos/stable/#test-opt-skipTypeCheck tes …
nixos-test-driver-plpgsql_check:
Running type check (enable/disable: config.skipTypeCheck)
See https://nixos.org/manual/nixos/stable/#test-opt-skipTypeCheck
testScriptWithTypes:60: error: Unexpected indent  [syntax]
        from pathlib import Path
        ^
Found 1 error in 1 file (errors prevented further checking)
failed checks.x86_64-linux.ext-postgis 0s
nixos-test-driver-postgis: Running type check (enable/disable: config.skipTypeCheck) See https://nixos.org/manual/nixos/stable/#test-opt-skipTypeCheck testScrip …
nixos-test-driver-postgis:
Running type check (enable/disable: config.skipTypeCheck)
See https://nixos.org/manual/nixos/stable/#test-opt-skipTypeCheck
testScriptWithTypes:60: error: Unexpected indent  [syntax]
        from pathlib import Path
        ^
Found 1 error in 1 file (errors prevented further checking)
failed checks.x86_64-linux.ext-vault 0s
nixos-test-driver-supabase_vault: Running type check (enable/disable: config.skipTypeCheck) See https://nixos.org/manual/nixos/stable/#test-opt-skipTypeCheck te …
nixos-test-driver-supabase_vault:
Running type check (enable/disable: config.skipTypeCheck)
See https://nixos.org/manual/nixos/stable/#test-opt-skipTypeCheck
testScriptWithTypes:60: error: Unexpected indent  [syntax]
        from pathlib import Path
        ^
Found 1 error in 1 file (errors prevented further checking)
4 succeeded
succeeded attributes
status attribute duration
loading…
98 already built
skipped attributes
status attribute duration
loading…