these 2 derivations will be built: /nix/store/sv93gy88bnzw9184p1bb97i2k7m28r5m-postgres-15-check-harness.drv /nix/store/j0kfcaw7m3p5xn5f97nlyi3w0wp7f1m7-run-check-harness-psql-15.drv error: build of '/nix/store/j0kfcaw7m3p5xn5f97nlyi3w0wp7f1m7-run-check-harness-psql-15.drv' on 'ssh-ng://nixbot-remote-build@78.232.36.247' failed: Cannot build '/nix/store/j0kfcaw7m3p5xn5f97nlyi3w0wp7f1m7-run-check-harness-psql-15.drv'. Reason: builder failed with exit code 1. Output paths: /nix/store/vmlw08y8svrggyfx0cr26y9ksalnlbkv-run-check-harness-psql-15 Last 25 log lines: > test supautils_restrict_versions ... ok 159 ms > test vault ... ok 55 ms > test wal2json ... ok 46 ms > test z_15_ext_interface ... ok 1472 ms > test z_15_intarray_ltree_query ... ok 15 ms > test z_15_pg_stat_monitor ... ok 16 ms > test z_15_pgjwt ... ok 29 ms > test z_15_pgvector ... ok 73 ms > test z_15_plv8 ... ok 79 ms > test z_15_roles ... ok 24 ms > test z_15_rum ... ok 37 ms > test z_15_timescale ... ok 47 ms > test z_15_unhype_timescale_to_partman ... ok 19479 ms > > ======================= > 1 of 72 tests failed. > ======================= > > The differences that caused some tests to fail can be viewed in the > file "/nix/store/vmlw08y8svrggyfx0cr26y9ksalnlbkv-run-check-harness-psql-15/regression_output/regression.diffs". A copy of the test summary that you see > above is saved in the file "/nix/store/vmlw08y8svrggyfx0cr26y9ksalnlbkv-run-check-harness-psql-15/regression_output/regression.out". > > 2026-10-10 14:42:11 [ERROR] pg_regress tests failed > 2026-10-10 14:42:11 [ERROR] An error occurred. Exit code: 1 > 2026-10-10 14:42:11 [ERROR] Debug logs: For full logs, run: nix log /nix/store/j0kfcaw7m3p5xn5f97nlyi3w0wp7f1m7-run-check-harness-psql-15.drv error: Cannot build '/nix/store/j0kfcaw7m3p5xn5f97nlyi3w0wp7f1m7-run-check-harness-psql-15.drv'. Reason: builder failed with exit code 1. Output paths: /nix/store/vmlw08y8svrggyfx0cr26y9ksalnlbkv-run-check-harness-psql-15