this derivation will be built: /nix/store/ky6s58j4xv7m4si81vnas6gkgykp3k0i-run-check-harness-psql-orioledb-17.drv these 2 paths will be fetched (23.0 KiB download, 91.2 KiB unpacked): /nix/store/7phrdw4l4igv7qc4n36vjy7w1wddsc2p-postgres-orioledb-17-check-harness /nix/store/qih4jn5ih3dr5ls802rz0vymja8l0p9c-start-postgres-server-test error: Cannot build '/nix/store/ky6s58j4xv7m4si81vnas6gkgykp3k0i-run-check-harness-psql-orioledb-17.drv'. Reason: builder failed with exit code 1. Output paths: /nix/store/765763l4rrvcdm26pzlf6na3l4w0mkxq-run-check-harness-psql-orioledb-17 Last 25 log lines: > test wal2json ... ok 20 ms > test z_orioledb-17_docs-cascades-deletes ... ok 86 ms > test z_orioledb-17_docs-full-text-search ... ok 31 ms > test z_orioledb-17_docs-functions ... ok 354 ms > test z_orioledb-17_docs-indexes ... ok 28 ms > test z_orioledb-17_docs-partitioning ... ok 38 ms > test z_orioledb-17_ext_interface ... ok 114 ms > test z_orioledb-17_extensions_schema ... ok 9 ms > test z_orioledb-17_intarray_ltree_query ... ok 9 ms > test z_orioledb-17_pg_stat_monitor ... ok 6 ms > test z_orioledb-17_pgroonga ... ok 61 ms > test z_orioledb-17_pgvector ... ok 19 ms > test z_orioledb-17_verify_orioledb ... ok 16 ms > > ======================= > 1 of 65 tests failed. > ======================= > > The differences that caused some tests to fail can be viewed in the > file "/nix/store/765763l4rrvcdm26pzlf6na3l4w0mkxq-run-check-harness-psql-orioledb-17/regression_output/regression.diffs". A copy of the test summary that you see > above is saved in the file "/nix/store/765763l4rrvcdm26pzlf6na3l4w0mkxq-run-check-harness-psql-orioledb-17/regression_output/regression.out". > > 2026-10-10 11:10:11 [ERROR] pg_regress tests failed > 2026-10-10 11:10:11 [ERROR] An error occurred. Exit code: 1 > 2026-10-10 11:10:11 [ERROR] Debug logs: For full logs, run: nix log /nix/store/ky6s58j4xv7m4si81vnas6gkgykp3k0i-run-check-harness-psql-orioledb-17.drv