nixbot

builds

cancelled checks.x86_64-linux.psql_17_cli_portable build #303 · raw · eval 517 ms · 27.3 MiB allocated · ·

1these 12 derivations will be built:2  /nix/store/1nzqm2r6w43h898xp3y7cg9p2i4588kl-cargo-pgrx-0.12.6.drv3  /nix/store/phc6w7v4195ysv38g2cic6wc2kf04kcm-pg_graphql-1.6.2.drv4  /nix/store/mp2ifca7mq46yzlk4mmg5x5q5h3z4by3-cargo-pgrx-0.16.1.drv5  /nix/store/q59g94g70gbmybqnhf62wzgzaq9h8jx5-pg_graphql-1.6.1.drv6  /nix/store/qlmsyj10573r3wg0jndybmcws6r2a1yh-pg_graphql-1.5.9.drv7  /nix/store/c5579vysbhr94xiqbzkiznkxvzl8f7yv-cargo-pgrx-0.12.9.drv8  /nix/store/ymdax0w8lzm9h8hzanfwj3q3yyn790hh-pg_graphql-1.5.11.drv9  /nix/store/dzpmmhmwn9pg2x909g77y6w3y8w1x99m-pg_graphql.drv10  /nix/store/ql95xsxfw520ijmd0zc7wqg3vgy6nhgh-postgresql-and-plugins-17.11.drv11  /nix/store/xnszhmv52dr4w0bxxpv9lrvi7ksb9kp9-postgresql-and-plugins-17.11.drv12  /nix/store/zjrmxv9sfxc0dal7lsqn2hvcmwfmddrz-psql_17_cli_portable.drv13  /nix/store/3ngwgixwm908mdq65bil2r1pamg7s2k9-psql_17_cli_portable-portability-check.drv14these 3 paths will be fetched (88.2 MiB download, 1.2 GiB unpacked):15  /nix/store/vdhpf1s1h66vckdmifwfy8jj0mrn0sp6-cargo-pgrx-0.12.6-vendor16  /nix/store/6g7zmwlrrn384ak2bz7agdx5fw5z54x3-cargo-pgrx-0.12.9-vendor17  /nix/store/85g5vq2f89c9s5ikyavv2crq0z1ppl6h-cargo-pgrx-0.16.1-vendor18building '/nix/store/phc6w7v4195ysv38g2cic6wc2kf04kcm-pg_graphql-1.6.2.drv'19pg_graphql-1.6.2> Running phase: unpackPhase20pg_graphql-1.6.2> unpacking source archive /nix/store/2ymsya7ri7iymhzql481a4pni14177m6-source21pg_graphql-1.6.2> source root is source22pg_graphql-1.6.2> Executing cargoSetupPostUnpackHook23pg_graphql-1.6.2> Finished cargoSetupPostUnpackHook24pg_graphql-1.6.2> Running phase: patchPhase25pg_graphql-1.6.2> Executing cargoSetupPostPatchHook26pg_graphql-1.6.2> Validating consistency between /build/source/Cargo.lock and /build/cargo-vendor-dir/Cargo.lock27pg_graphql-1.6.2> Finished cargoSetupPostPatchHook28pg_graphql-1.6.2> Running phase: updateAutotoolsGnuConfigScriptsPhase29pg_graphql-1.6.2> Running phase: configurePhase30pg_graphql-1.6.2> Running phase: buildPhase31pg_graphql-1.6.2> Executing cargo-pgrx buildPhase32pg_graphql-1.6.2>    Validating /nix/store/w828ivs2af99jmnq3vali46cgpban5pa-postgresql-17.11/bin/pg_config33pg_graphql-1.6.2>  Initializing data directory at /build/tmp.GKH7ABe4XE/data-1734pg_graphql-1.6.2> waiting for server to start....2026-10-09 21:44:34.483 GMT [72] LOG:  starting PostgreSQL 17.11 on x86_64-pc-linux-gnu, compiled by gcc (GCC) 15.2.0, 64-bit35pg_graphql-1.6.2> 2026-10-09 21:44:34.486 GMT [72] LOG:  listening on Unix socket "/build/tmp.1iTGPrnIVV/.s.PGSQL.5432"36pg_graphql-1.6.2> 2026-10-09 21:44:34.500 GMT [75] LOG:  database system was shut down at 2026-10-09 21:44:34 GMT37pg_graphql-1.6.2> 2026-10-09 21:44:34.506 GMT [72] LOG:  database system is ready to accept connections38pg_graphql-1.6.2>  done39pg_graphql-1.6.2> server started40pg_graphql-1.6.2> createuser: error: connection to server at "localhost" (127.0.0.1), port 5432 failed: Connection refused41pg_graphql-1.6.2> 	Is the server running on that host and accepting TCP/IP connections?42pg_graphql-1.6.2> waiting for server to shut down....2026-10-09 21:44:34.570 GMT [72] LOG:  received fast shutdown request43pg_graphql-1.6.2> 2026-10-09 21:44:34.574 GMT [72] LOG:  aborting any active transactions44pg_graphql-1.6.2> 2026-10-09 21:44:34.577 GMT [72] LOG:  background worker "logical replication launcher" (PID 78) exited with exit code 145pg_graphql-1.6.2> 2026-10-09 21:44:34.580 GMT [73] LOG:  shutting down46pg_graphql-1.6.2> 2026-10-09 21:44:34.583 GMT [73] LOG:  checkpoint starting: shutdown immediate47pg_graphql-1.6.2> 2026-10-09 21:44:34.587 GMT [73] LOG:  checkpoint complete: wrote 3 buffers (0.0%); 0 WAL file(s) added, 0 removed, 0 recycled; write=0.002 s, sync=0.001 s, total=0.007 s; sync files=2, longest=0.001 s, average=0.001 s; distance=0 kB, estimate=0 kB; lsn=0/14EC340, redo lsn=0/14EC34048pg_graphql-1.6.2> 2026-10-09 21:44:34.593 GMT [72] LOG:  database system is shut down49pg_graphql-1.6.2>  done50pg_graphql-1.6.2> server stopped51pg_graphql-1.6.2>        Using PgConfig("pg17") and `pg_config` from /nix/store/w828ivs2af99jmnq3vali46cgpban5pa-postgresql-17.11/bin/pg_config52pg_graphql-1.6.2>     Building extension with features  pg1753pg_graphql-1.6.2>      Running command "/nix/store/zpsk33pxg9ns15b5lmsmzql8pbwwxsk4-cargo-1.97.1-x86_64-unknown-linux-gnu/bin/cargo" "rustc" "--lib" "--manifest-path" "/build/source/Cargo.toml" "--release" "--features" " pg17" "--no-default-features" "--message-format=json-render-diagnostics" "--frozen" "-j" "4" "--" "-C" "link-arg=-Wl,--no-gc-sections"54pg_graphql-1.6.2>    Compiling proc-macro2 v1.0.10155pg_graphql-1.6.2>    Compiling quote v1.0.4756pg_graphql-1.6.2>    Compiling unicode-ident v1.0.1657pg_graphql-1.6.2>    Compiling stable_deref_trait v1.2.058pg_graphql-1.6.2>    Compiling libc v0.2.18959pg_graphql-1.6.2>    Compiling serde_core v1.0.22960pg_graphql-1.6.2>    Compiling writeable v0.5.561pg_graphql-1.6.2>    Compiling litemap v0.7.462pg_graphql-1.6.2>    Compiling memchr v2.7.463pg_graphql-1.6.2>    Compiling eyre v0.6.1264building '/nix/store/c5579vysbhr94xiqbzkiznkxvzl8f7yv-cargo-pgrx-0.12.9.drv'65cargo-pgrx-0.12.9> Running phase: unpackPhase66cargo-pgrx-0.12.9> unpacking source archive /nix/store/wy0x78y65aygpzysnn6f23g2y924h25f-cargo-pgrx-0.12.9.tar.gz67cargo-pgrx-0.12.9> source root is cargo-pgrx-0.12.9.tar.gz68cargo-pgrx-0.12.9> Executing cargoSetupPostUnpackHook69pg_graphql-1.6.2>    Compiling thiserror v2.0.1670pg_graphql-1.6.2>    Compiling icu_locid_transform_data v1.5.071pg_graphql-1.6.2>    Compiling zmij v1.0.2372pg_graphql-1.6.2>    Compiling syn v2.0.11773pg_graphql-1.6.2>    Compiling syn v3.0.374pg_graphql-1.6.2>    Compiling serde v1.0.22975cargo-pgrx-0.12.9> Finished cargoSetupPostUnpackHook76cargo-pgrx-0.12.9> Running phase: patchPhase77cargo-pgrx-0.12.9> Executing cargoSetupPostPatchHook78cargo-pgrx-0.12.9> Validating consistency between /build/cargo-pgrx-0.12.9.tar.gz/Cargo.lock and /build/cargo-pgrx-0.12.9-vendor/Cargo.lock79cargo-pgrx-0.12.9> Finished cargoSetupPostPatchHook80cargo-pgrx-0.12.9> Running phase: updateAutotoolsGnuConfigScriptsPhase81cargo-pgrx-0.12.9> Running phase: configurePhase82cargo-pgrx-0.12.9> Running phase: buildPhase83cargo-pgrx-0.12.9> Executing cargoBuildHook84cargo-pgrx-0.12.9> cargoBuildHook flags: -j 4 --target x86_64-unknown-linux-gnu --offline --profile release85pg_graphql-1.6.2>    Compiling icu_properties_data v1.5.086pg_graphql-1.6.2>    Compiling serde_json v1.0.15187cargo-pgrx-0.12.9>    Compiling libc v0.2.15588cargo-pgrx-0.12.9>    Compiling proc-macro2 v1.0.8389cargo-pgrx-0.12.9>    Compiling unicode-ident v1.0.1290cargo-pgrx-0.12.9>    Compiling serde v1.0.20291pg_graphql-1.6.2>    Compiling icu_normalizer_data v1.5.092pg_graphql-1.6.2>    Compiling shlex v1.3.093cargo-pgrx-0.12.9>    Compiling cfg-if v1.0.094cargo-pgrx-0.12.9>    Compiling pkg-config v0.3.2995pg_graphql-1.6.2>    Compiling utf16_iter v1.0.596pg_graphql-1.6.2>    Compiling write16 v1.0.097pg_graphql-1.6.2>    Compiling winnow v1.0.498pg_graphql-1.6.2>    Compiling utf8_iter v1.0.499cargo-pgrx-0.12.9>    Compiling vcpkg v0.2.15100pg_graphql-1.6.2>    Compiling smallvec v1.13.2101pg_graphql-1.6.2>    Compiling glob v0.3.2102pg_graphql-1.6.2>    Compiling toml_parser v1.1.3+spec-1.1.0103building '/nix/store/1nzqm2r6w43h898xp3y7cg9p2i4588kl-cargo-pgrx-0.12.6.drv'104cargo-pgrx-0.12.6> Running phase: unpackPhase105cargo-pgrx-0.12.6> unpacking source archive /nix/store/zk9jn47mpq69bkr8rk51jpq102s041zl-cargo-pgrx-0.12.6.tar.gz106cargo-pgrx-0.12.6> source root is cargo-pgrx-0.12.6.tar.gz107cargo-pgrx-0.12.6> Executing cargoSetupPostUnpackHook108pg_graphql-1.6.2>    Compiling clang-sys v1.8.1109cargo-pgrx-0.12.9>    Compiling quote v1.0.36110cargo-pgrx-0.12.9>    Compiling jobserver v0.1.31111pg_graphql-1.6.2>    Compiling serde_spanned v1.1.1112cargo-pgrx-0.12.9>    Compiling syn v2.0.65113cargo-pgrx-0.12.9>    Compiling cc v1.0.83114cargo-pgrx-0.12.9>    Compiling once_cell v1.19.0115cargo-pgrx-0.12.9>    Compiling log v0.4.20116cargo-pgrx-0.12.6> Finished cargoSetupPostUnpackHook117cargo-pgrx-0.12.6> Running phase: patchPhase118cargo-pgrx-0.12.6> Executing cargoSetupPostPatchHook119cargo-pgrx-0.12.6> Validating consistency between /build/cargo-pgrx-0.12.6.tar.gz/Cargo.lock and /build/cargo-pgrx-0.12.6-vendor/Cargo.lock120cargo-pgrx-0.12.9>    Compiling hashbrown v0.14.3121cargo-pgrx-0.12.6> Finished cargoSetupPostPatchHook122cargo-pgrx-0.12.6> Running phase: updateAutotoolsGnuConfigScriptsPhase123cargo-pgrx-0.12.9>    Compiling rustix v0.38.30124cargo-pgrx-0.12.6> Running phase: configurePhase125pg_graphql-1.6.2>    Compiling toml_writer v1.1.2+spec-1.1.0126cargo-pgrx-0.12.6> Running phase: buildPhase127cargo-pgrx-0.12.6> Executing cargoBuildHook128cargo-pgrx-0.12.6> cargoBuildHook flags: -j 4 --target x86_64-unknown-linux-gnu --offline --profile release129pg_graphql-1.6.2>    Compiling anyhow v1.0.95130cargo-pgrx-0.12.6>    Compiling libc v0.2.155131cargo-pgrx-0.12.6>    Compiling proc-macro2 v1.0.83132cargo-pgrx-0.12.6>    Compiling unicode-ident v1.0.12133cargo-pgrx-0.12.6>    Compiling serde v1.0.202134cargo-pgrx-0.12.6>    Compiling cfg-if v1.0.0135cargo-pgrx-0.12.9>    Compiling memchr v2.7.1136cargo-pgrx-0.12.6>    Compiling pkg-config v0.3.29137building '/nix/store/mp2ifca7mq46yzlk4mmg5x5q5h3z4by3-cargo-pgrx-0.16.1.drv'138pg_graphql-1.6.2>    Compiling serde_derive v1.0.229139pg_graphql-1.6.2>    Compiling once_cell v1.21.3140cargo-pgrx-0.16.1> Running phase: unpackPhase141cargo-pgrx-0.16.1> unpacking source archive /nix/store/qjn0zry40lds0vf29y90yn8zb74qmgrl-cargo-pgrx-0.16.1.tar.gz142cargo-pgrx-0.12.9>    Compiling equivalent v1.0.1143cargo-pgrx-0.16.1> source root is cargo-pgrx-0.16.1.tar.gz144cargo-pgrx-0.16.1> Executing cargoSetupPostUnpackHook145cargo-pgrx-0.12.9>    Compiling indexmap v2.1.0146pg_graphql-1.6.2>    Compiling synstructure v0.13.1147pg_graphql-1.6.2>    Compiling indenter v0.3.3148cargo-pgrx-0.12.9>    Compiling tinyvec_macros v0.1.1149cargo-pgrx-0.12.9>    Compiling linux-raw-sys v0.4.13150cargo-pgrx-0.12.6>    Compiling once_cell v1.19.0151cargo-pgrx-0.12.6>    Compiling vcpkg v0.2.15152cargo-pgrx-0.12.6>    Compiling quote v1.0.36153pg_graphql-1.6.2>    Compiling cc v1.2.11154cargo-pgrx-0.12.9>    Compiling bitflags v2.4.2155pg_graphql-1.6.2>    Compiling aho-corasick v1.1.3156cargo-pgrx-0.12.9>    Compiling tinyvec v1.6.0157cargo-pgrx-0.12.6>    Compiling syn v2.0.65158cargo-pgrx-0.12.6>    Compiling jobserver v0.1.31159cargo-pgrx-0.12.6>    Compiling cc v1.0.83160cargo-pgrx-0.16.1> Finished cargoSetupPostUnpackHook161cargo-pgrx-0.16.1> Running phase: patchPhase162cargo-pgrx-0.16.1> Executing cargoSetupPostPatchHook163cargo-pgrx-0.16.1> Validating consistency between /build/cargo-pgrx-0.16.1.tar.gz/Cargo.lock and /build/cargo-pgrx-0.16.1-vendor/Cargo.lock164cargo-pgrx-0.16.1> Finished cargoSetupPostPatchHook165cargo-pgrx-0.16.1> Running phase: updateAutotoolsGnuConfigScriptsPhase166cargo-pgrx-0.16.1> Running phase: configurePhase167cargo-pgrx-0.16.1> Running phase: buildPhase168cargo-pgrx-0.16.1> Executing cargoBuildHook169cargo-pgrx-0.16.1> cargoBuildHook flags: -j 4 --target x86_64-unknown-linux-gnu --offline --profile release170cargo-pgrx-0.12.6>    Compiling log v0.4.20171cargo-pgrx-0.12.9>    Compiling openssl-sys v0.9.99172cargo-pgrx-0.12.6>    Compiling hashbrown v0.14.3173cargo-pgrx-0.12.6>    Compiling rustix v0.38.30174cargo-pgrx-0.16.1>    Compiling proc-macro2 v1.0.101175cargo-pgrx-0.16.1>    Compiling unicode-ident v1.0.19176cargo-pgrx-0.16.1>    Compiling libc v0.2.176177cargo-pgrx-0.16.1>    Compiling cfg-if v1.0.3178cargo-pgrx-0.16.1>    Compiling find-msvc-tools v0.1.2179cargo-pgrx-0.16.1>    Compiling shlex v1.3.0180cargo-pgrx-0.16.1>    Compiling serde_core v1.0.226181cargo-pgrx-0.16.1>    Compiling memchr v2.7.6182cargo-pgrx-0.12.6>    Compiling equivalent v1.0.1183cargo-pgrx-0.12.9>    Compiling libz-sys v1.1.16184cargo-pgrx-0.12.6>    Compiling memchr v2.7.1185cargo-pgrx-0.12.9>    Compiling thiserror v1.0.56186cargo-pgrx-0.12.6>    Compiling indexmap v2.1.0187pg_graphql-1.6.2>    Compiling zerofrom-derive v0.1.5188cargo-pgrx-0.12.9>    Compiling serde_json v1.0.117189cargo-pgrx-0.12.6>    Compiling tinyvec_macros v0.1.1190cargo-pgrx-0.12.6>    Compiling bitflags v2.4.2191pg_graphql-1.6.2>    Compiling yoke-derive v0.7.5192cargo-pgrx-0.12.6>    Compiling linux-raw-sys v0.4.13193cargo-pgrx-0.16.1>    Compiling quote v1.0.40194cargo-pgrx-0.12.6>    Compiling tinyvec v1.6.0195cargo-pgrx-0.12.9>    Compiling unicode-normalization v0.1.22196pg_graphql-1.6.2>    Compiling zerovec-derive v0.10.3197cargo-pgrx-0.12.9>    Compiling ring v0.17.7198cargo-pgrx-0.16.1>    Compiling syn v2.0.106199cargo-pgrx-0.16.1>    Compiling once_cell v1.21.3200pg_graphql-1.6.2>    Compiling displaydoc v0.2.5201cargo-pgrx-0.12.6>    Compiling libz-sys v1.1.16202cargo-pgrx-0.16.1>    Compiling pin-project-lite v0.2.16203cargo-pgrx-0.16.1>    Compiling jobserver v0.1.34204cargo-pgrx-0.12.9>    Compiling percent-encoding v2.3.1205cargo-pgrx-0.16.1>    Compiling log v0.4.28206cargo-pgrx-0.12.9>    Compiling unicode-bidi v0.3.15207cargo-pgrx-0.16.1>    Compiling cc v1.2.38208cargo-pgrx-0.12.9>    Compiling ryu v1.0.18209cargo-pgrx-0.12.6>    Compiling openssl-sys v0.9.99210cargo-pgrx-0.16.1>    Compiling pkg-config v0.3.32211pg_graphql-1.6.2>    Compiling zerofrom v0.1.5212pg_graphql-1.6.2>    Compiling icu_provider_macros v1.5.0213cargo-pgrx-0.12.6>    Compiling serde_json v1.0.117214cargo-pgrx-0.12.9>    Compiling itoa v1.0.11215cargo-pgrx-0.12.6>    Compiling thiserror v1.0.56216pg_graphql-1.6.2>    Compiling yoke v0.7.5217pg_graphql-1.6.2>    Compiling thiserror-impl v2.0.16218cargo-pgrx-0.12.9>    Compiling crossbeam-utils v0.8.19219pg_graphql-1.6.2>    Compiling zerovec v0.10.4220cargo-pgrx-0.16.1>    Compiling serde v1.0.226221pg_graphql-1.6.2>    Compiling owo-colors v4.2.2222cargo-pgrx-0.12.9>    Compiling idna v0.5.0223cargo-pgrx-0.12.6>    Compiling unicode-normalization v0.1.22224cargo-pgrx-0.12.9>    Compiling serde_derive v1.0.202225pg_graphql-1.6.2>    Compiling regex-syntax v0.8.11226cargo-pgrx-0.16.1>    Compiling itoa v1.0.15227pg_graphql-1.6.2>    Compiling toml_datetime v0.7.0228cargo-pgrx-0.12.9>    Compiling thiserror-impl v1.0.56229cargo-pgrx-0.16.1>    Compiling stable_deref_trait v1.2.0230cargo-pgrx-0.16.1>    Compiling typenum v1.18.0231cargo-pgrx-0.12.6>    Compiling ring v0.17.7232pg_graphql-1.6.2>    Compiling percent-encoding v2.3.2233cargo-pgrx-0.16.1>    Compiling bytes v1.10.1234pg_graphql-1.6.2>    Compiling winnow v0.7.13235cargo-pgrx-0.12.6>    Compiling unicode-bidi v0.3.15236cargo-pgrx-0.16.1>    Compiling version_check v0.9.5237pg_graphql-1.6.2>    Compiling tinystr v0.7.6238cargo-pgrx-0.12.6>    Compiling crossbeam-utils v0.8.19239pg_graphql-1.6.2>    Compiling icu_locid v1.5.0240cargo-pgrx-0.16.1>    Compiling generic-array v0.14.7241pg_graphql-1.6.2>    Compiling icu_collections v1.5.0242cargo-pgrx-0.16.1>    Compiling bitflags v2.9.4243cargo-pgrx-0.12.6>    Compiling itoa v1.0.11244cargo-pgrx-0.16.1>    Compiling smallvec v1.15.1245cargo-pgrx-0.12.6>    Compiling percent-encoding v2.3.1246cargo-pgrx-0.12.9>    Compiling form_urlencoded v1.2.1247cargo-pgrx-0.12.9>    Compiling aho-corasick v1.1.2248cargo-pgrx-0.12.6>    Compiling ryu v1.0.18249cargo-pgrx-0.16.1>    Compiling subtle v2.6.1250cargo-pgrx-0.16.1>    Compiling equivalent v1.0.2251pg_graphql-1.6.2>    Compiling icu_provider v1.5.0252cargo-pgrx-0.16.1>    Compiling futures-core v0.3.31253cargo-pgrx-0.16.1>    Compiling hashbrown v0.16.0254cargo-pgrx-0.16.1>    Compiling tracing-core v0.1.34255cargo-pgrx-0.12.9>    Compiling libssh2-sys v0.3.0256cargo-pgrx-0.12.6>    Compiling form_urlencoded v1.2.1257cargo-pgrx-0.12.6>    Compiling idna v0.5.0258cargo-pgrx-0.12.6>    Compiling serde_derive v1.0.202259pg_graphql-1.6.2>    Compiling icu_locid_transform v1.5.0260cargo-pgrx-0.12.6>    Compiling thiserror-impl v1.0.56261cargo-pgrx-0.12.6>    Compiling aho-corasick v1.1.2262pg_graphql-1.6.2>    Compiling minimal-lexical v0.2.1263pg_graphql-1.6.2>    Compiling cfg-if v1.0.0264cargo-pgrx-0.12.9>    Compiling getrandom v0.2.12265pg_graphql-1.6.2>    Compiling is_ci v1.2.0266pg_graphql-1.6.2>    Compiling supports-color v3.0.2267cargo-pgrx-0.16.1>    Compiling synstructure v0.13.2268cargo-pgrx-0.12.9>    Compiling semver v1.0.21269pg_graphql-1.6.2>    Compiling nom v7.1.3270pg_graphql-1.6.2>    Compiling libloading v0.8.6271cargo-pgrx-0.12.9>    Compiling utf8parse v0.2.1272pg_graphql-1.6.2>    Compiling icu_properties v1.5.1273cargo-pgrx-0.12.9>    Compiling regex-syntax v0.8.2274cargo-pgrx-0.16.1>    Compiling indexmap v2.11.4275cargo-pgrx-0.16.1>    Compiling socket2 v0.6.0276pg_graphql-1.6.2>    Compiling toml v0.9.5277cargo-pgrx-0.16.1>    Compiling mio v1.0.4278pg_graphql-1.6.2>    Compiling regex-automata v0.4.16279cargo-pgrx-0.12.6>    Compiling libssh2-sys v0.3.0280cargo-pgrx-0.16.1>    Compiling fnv v1.0.7281cargo-pgrx-0.16.1>    Compiling http v1.3.1282cargo-pgrx-0.16.1>    Compiling tokio v1.47.1283cargo-pgrx-0.16.1>    Compiling crypto-common v0.1.6284pg_graphql-1.6.2>    Compiling form_urlencoded v1.2.2285cargo-pgrx-0.16.1>    Compiling ring v0.17.14286cargo-pgrx-0.12.6>    Compiling getrandom v0.2.12287cargo-pgrx-0.16.1>    Compiling serde_derive v1.0.226288cargo-pgrx-0.12.6>    Compiling utf8parse v0.2.1289cargo-pgrx-0.12.6>    Compiling semver v1.0.21290cargo-pgrx-0.12.6>    Compiling regex-syntax v0.8.2291pg_graphql-1.6.2>    Compiling toml_datetime v1.1.1+spec-1.1.0292cargo-pgrx-0.12.6>    Compiling anstyle-parse v0.2.3293cargo-pgrx-0.16.1>    Compiling zerofrom-derive v0.1.6294pg_graphql-1.6.2>    Compiling icu_normalizer v1.5.0295cargo-pgrx-0.12.6>    Compiling url v2.5.0296pg_graphql-1.6.2>    Compiling bindgen v0.72.1297pg_graphql-1.6.2>    Compiling either v1.13.0298pg_graphql-1.6.2>    Compiling syn v1.0.109299pg_graphql-1.6.2>    Compiling idna_adapter v1.2.0300pg_graphql-1.6.2>    Compiling idna v1.1.0301pg_graphql-1.6.2>    Compiling itoa v1.0.14302cargo-pgrx-0.16.1>    Compiling zeroize_derive v1.4.2303pg_graphql-1.6.2>    Compiling regex v1.13.1304cargo-pgrx-0.16.1>    Compiling zerofrom v0.1.6305pg_graphql-1.6.2>    Compiling url v2.5.8306pg_graphql-1.6.2>    Compiling itertools v0.13.0307cargo-pgrx-0.16.1>    Compiling yoke-derive v0.8.0308cargo-pgrx-0.12.9>    Compiling regex-automata v0.4.5309cargo-pgrx-0.16.1>    Compiling zeroize v1.8.1310cargo-pgrx-0.16.1>    Compiling zerovec-derive v0.11.1311pg_graphql-1.6.2>    Compiling toml v1.1.4+spec-1.1.0312pg_graphql-1.6.2>    Compiling pathsearch v0.2.0313cargo-pgrx-0.12.9>    Compiling toml_datetime v0.6.5314cargo-pgrx-0.12.9>    Compiling serde_spanned v0.6.5315cargo-pgrx-0.12.6>    Compiling regex-automata v0.4.5316cargo-pgrx-0.16.1>    Compiling yoke v0.8.0317pg_graphql-1.6.2>    Compiling cexpr v0.6.0318cargo-pgrx-0.16.1>    Compiling displaydoc v0.2.5319pg_graphql-1.6.2>    Compiling cargo_toml v0.22.3320cargo-pgrx-0.16.1>    Compiling rustls-pki-types v1.12.0321cargo-pgrx-0.12.9>    Compiling anstyle-parse v0.2.3322cargo-pgrx-0.16.1>    Compiling zerovec v0.11.4323pg_graphql-1.6.2>    Compiling hashbrown v0.17.1324cargo-pgrx-0.12.9>    Compiling url v2.5.0325cargo-pgrx-0.16.1>    Compiling tracing-attributes v0.1.30326cargo-pgrx-0.16.1>    Compiling writeable v0.6.1327pg_graphql-1.6.2>    Compiling rustc-hash v2.1.1328cargo-pgrx-0.12.6>    Compiling toml_datetime v0.6.5329cargo-pgrx-0.16.1>    Compiling tinystr v0.8.1330pg_graphql-1.6.2>    Compiling equivalent v1.0.1331pg_graphql-1.6.2>    Compiling same-file v1.0.6332cargo-pgrx-0.12.6>    Compiling serde_spanned v0.6.5333pg_graphql-1.6.2>    Compiling foldhash v0.1.5334cargo-pgrx-0.16.1>    Compiling rustix v1.1.2335pg_graphql-1.6.2>    Compiling bitflags v2.13.1336cargo-pgrx-0.16.1>    Compiling futures-sink v0.3.31337pg_graphql-1.6.2>    Compiling hashbrown v0.15.2338cargo-pgrx-0.12.6>    Compiling tracing-core v0.1.32339cargo-pgrx-0.16.1>    Compiling litemap v0.8.0340cargo-pgrx-0.16.1>    Compiling crc32fast v1.5.0341cargo-pgrx-0.16.1>    Compiling adler2 v2.0.1342cargo-pgrx-0.16.1>    Compiling tracing v0.1.41343cargo-pgrx-0.16.1>    Compiling miniz_oxide v0.8.9344cargo-pgrx-0.12.9>    Compiling tracing-core v0.1.32345pg_graphql-1.6.2>    Compiling walkdir v2.5.0346cargo-pgrx-0.12.6>    Compiling anstyle v1.0.4347pg_graphql-1.6.2>    Compiling indexmap v2.14.0348cargo-pgrx-0.16.1>    Compiling icu_locale_core v2.0.0349cargo-pgrx-0.12.6>    Compiling colorchoice v1.0.0350cargo-pgrx-0.16.1>    Compiling potential_utf v0.1.3351cargo-pgrx-0.12.6>    Compiling regex-syntax v0.6.29352cargo-pgrx-0.12.9>    Compiling adler v1.0.2353cargo-pgrx-0.12.9>    Compiling anstyle-query v1.0.2354cargo-pgrx-0.12.9>    Compiling camino v1.1.6355cargo-pgrx-0.12.9>    Compiling regex-syntax v0.6.29356cargo-pgrx-0.16.1>    Compiling zerotrie v0.2.2357cargo-pgrx-0.12.9>    Compiling anstyle v1.0.4358pg_graphql-1.6.2>    Compiling pgrx-pg-config v0.19.2359cargo-pgrx-0.12.9>    Compiling colorchoice v1.0.0360cargo-pgrx-0.12.9>    Compiling untrusted v0.9.0361cargo-pgrx-0.12.9>    Compiling spin v0.9.8362cargo-pgrx-0.16.1>    Compiling icu_properties_data v2.0.1363cargo-pgrx-0.12.9>    Compiling anstream v0.6.11364cargo-pgrx-0.12.9>    Compiling miniz_oxide v0.7.1365cargo-pgrx-0.16.1>    Compiling linux-raw-sys v0.11.0366cargo-pgrx-0.12.9>    Compiling crossbeam-epoch v0.9.18367cargo-pgrx-0.12.6>    Compiling spin v0.9.8368cargo-pgrx-0.12.6>    Compiling anstyle-query v1.0.2369cargo-pgrx-0.12.6>    Compiling adler v1.0.2370cargo-pgrx-0.12.6>    Compiling untrusted v0.9.0371cargo-pgrx-0.16.1>    Compiling percent-encoding v2.3.2372pg_graphql-1.6.2>    Compiling fnv v1.0.7373pg_graphql-1.6.2>    Compiling fixedbitset v0.5.7374cargo-pgrx-0.12.6>    Compiling camino v1.1.6375cargo-pgrx-0.12.6>    Compiling regex-automata v0.1.10376pg_graphql-1.6.2>    Compiling rand_core v0.10.1377cargo-pgrx-0.16.1>    Compiling icu_normalizer_data v2.0.0378pg_graphql-1.6.2>    Compiling shlex v2.0.1379cargo-pgrx-0.12.6>    Compiling miniz_oxide v0.7.1380cargo-pgrx-0.16.1>    Compiling icu_provider v2.0.0381cargo-pgrx-0.12.9>    Compiling regex-automata v0.1.10382pg_graphql-1.6.2>    Compiling strsim v0.10.0383cargo-pgrx-0.16.1>    Compiling icu_collections v2.0.0384cargo-pgrx-0.12.9>    Compiling regex v1.10.3385pg_graphql-1.6.2>    Compiling getrandom v0.4.2386pg_graphql-1.6.2>    Compiling unicode-segmentation v1.12.0387cargo-pgrx-0.16.1>    Compiling block-buffer v0.10.4388pg_graphql-1.6.2>    Compiling ident_case v1.0.1389cargo-pgrx-0.16.1>    Compiling getrandom v0.2.16390cargo-pgrx-0.16.1>    Compiling slab v0.4.11391pg_graphql-1.6.2>    Compiling convert_case v0.11.0392cargo-pgrx-0.16.1>    Compiling untrusted v0.9.0393cargo-pgrx-0.16.1>    Compiling httparse v1.10.1394cargo-pgrx-0.16.1>    Compiling zlib-rs v0.5.2395pg_graphql-1.6.2>    Compiling pgrx-bindgen v0.19.2396cargo-pgrx-0.12.6>    Compiling anstream v0.6.11397cargo-pgrx-0.16.1>    Compiling digest v0.10.7398pg_graphql-1.6.2>    Compiling darling_core v0.14.4399cargo-pgrx-0.12.6>    Compiling regex v1.10.3400cargo-pgrx-0.16.1>    Compiling crossbeam-utils v0.8.21401cargo-pgrx-0.12.9>    Compiling tracing-attributes v0.1.27402cargo-pgrx-0.16.1>    Compiling ryu v1.0.20403pg_graphql-1.6.2>    Compiling petgraph v0.8.3404cargo-pgrx-0.16.1>    Compiling pin-utils v0.1.0405cargo-pgrx-0.16.1>    Compiling rustls v0.23.32406cargo-pgrx-0.16.1>    Compiling icu_normalizer v2.0.0407cargo-pgrx-0.12.6>    Compiling crossbeam-epoch v0.9.18408cargo-pgrx-0.16.1>    Compiling libz-rs-sys v0.5.2409cargo-pgrx-0.12.9>    Compiling terminal_size v0.3.0410cargo-pgrx-0.12.6>    Compiling tracing-attributes v0.1.27411cargo-pgrx-0.16.1>    Compiling flate2 v1.1.2412cargo-pgrx-0.12.9>    Compiling libgit2-sys v0.15.2+1.6.4413cargo-pgrx-0.12.6>    Compiling terminal_size v0.3.0414pg_graphql-1.6.2>    Compiling cee-scape v0.2.0415cargo-pgrx-0.12.9>    Compiling crc32fast v1.3.2416pg_graphql-1.6.2>    Compiling unescape v0.1.0417cargo-pgrx-0.16.1>    Compiling icu_properties v2.0.1418cargo-pgrx-0.12.9>    Compiling heck v0.4.1419pg_graphql-1.6.2>    Compiling thiserror v1.0.69420cargo-pgrx-0.12.9>    Compiling clap_lex v0.6.0421pg_graphql-1.6.2>    Compiling radium v0.7.0422cargo-pgrx-0.12.9>    Compiling openssl-probe v0.1.5423cargo-pgrx-0.12.6>    Compiling libgit2-sys v0.15.2+1.6.4424cargo-pgrx-0.12.9>    Compiling eyre v0.6.12425cargo-pgrx-0.16.1>    Compiling http-body v1.0.1426cargo-pgrx-0.12.9>    Compiling rayon-core v1.12.1427cargo-pgrx-0.16.1>    Compiling cpufeatures v0.2.17428cargo-pgrx-0.12.9>    Compiling pin-project-lite v0.2.13429cargo-pgrx-0.12.6>    Compiling rayon-core v1.12.1430cargo-pgrx-0.12.9>    Compiling lazy_static v1.4.0431cargo-pgrx-0.16.1>    Compiling serde_json v1.0.145432cargo-pgrx-0.12.9>    Compiling overload v0.1.1433cargo-pgrx-0.12.6>    Compiling lazy_static v1.4.0434cargo-pgrx-0.12.6>    Compiling overload v0.1.1435cargo-pgrx-0.12.9>    Compiling strsim v0.10.0436cargo-pgrx-0.12.9>    Compiling anyhow v1.0.79437pg_graphql-1.6.2>    Compiling pgrx-sql-entity-graph v0.19.2438cargo-pgrx-0.12.6>    Compiling eyre v0.6.12439cargo-pgrx-0.12.6>    Compiling openssl-probe v0.1.5440cargo-pgrx-0.12.6>    Compiling clap_lex v0.6.0441cargo-pgrx-0.16.1>    Compiling futures-io v0.3.31442cargo-pgrx-0.16.1>    Compiling openssl-probe v0.1.6443cargo-pgrx-0.12.6>    Compiling crc32fast v1.3.2444cargo-pgrx-0.16.1>    Compiling futures-task v0.3.31445cargo-pgrx-0.12.6>    Compiling heck v0.4.1446cargo-pgrx-0.12.6>    Compiling anyhow v1.0.79447cargo-pgrx-0.16.1>    Compiling vcpkg v0.2.15448cargo-pgrx-0.16.1>    Compiling thiserror v2.0.16449cargo-pgrx-0.12.9>    Compiling clap_builder v4.4.18450cargo-pgrx-0.16.1>    Compiling futures-util v0.3.31451cargo-pgrx-0.12.6>    Compiling strsim v0.10.0452cargo-pgrx-0.12.6>    Compiling pin-project-lite v0.2.13453cargo-pgrx-0.12.9>    Compiling nu-ansi-term v0.46.0454pg_graphql-1.6.2>    Compiling darling_macro v0.14.4455cargo-pgrx-0.12.9>    Compiling sharded-slab v0.1.7456cargo-pgrx-0.12.6>    Compiling tracing v0.1.40457cargo-pgrx-0.12.6>    Compiling clap_builder v4.4.18458cargo-pgrx-0.16.1>    Compiling openssl-sys v0.9.109459cargo-pgrx-0.16.1>    Compiling idna_adapter v1.2.1460pg_graphql-1.6.2>    Compiling pgrx-pg-sys v0.19.2461cargo-pgrx-0.12.9>    Compiling tracing v0.1.40462cargo-pgrx-0.12.9>    Compiling clap_derive v4.4.7463cargo-pgrx-0.12.6>    Compiling clap_derive v4.4.7464cargo-pgrx-0.16.1>    Compiling form_urlencoded v1.2.2465cargo-pgrx-0.12.9>    Compiling matchers v0.1.0466cargo-pgrx-0.12.9>    Compiling crossbeam-deque v0.8.5467cargo-pgrx-0.16.1>    Compiling tokio-util v0.7.16468cargo-pgrx-0.12.9>    Compiling tracing-log v0.2.0469pg_graphql-1.6.2>    Compiling thiserror-impl v1.0.69470cargo-pgrx-0.12.6>    Compiling nu-ansi-term v0.46.0471cargo-pgrx-0.16.1>    Compiling thiserror-impl v2.0.16472cargo-pgrx-0.12.6>    Compiling sharded-slab v0.1.7473cargo-pgrx-0.12.9>    Compiling cargo-platform v0.1.6474pg_graphql-1.6.2>    Compiling tap v1.0.1475pg_graphql-1.6.2>    Compiling wyz v0.5.1476cargo-pgrx-0.12.9>    Compiling thread_local v1.1.7477cargo-pgrx-0.12.6>    Compiling crossbeam-deque v0.8.5478cargo-pgrx-0.16.1>    Compiling zstd-sys v2.0.16+zstd.1.5.7479cargo-pgrx-0.12.9>    Compiling base64 v0.21.7480cargo-pgrx-0.12.6>    Compiling matchers v0.1.0481cargo-pgrx-0.12.9>    Compiling winnow v0.5.40482cargo-pgrx-0.12.6>    Compiling tracing-log v0.2.0483cargo-pgrx-0.16.1>    Compiling aho-corasick v1.1.3484cargo-pgrx-0.12.9>    Compiling indenter v0.3.3485cargo-pgrx-0.12.9>    Compiling smallvec v1.13.1486cargo-pgrx-0.16.1>    Compiling winnow v0.7.13487cargo-pgrx-0.12.6>    Compiling cargo-platform v0.1.6488pg_graphql-1.6.2>    Compiling darling v0.14.4489cargo-pgrx-0.12.9>    Compiling rustls v0.21.10490cargo-pgrx-0.16.1>    Compiling regex-syntax v0.8.6491cargo-pgrx-0.12.9>    Compiling bitflags v1.3.2492cargo-pgrx-0.12.6>    Compiling thread_local v1.1.7493cargo-pgrx-0.12.9>    Compiling winnow v0.6.5494cargo-pgrx-0.12.6>    Compiling autocfg v1.1.0495pg_graphql-1.6.2>    Compiling enum-map-derive v0.17.0496cargo-pgrx-0.12.6>    Compiling winnow v0.6.5497cargo-pgrx-0.12.6>    Compiling rustls v0.21.10498cargo-pgrx-0.12.9>    Compiling autocfg v1.1.0499cargo-pgrx-0.12.6>    Compiling winnow v0.5.40500cargo-pgrx-0.12.6>    Compiling indenter v0.3.3501cargo-pgrx-0.12.9>    Compiling indexmap v1.9.3502cargo-pgrx-0.12.6>    Compiling base64 v0.21.7503cargo-pgrx-0.12.9>    Compiling clap v4.4.18504cargo-pgrx-0.12.9>    Compiling tracing-subscriber v0.3.18505cargo-pgrx-0.12.9>    Compiling toml_edit v0.19.15506cargo-pgrx-0.16.1>    Compiling tower-service v0.3.3507cargo-pgrx-0.12.6>    Compiling smallvec v1.13.1508cargo-pgrx-0.16.1>    Compiling try-lock v0.2.5509cargo-pgrx-0.16.1>    Compiling camino v1.2.0510cargo-pgrx-0.12.9>    Compiling toml_edit v0.22.12511cargo-pgrx-0.12.6>    Compiling bitflags v1.3.2512pg_graphql-1.6.2>    Compiling pgrx-macros v0.19.2513cargo-pgrx-0.12.6>    Compiling toml_edit v0.22.12514cargo-pgrx-0.16.1>    Compiling atomic-waker v1.1.2515cargo-pgrx-0.16.1>    Compiling utf8_iter v1.0.4516cargo-pgrx-0.16.1>    Compiling utf8parse v0.2.2517cargo-pgrx-0.16.1>    Compiling base64 v0.22.1518cargo-pgrx-0.12.6>    Compiling toml_edit v0.19.15519cargo-pgrx-0.16.1>    Compiling anstyle-parse v0.2.7520pg_graphql-1.6.2>    Compiling bytes v1.11.1521cargo-pgrx-0.16.1>    Compiling idna v1.1.0522pg_graphql-1.6.2>    Compiling funty v2.0.0523pg_graphql-1.6.2>    Compiling half v1.8.3524pg_graphql-1.6.2>    Compiling cpufeatures v0.3.0525cargo-pgrx-0.12.6>    Compiling tracing-subscriber v0.3.18526pg_graphql-1.6.2>    Compiling chacha20 v0.10.0527cargo-pgrx-0.16.1>    Compiling rustls-webpki v0.103.6528cargo-pgrx-0.16.1>    Compiling h2 v0.4.12529pg_graphql-1.6.2>    Compiling serde_cbor v0.11.2530cargo-pgrx-0.16.1>    Compiling want v0.3.1531cargo-pgrx-0.16.1>    Compiling regex-automata v0.4.11532pg_graphql-1.6.2>    Compiling bitvec v1.0.1533pg_graphql-1.6.2>    Compiling combine v4.6.7534cargo-pgrx-0.12.9>    Compiling rustls-pemfile v1.0.4535cargo-pgrx-0.12.6>    Compiling rustls-pemfile v1.0.4536pg_graphql-1.6.2>    Compiling enum-map v2.7.3537pg_graphql-1.6.2>    Compiling cached_proc_macro v0.18.1538cargo-pgrx-0.12.6>    Compiling indexmap v1.9.3539pg_graphql-1.6.2>    Compiling uuid v1.24.0540cargo-pgrx-0.12.6>    Compiling clap v4.4.18541cargo-pgrx-0.12.9>    Compiling bzip2-sys v0.1.11+1.0.8542pg_graphql-1.6.2>    Compiling instant v0.1.13543cargo-pgrx-0.12.9>    Compiling backtrace v0.3.69544pg_graphql-1.6.2>    Compiling seahash v4.1.0545pg_graphql-1.6.2>    Compiling cached_proc_macro_types v0.1.1546cargo-pgrx-0.12.9>    Compiling is-terminal v0.4.12547cargo-pgrx-0.12.9>    Compiling gimli v0.28.1548pg_graphql-1.6.2>    Compiling hashbrown v0.14.5549cargo-pgrx-0.12.9>    Compiling either v1.9.0550cargo-pgrx-0.12.9>    Compiling home v0.5.9551cargo-pgrx-0.12.9>    Compiling is_ci v1.1.1552pg_graphql-1.6.2>    Compiling itertools v0.10.5553cargo-pgrx-0.12.9>    Compiling byteorder v1.5.0554cargo-pgrx-0.12.9>    Compiling supports-color v2.1.0555pg_graphql-1.6.2>    Compiling cached v0.46.1556cargo-pgrx-0.12.9>    Compiling socks v0.3.4557pg_graphql-1.6.2>    Compiling graphql-parser v0.4.1558cargo-pgrx-0.12.9>    Compiling rayon v1.8.1559pg_graphql-1.6.2>    Compiling rand v0.10.1560cargo-pgrx-0.12.6>    Compiling bzip2-sys v0.1.11+1.0.8561cargo-pgrx-0.12.6>    Compiling backtrace v0.3.69562cargo-pgrx-0.12.6>    Compiling is-terminal v0.4.12563cargo-pgrx-0.12.6>    Compiling byteorder v1.5.0564cargo-pgrx-0.12.6>    Compiling either v1.9.0565cargo-pgrx-0.12.9>    Compiling flate2 v1.0.28566cargo-pgrx-0.12.6>    Compiling gimli v0.28.1567cargo-pgrx-0.12.6>    Compiling home v0.5.9568pg_graphql-1.6.2>    Compiling bimap v0.6.3569cargo-pgrx-0.12.6>    Compiling is_ci v1.1.1570cargo-pgrx-0.12.6>    Compiling supports-color v2.1.0571cargo-pgrx-0.12.6>    Compiling socks v0.3.4572pg_graphql-1.6.2>    Compiling lazy_static v1.5.0573pg_graphql-1.6.2>    Compiling base64 v0.13.1574cargo-pgrx-0.12.6>    Compiling rayon v1.8.1575cargo-pgrx-0.12.6>    Compiling flate2 v1.0.28576cargo-pgrx-0.12.6>    Compiling rustls-native-certs v0.6.3577cargo-pgrx-0.12.9>    Compiling addr2line v0.21.0578cargo-pgrx-0.12.9>    Compiling rustls-native-certs v0.6.3579cargo-pgrx-0.12.9>    Compiling toml v0.8.10580cargo-pgrx-0.12.6>    Compiling tracing-error v0.2.0581cargo-pgrx-0.12.9>    Compiling toml v0.7.8582cargo-pgrx-0.12.6>    Compiling toml v0.7.8583cargo-pgrx-0.12.9>    Compiling tracing-error v0.2.0584cargo-pgrx-0.12.9>    Compiling hex v0.4.3585cargo-pgrx-0.12.6>    Compiling toml v0.8.10586cargo-pgrx-0.12.9>    Compiling smol_str v0.2.1587cargo-pgrx-0.12.9>    Compiling object v0.32.2588cargo-pgrx-0.12.9>    Compiling atty v0.2.14589cargo-pgrx-0.16.1>    Compiling rustls-native-certs v0.8.1590cargo-pgrx-0.12.9>    Compiling fixedbitset v0.4.2591cargo-pgrx-0.12.9>    Compiling concolor-query v0.0.4592cargo-pgrx-0.12.6>    Compiling addr2line v0.21.0593cargo-pgrx-0.12.9>    Compiling owo-colors v3.5.0594cargo-pgrx-0.16.1>    Compiling futures-channel v0.3.31595cargo-pgrx-0.12.6>    Compiling hex v0.4.3596cargo-pgrx-0.16.1>    Compiling anstyle-query v1.1.4597cargo-pgrx-0.16.1>    Compiling getrandom v0.3.3598cargo-pgrx-0.12.6>    Compiling smol_str v0.2.1599cargo-pgrx-0.16.1>    Compiling anstyle v1.0.11600cargo-pgrx-0.12.6>    Compiling object v0.32.2601cargo-pgrx-0.12.9>    Compiling unicode-segmentation v1.10.1602cargo-pgrx-0.12.6>    Compiling atty v0.2.14603cargo-pgrx-0.12.6>    Compiling rustc-demangle v0.1.23604cargo-pgrx-0.12.9>    Compiling rustc-hash v1.1.0605cargo-pgrx-0.12.9>    Compiling hashbrown v0.12.3606cargo-pgrx-0.12.6>    Compiling unicode-segmentation v1.10.1607cargo-pgrx-0.12.9>    Compiling webpki-roots v0.25.3608cargo-pgrx-0.12.9>    Compiling rustc-demangle v0.1.23609cargo-pgrx-0.16.1>    Compiling is_terminal_polyfill v1.70.1610cargo-pgrx-0.16.1>    Compiling colorchoice v1.0.4611cargo-pgrx-0.16.1>    Compiling anstream v0.6.20612cargo-pgrx-0.12.9>    Compiling convert_case v0.6.0613cargo-pgrx-0.12.6>    Compiling concolor-query v0.0.4614cargo-pgrx-0.12.6>    Compiling hashbrown v0.12.3615cargo-pgrx-0.16.1>    Compiling hyper v1.7.0616cargo-pgrx-0.12.6>    Compiling fixedbitset v0.4.2617cargo-pgrx-0.12.6>    Compiling rustc-hash v1.1.0618cargo-pgrx-0.12.9>    Compiling color-spantrace v0.2.1619cargo-pgrx-0.12.6>    Compiling webpki-roots v0.25.3620cargo-pgrx-0.12.6>    Compiling owo-colors v3.5.0621cargo-pgrx-0.12.6>    Compiling petgraph v0.6.4622cargo-pgrx-0.12.9>    Compiling concolor-control v0.0.7623cargo-pgrx-0.12.9>    Compiling petgraph v0.6.4624cargo-pgrx-0.12.9>    Compiling cargo_toml v0.19.1625cargo-pgrx-0.12.6>    Compiling concolor-control v0.0.7626cargo-pgrx-0.12.6>    Compiling color-spantrace v0.2.1627cargo-pgrx-0.12.6>    Compiling convert_case v0.6.0628cargo-pgrx-0.12.9>    Compiling owo-colors v4.0.0629cargo-pgrx-0.12.6>    Compiling cargo_toml v0.19.1630pg_graphql-1.6.2>    Compiling pgrx v0.19.2631cargo-pgrx-0.12.9>    Compiling pathsearch v0.2.0632cargo-pgrx-0.12.6>    Compiling owo-colors v4.0.0633cargo-pgrx-0.12.9>    Compiling clap-cargo v0.12.0634cargo-pgrx-0.12.6>    Compiling pathsearch v0.2.0635cargo-pgrx-0.16.1>    Compiling url v2.5.7636cargo-pgrx-0.12.6>    Compiling clap-cargo v0.12.0637cargo-pgrx-0.12.9>    Compiling cargo_metadata v0.18.1638cargo-pgrx-0.12.6>    Compiling cargo_metadata v0.18.1639cargo-pgrx-0.16.1>    Compiling crossbeam-epoch v0.9.18640cargo-pgrx-0.16.1>    Compiling sha2 v0.10.9641cargo-pgrx-0.16.1>    Compiling terminal_size v0.4.3642cargo-pgrx-0.16.1>    Compiling webpki-roots v1.0.2643cargo-pgrx-0.12.6>    Compiling cargo_metadata v0.15.4644cargo-pgrx-0.16.1>    Compiling sync_wrapper v1.0.2645cargo-pgrx-0.16.1>    Compiling semver v1.0.27646cargo-pgrx-0.12.9>    Compiling cargo_metadata v0.15.4647cargo-pgrx-0.16.1>    Compiling thiserror v1.0.69648cargo-pgrx-0.16.1>    Compiling heck v0.5.0649cargo-pgrx-0.16.1>    Compiling lazy_static v1.5.0650cargo-pgrx-0.16.1>    Compiling is_ci v1.2.0651cargo-pgrx-0.16.1>    Compiling eyre v0.6.12652cargo-pgrx-0.16.1>    Compiling compression-core v0.4.29653cargo-pgrx-0.16.1>    Compiling tower-layer v0.3.3654cargo-pgrx-0.16.1>    Compiling owo-colors v4.2.2655cargo-pgrx-0.16.1>    Compiling strsim v0.11.1656cargo-pgrx-0.16.1>    Compiling anyhow v1.0.100657cargo-pgrx-0.16.1>    Compiling clap_lex v0.7.5658cargo-pgrx-0.16.1>    Compiling zstd-safe v7.2.4659cargo-pgrx-0.16.1>    Compiling ipnet v2.11.0660cargo-pgrx-0.16.1>    Compiling rayon-core v1.13.0661pg_graphql-1.6.2>    Compiling pg_graphql v1.6.2 (/build/source)662cargo-pgrx-0.16.1>    Compiling hyper-util v0.1.17663cargo-pgrx-0.16.1>    Compiling clap_builder v4.5.48664cargo-pgrx-0.12.9>    Compiling env_proxy v0.4.1665cargo-pgrx-0.16.1>    Compiling tower v0.5.2666cargo-pgrx-0.12.9>    Compiling xattr v1.3.1667cargo-pgrx-0.12.9>    Compiling filetime v0.2.23668cargo-pgrx-0.16.1>    Compiling compression-codecs v0.4.30669cargo-pgrx-0.16.1>    Compiling clap_derive v4.5.47670cargo-pgrx-0.12.9>    Compiling subprocess v0.2.9671cargo-pgrx-0.16.1>    Compiling supports-color v3.0.2672cargo-pgrx-0.16.1>    Compiling sharded-slab v0.1.7673cargo-pgrx-0.12.6>    Compiling env_proxy v0.4.1674cargo-pgrx-0.12.6>    Compiling xattr v1.3.1675cargo-pgrx-0.12.6>    Compiling subprocess v0.2.9676cargo-pgrx-0.16.1>    Compiling crossbeam-deque v0.8.6677cargo-pgrx-0.12.9>    Compiling dunce v1.0.4678cargo-pgrx-0.12.9>    Compiling termcolor v1.4.1679cargo-pgrx-0.12.6>    Compiling filetime v0.2.23680cargo-pgrx-0.16.1>    Compiling matchers v0.2.0681cargo-pgrx-0.16.1>    Compiling tokio-rustls v0.26.3682cargo-pgrx-0.12.6>    Compiling termcolor v1.4.1683cargo-pgrx-0.12.9>    Compiling scopeguard v1.2.0684cargo-pgrx-0.16.1>    Compiling cargo-platform v0.1.9685cargo-pgrx-0.12.9>    Compiling unescape v0.1.0686cargo-pgrx-0.16.1>    Compiling thiserror-impl v1.0.69687cargo-pgrx-0.12.9>    Compiling pathdiff v0.2.1688cargo-pgrx-0.12.9>    Compiling cargo-pgrx v0.12.9 (/build/cargo-pgrx-0.12.9.tar.gz)689cargo-pgrx-0.12.9>    Compiling fastrand v2.0.1690cargo-pgrx-0.16.1>    Compiling inout v0.1.4691cargo-pgrx-0.12.6>    Compiling pathdiff v0.2.1692cargo-pgrx-0.12.9>    Compiling xml-rs v0.8.19693cargo-pgrx-0.16.1>    Compiling tracing-log v0.2.0694cargo-pgrx-0.12.6>    Compiling xml-rs v0.8.19695cargo-pgrx-0.16.1>    Compiling thread_local v1.1.9696cargo-pgrx-0.12.6>    Compiling scopeguard v1.2.0697cargo-pgrx-0.12.6>    Compiling unescape v0.1.0698cargo-pgrx-0.16.1>    Compiling nu-ansi-term v0.50.1699cargo-pgrx-0.12.6>    Compiling fastrand v2.0.1700cargo-pgrx-0.12.9>    Compiling serde-xml-rs v0.6.0701cargo-pgrx-0.12.6>    Compiling cargo-pgrx v0.12.6 (/build/cargo-pgrx-0.12.6.tar.gz)702cargo-pgrx-0.16.1>    Compiling foreign-types-shared v0.1.1703cargo-pgrx-0.16.1>    Compiling crc-catalog v2.4.0704cargo-pgrx-0.16.1>    Compiling object v0.36.7705cargo-pgrx-0.12.9>    Compiling tempfile v3.9.0706cargo-pgrx-0.16.1>    Compiling openssl v0.10.73707cargo-pgrx-0.12.9>    Compiling pgrx-sql-entity-graph v0.12.9708cargo-pgrx-0.16.1>    Compiling powerfmt v0.2.0709cargo-pgrx-0.16.1>    Compiling iri-string v0.7.8710cargo-pgrx-0.12.9>    Compiling jobslot v0.2.14711cargo-pgrx-0.16.1>    Compiling indenter v0.3.4712cargo-pgrx-0.16.1>    Compiling either v1.15.0713cargo-pgrx-0.12.6>    Compiling dunce v1.0.4714cargo-pgrx-0.12.6>    Compiling tempfile v3.9.0715cargo-pgrx-0.12.9>    Compiling tar v0.4.40716cargo-pgrx-0.16.1>    Compiling deranged v0.5.4717cargo-pgrx-0.12.6>    Compiling serde-xml-rs v0.6.0718cargo-pgrx-0.12.9>    Compiling clap-cargo v0.14.0719cargo-pgrx-0.12.6>    Compiling pgrx-sql-entity-graph v0.12.6720cargo-pgrx-0.12.6>    Compiling jobslot v0.2.14721cargo-pgrx-0.12.6>    Compiling tar v0.4.40722cargo-pgrx-0.16.1>    Compiling tower-http v0.6.6723cargo-pgrx-0.12.6>    Compiling clap-cargo v0.14.0724cargo-pgrx-0.12.9>    Compiling pgrx-pg-config v0.12.9725cargo-pgrx-0.16.1>    Compiling crc v3.3.0726cargo-pgrx-0.16.1>    Compiling foreign-types v0.3.2727cargo-pgrx-0.16.1>    Compiling tracing-subscriber v0.3.20728cargo-pgrx-0.12.9>    Compiling color-eyre v0.6.2729cargo-pgrx-0.12.6>    Compiling pgrx-pg-config v0.12.6730cargo-pgrx-0.12.6>    Compiling color-eyre v0.6.2731cargo-pgrx-0.16.1>    Compiling cipher v0.4.4732cargo-pgrx-0.16.1>    Compiling hyper-rustls v0.27.7733cargo-pgrx-0.16.1>    Compiling clap v4.5.48734cargo-pgrx-0.16.1>    Compiling async-compression v0.4.31735cargo-pgrx-0.16.1>    Compiling toml_parser v1.0.3736cargo-pgrx-0.16.1>    Compiling serde_urlencoded v0.7.1737cargo-pgrx-0.16.1>    Compiling http-body-util v0.1.3738cargo-pgrx-0.16.1>    Compiling hmac v0.12.1739cargo-pgrx-0.16.1>    Compiling serde_spanned v0.6.9740cargo-pgrx-0.16.1>    Compiling toml_datetime v0.6.11741cargo-pgrx-0.16.1>    Compiling openssl-macros v0.1.1742cargo-pgrx-0.16.1>    Compiling serde_spanned v1.0.2743cargo-pgrx-0.16.1>    Compiling toml_datetime v0.7.2744cargo-pgrx-0.16.1>    Compiling bzip2-sys v0.1.13+1.0.8745cargo-pgrx-0.16.1>    Compiling allocator-api2 v0.2.21746cargo-pgrx-0.16.1>    Compiling color-spantrace v0.3.0747cargo-pgrx-0.16.1>    Compiling toml_write v0.1.2748cargo-pgrx-0.16.1>    Compiling bumpalo v3.19.0749cargo-pgrx-0.16.1>    Compiling base64ct v1.8.0750cargo-pgrx-0.16.1>    Compiling gimli v0.31.1751cargo-pgrx-0.16.1>    Compiling time-core v0.1.6752cargo-pgrx-0.16.1>    Compiling simd-adler32 v0.3.7753cargo-pgrx-0.16.1>    Compiling foldhash v0.1.5754cargo-pgrx-0.16.1>    Compiling toml_writer v1.0.3755cargo-pgrx-0.16.1>    Compiling libbz2-rs-sys v0.2.2756cargo-pgrx-0.16.1>    Compiling num-conv v0.1.0757cargo-pgrx-0.16.1>    Compiling native-tls v0.2.14758cargo-pgrx-0.16.1>    Compiling time v0.3.44759cargo-pgrx-0.16.1>    Compiling bzip2 v0.6.0760cargo-pgrx-0.16.1>    Compiling toml v0.9.7761cargo-pgrx-0.16.1>    Compiling addr2line v0.24.2762cargo-pgrx-0.16.1>    Compiling hashbrown v0.15.5763cargo-pgrx-0.16.1>    Compiling zopfli v0.8.2764cargo-pgrx-0.16.1>    Compiling pem-rfc7468 v0.7.0765cargo-pgrx-0.12.9>    Compiling bzip2 v0.4.4766cargo-pgrx-0.16.1>    Compiling toml_edit v0.22.27767pg_graphql-1.6.2>     Finished `release` profile [optimized] target(s) in 2m 34s768pg_graphql-1.6.2>   Installing extension769pg_graphql-1.6.2>      Copying control file to /nix/store/8fjhm3ib8g4p8a3kbx82i5jn871inrxf-pg_graphql-1.6.2/nix/store/w828ivs2af99jmnq3vali46cgpban5pa-postgresql-17.11/share/postgresql/extension/pg_graphql.control770pg_graphql-1.6.2>      Copying shared library to /nix/store/8fjhm3ib8g4p8a3kbx82i5jn871inrxf-pg_graphql-1.6.2/nix/store/23h47m2xklxbni4g761fwzkq6vpv7sqh-postgresql-17.11-lib/lib/pg_graphql.so771pg_graphql-1.6.2>   Discovered 5 SQL entities: 0 schemas (0 unique), 1 functions, 0 types, 0 enums, 4 sqls, 0 ords, 0 hashes, 0 aggregates, 0 triggers772pg_graphql-1.6.2>      Writing SQL entities to /nix/store/8fjhm3ib8g4p8a3kbx82i5jn871inrxf-pg_graphql-1.6.2/nix/store/w828ivs2af99jmnq3vali46cgpban5pa-postgresql-17.11/share/postgresql/extension/pg_graphql--1.6.2.sql773pg_graphql-1.6.2>     Finished installing pg_graphql774pg_graphql-1.6.2> buildPhase completed in 2 minutes 36 seconds775pg_graphql-1.6.2> Running phase: checkPhase776pg_graphql-1.6.2>    Validating /nix/store/w828ivs2af99jmnq3vali46cgpban5pa-postgresql-17.11/bin/pg_config777pg_graphql-1.6.2>  Initializing data directory at /build/tmp.bIQKUDCLXW/data-17778cargo-pgrx-0.12.9>    Compiling sct v0.7.1779cargo-pgrx-0.12.9>    Compiling rustls-webpki v0.101.7780pg_graphql-1.6.2> waiting for server to start....2026-10-09 21:47:10.440 GMT [3106] LOG:  starting PostgreSQL 17.11 on x86_64-pc-linux-gnu, compiled by gcc (GCC) 15.2.0, 64-bit781pg_graphql-1.6.2> 2026-10-09 21:47:10.441 GMT [3106] LOG:  listening on Unix socket "/build/tmp.N3Jh9TLYLi/.s.PGSQL.5432"782cargo-pgrx-0.12.6>    Compiling bzip2 v0.4.4783pg_graphql-1.6.2> 2026-10-09 21:47:10.461 GMT [3109] LOG:  database system was shut down at 2026-10-09 21:47:10 GMT784pg_graphql-1.6.2> 2026-10-09 21:47:10.469 GMT [3106] LOG:  database system is ready to accept connections785pg_graphql-1.6.2>  done786pg_graphql-1.6.2> server started787pg_graphql-1.6.2> createuser: error: connection to server at "localhost" (127.0.0.1), port 5432 failed: Connection refused788pg_graphql-1.6.2> 	Is the server running on that host and accepting TCP/IP connections?789pg_graphql-1.6.2> waiting for server to shut down....2026-10-09 21:47:10.523 GMT [3106] LOG:  received fast shutdown request790pg_graphql-1.6.2> 2026-10-09 21:47:10.524 GMT [3106] LOG:  aborting any active transactions791pg_graphql-1.6.2> 2026-10-09 21:47:10.527 GMT [3106] LOG:  background worker "logical replication launcher" (PID 3112) exited with exit code 1792pg_graphql-1.6.2> 2026-10-09 21:47:10.533 GMT [3107] LOG:  shutting down793pg_graphql-1.6.2> 2026-10-09 21:47:10.537 GMT [3107] LOG:  checkpoint starting: shutdown immediate794pg_graphql-1.6.2> 2026-10-09 21:47:10.555 GMT [3107] LOG:  checkpoint complete: wrote 3 buffers (0.0%); 0 WAL file(s) added, 0 removed, 0 recycled; write=0.001 s, sync=0.004 s, total=0.023 s; sync files=2, longest=0.002 s, average=0.002 s; distance=0 kB, estimate=0 kB; lsn=0/14EC340, redo lsn=0/14EC340795pg_graphql-1.6.2> 2026-10-09 21:47:10.565 GMT [3106] LOG:  database system is shut down796pg_graphql-1.6.2>  done797pg_graphql-1.6.2> server stopped798pg_graphql-1.6.2>    Validating /build/tmp.asV4n4PeEC/17/bin/pg_config799pg_graphql-1.6.2>  Initializing data directory at /build/tmp.asV4n4PeEC/data-17800pg_graphql-1.6.2>        Using PgConfig("pg17") and `pg_config` from /build/tmp.asV4n4PeEC/17/bin/pg_config801pg_graphql-1.6.2>     Building extension with features pg17802pg_graphql-1.6.2>      Running command "/nix/store/zpsk33pxg9ns15b5lmsmzql8pbwwxsk4-cargo-1.97.1-x86_64-unknown-linux-gnu/bin/cargo" "rustc" "--lib" "--manifest-path" "/build/source/Cargo.toml" "--release" "--features" "pg17" "--no-default-features" "--message-format=json-render-diagnostics" "--frozen" "-j" "4" "--" "-C" "link-arg=-Wl,--no-gc-sections"803pg_graphql-1.6.2>     Finished `release` profile [optimized] target(s) in 0.16s804pg_graphql-1.6.2>   Installing extension805pg_graphql-1.6.2>      Copying control file to /build/tmp.asV4n4PeEC/17/share/postgresql/extension/pg_graphql.control806pg_graphql-1.6.2>      Copying shared library to /build/tmp.asV4n4PeEC/17/lib/pg_graphql.so807pg_graphql-1.6.2>   Discovered 5 SQL entities: 0 schemas (0 unique), 1 functions, 0 types, 0 enums, 4 sqls, 0 ords, 0 hashes, 0 aggregates, 0 triggers808pg_graphql-1.6.2>      Writing SQL entities to /build/tmp.asV4n4PeEC/17/share/postgresql/extension/pg_graphql--1.6.2.sql809pg_graphql-1.6.2>     Finished installing pg_graphql810pg_graphql-1.6.2> ++ mktemp -d811pg_graphql-1.6.2> + TMPDIR=/build/tmp.QFXn8YZZV4812pg_graphql-1.6.2> + export PGDATA=/build/tmp.QFXn8YZZV4813pg_graphql-1.6.2> + PGDATA=/build/tmp.QFXn8YZZV4814pg_graphql-1.6.2> + export PGHOST=/build/tmp.QFXn8YZZV4815pg_graphql-1.6.2> + PGHOST=/build/tmp.QFXn8YZZV4816pg_graphql-1.6.2> + export PGUSER=postgres817pg_graphql-1.6.2> + PGUSER=postgres818pg_graphql-1.6.2> + export PGDATABASE=postgres819pg_graphql-1.6.2> + PGDATABASE=postgres820pg_graphql-1.6.2> + export PGTZ=UTC821pg_graphql-1.6.2> + PGTZ=UTC822pg_graphql-1.6.2> + export PG_COLOR=auto823pg_graphql-1.6.2> + PG_COLOR=auto824pg_graphql-1.6.2> + trap 'pg_ctl stop -m i' sigint sigterm exit825pg_graphql-1.6.2> + rm -rf /build/tmp.QFXn8YZZV4826pg_graphql-1.6.2> + initdb --no-locale --encoding=UTF8 --nosync -U postgres827pg_graphql-1.6.2> The files belonging to this database system will be owned by user "nixbld".828pg_graphql-1.6.2> This user must also own the server process.829pg_graphql-1.6.2> 830pg_graphql-1.6.2> The database cluster will be initialized with locale "C".831pg_graphql-1.6.2> The default text search configuration will be set to "english".832pg_graphql-1.6.2> 833pg_graphql-1.6.2> Data page checksums are disabled.834pg_graphql-1.6.2> 835pg_graphql-1.6.2> creating directory /build/tmp.QFXn8YZZV4 ... ok836pg_graphql-1.6.2> creating subdirectories ... ok837pg_graphql-1.6.2> selecting dynamic shared memory implementation ... posix838pg_graphql-1.6.2> selecting default "max_connections" ... 100839pg_graphql-1.6.2> selecting default "shared_buffers" ... 128MB840pg_graphql-1.6.2> selecting default time zone ... UTC841pg_graphql-1.6.2> creating configuration files ... ok842pg_graphql-1.6.2> running bootstrap script ... ok843cargo-pgrx-0.12.9>    Compiling ureq v2.8.0844cargo-pgrx-0.16.1>    Compiling pbkdf2 v0.12.2845cargo-pgrx-0.16.1>    Compiling reqwest v0.12.23846pg_graphql-1.6.2> performing post-bootstrap initialization ... ok847pg_graphql-1.6.2> 848pg_graphql-1.6.2> Sync to disk skipped.849pg_graphql-1.6.2> The data directory might become corrupt if the operating system crashes.850pg_graphql-1.6.2> 851pg_graphql-1.6.2> initdb: warning: enabling "trust" authentication for local connections852pg_graphql-1.6.2> initdb: hint: You can change this by editing pg_hba.conf or using the option -A, or --auth-local and --auth-host, the next time you run initdb.853pg_graphql-1.6.2> 854pg_graphql-1.6.2> Success. You can now start the database server using:855pg_graphql-1.6.2> 856pg_graphql-1.6.2>     /build/tmp.asV4n4PeEC/17/bin/pg_ctl -D /build/tmp.QFXn8YZZV4 -l logfile start857pg_graphql-1.6.2> 858pg_graphql-1.6.2> + pg_ctl start -o '-F -c listen_addresses="" -c log_min_messages=WARNING -k /build/tmp.QFXn8YZZV4'859pg_graphql-1.6.2> waiting for server to start....2026-10-09 21:47:14.303 UTC [3164] LOG:  starting PostgreSQL 17.11 on x86_64-pc-linux-gnu, compiled by gcc (GCC) 15.2.0, 64-bit860pg_graphql-1.6.2> 2026-10-09 21:47:14.304 UTC [3164] LOG:  listening on Unix socket "/build/tmp.QFXn8YZZV4/.s.PGSQL.5432"861pg_graphql-1.6.2> 2026-10-09 21:47:14.306 UTC [3167] LOG:  database system was shut down at 2026-10-09 21:47:14 UTC862pg_graphql-1.6.2> 2026-10-09 21:47:14.310 UTC [3164] LOG:  database system is ready to accept connections863cargo-pgrx-0.16.1>    Compiling zstd v0.13.3864pg_graphql-1.6.2>  done865pg_graphql-1.6.2> server started866pg_graphql-1.6.2> + createdb contrib_regression867pg_graphql-1.6.2> + TESTDIR=test868pg_graphql-1.6.2> +++ pg_config --pgxs869pg_graphql-1.6.2> ++ dirname /nix/store/w828ivs2af99jmnq3vali46cgpban5pa-postgresql-17.11/lib/pgxs/src/makefiles/pgxs.mk870pg_graphql-1.6.2> + PGXS=/nix/store/w828ivs2af99jmnq3vali46cgpban5pa-postgresql-17.11/lib/pgxs/src/makefiles871pg_graphql-1.6.2> + REGRESS=/nix/store/w828ivs2af99jmnq3vali46cgpban5pa-postgresql-17.11/lib/pgxs/src/makefiles/../test/regress/pg_regress872pg_graphql-1.6.2> + '[' 0 -ne 0 ']'873pg_graphql-1.6.2> ++ ls test/sql874pg_graphql-1.6.2> ++ sort875pg_graphql-1.6.2> ++ sed -e 's/\..*$//'876pg_graphql-1.6.2> + TESTS=$'aggregate\naggregate_directive\naliases\nallow_camel_names\narray_args_and_return_types\nbigint_is_string\nbuiltin_directives\ncomment_directive\ncomment_directive_description\ncompound_filters\ndepth_limit\nempty_mutations\nenum_mappings\nextend_type_with_function\nextend_type_with_function_relation\nextend_type_with_generated_column\nfilter_by_node_id\nfragment_on_mutation\nfragment_on_query\nfunction_calls\nfunction_calls_default_args\nfunction_calls_unsupported\nfunction_return_row_is_selectable\nfunction_return_view_has_pkey\ninflection_fields\ninflection_function\ninflection_relationships\ninflection_types\nintrospection\nissue_163\nissue_170\nissue_225\nissue_237_field_merging\nissue_237_field_merging_mismatched\nissue_300\nissue_306\nissue_312\nissue_334_ambiguous_function\nissue_337\nissue_339_function_return_json\nissue_339_function_return_table\nissue_353_too_many_fields\nissue_370_citext_as_string\nissue_373\nissue_377_enum_search_path\nissue_409_fkey_rls_nullability\nissue_444\nissue_463\nissue_511\nissue_533\nissue_542_partial_unique\nissue_551_too_many_fields\nissue_557_1_to_1_nullability\nissue_581_missing_desc_on_schema\nissue_fragment_spread_cycles\njson_is_stringified\nmax_page_size\nmax_rows_directive\nmulti_column_primary_key\nmultiple_mutations\nmultiple_queries\nmutation_delete\nmutation_delete_variable\nmutation_insert\nmutation_update\nnull_argument\nomit_exotic_types\nomit_weird_names\noperation_name\noverride_enum_name\noverride_field_name\noverride_func_field_name\noverride_relationship_field_name\noverride_type_name\npage_info\npermissions_connection_column\npermissions_functions\npermissions_node_column\npermissions_table_level\npermissions_types\nprimary_key_is_required\nprimary_key_queries\nrelationship_one_to_one\nresolve___schema\nresolve___type\nresolve___typename\nresolve_array_type\nresolve_connection_filter\nresolve_connection_named\nresolve_connection_order_by\nresolve_connection_pagination_args\nresolve_connection_to_conn\nresolve_connection_to_node\nresolve_error_connection_edge_no_field\nresolve_error_connection_edge_node_no_field\nresolve_error_connection_no_field\nresolve_error_from_parser\nresolve_error_mutation_no_field\nresolve_error_node_no_field\nresolve_error_query_no_field\nresolve_fragment\nresolve_graphiql_schema\nresolve_one\nroundtrip_types\nrow_level_security\nsqli_connection\nstring_filters\ntest_error_anon_and_named_operations\ntest_error_invalid_offset\ntest_error_multiple_anon_operations\ntest_error_mutation_transpilation\ntest_error_operation_name_not_found\ntest_error_operation_names_not_unique\ntest_error_query_transpilation\ntest_error_subscription\ntest_query__type\ntotal_count\ntype_bigfloat\ntype_modifier_max_length\ntype_opaque\nvariable_default\nviews_integration'877pg_graphql-1.6.2> + psql -v ON_ERROR_STOP=1 -f test/fixtures.sql -d contrib_regression878cargo-pgrx-0.12.6>    Compiling rustls-webpki v0.101.7879pg_graphql-1.6.2> psql:test/fixtures.sql:1: NOTICE:  extension "pg_graphql" does not exist, skipping880pg_graphql-1.6.2> DROP EXTENSION881pg_graphql-1.6.2> CREATE EXTENSION882pg_graphql-1.6.2> COMMENT883pg_graphql-1.6.2> CREATE FUNCTION884pg_graphql-1.6.2> + /nix/store/w828ivs2af99jmnq3vali46cgpban5pa-postgresql-17.11/lib/pgxs/src/makefiles/../test/regress/pg_regress --use-existing --dbname=contrib_regression --inputdir=test aggregate aggregate_directive aliases allow_camel_names array_args_and_return_types bigint_is_string builtin_directives comment_directive comment_directive_description compound_filters depth_limit empty_mutations enum_mappings extend_type_with_function extend_type_with_function_relation extend_type_with_generated_column filter_by_node_id fragment_on_mutation fragment_on_query function_calls function_calls_default_args function_calls_unsupported function_return_row_is_selectable function_return_view_has_pkey inflection_fields inflection_function inflection_relationships inflection_types introspection issue_163 issue_170 issue_225 issue_237_field_merging issue_237_field_merging_mismatched issue_300 issue_306 issue_312 issue_334_ambiguous_function issue_337 issue_339_function_return_json issue_339_function_return_table issue_353_too_many_fields issue_370_citext_as_string issue_373 issue_377_enum_search_path issue_409_fkey_rls_nullability issue_444 issue_463 issue_511 issue_533 issue_542_partial_unique issue_551_too_many_fields issue_557_1_to_1_nullability issue_581_missing_desc_on_schema issue_fragment_spread_cycles json_is_stringified max_page_size max_rows_directive multi_column_primary_key multiple_mutations multiple_queries mutation_delete mutation_delete_variable mutation_insert mutation_update null_argument omit_exotic_types omit_weird_names operation_name override_enum_name override_field_name override_func_field_name override_relationship_field_name override_type_name page_info permissions_connection_column permissions_functions permissions_node_column permissions_table_level permissions_types primary_key_is_required primary_key_queries relationship_one_to_one resolve___schema resolve___type resolve___typename resolve_array_type resolve_connection_filter resolve_connection_named resolve_connection_order_by resolve_connection_pagination_args resolve_connection_to_conn resolve_connection_to_node resolve_error_connection_edge_no_field resolve_error_connection_edge_node_no_field resolve_error_connection_no_field resolve_error_from_parser resolve_error_mutation_no_field resolve_error_node_no_field resolve_error_query_no_field resolve_fragment resolve_graphiql_schema resolve_one roundtrip_types row_level_security sqli_connection string_filters test_error_anon_and_named_operations test_error_invalid_offset test_error_multiple_anon_operations test_error_mutation_transpilation test_error_operation_name_not_found test_error_operation_names_not_unique test_error_query_transpilation test_error_subscription test_query__type total_count type_bigfloat type_modifier_max_length type_opaque variable_default views_integration885pg_graphql-1.6.2> # using postmaster on /build/tmp.QFXn8YZZV4, default port886pg_graphql-1.6.2> ok 1         - aggregate                                  92 ms887cargo-pgrx-0.16.1>    Compiling rayon v1.11.0888pg_graphql-1.6.2> ok 2         - aggregate_directive                        96 ms889pg_graphql-1.6.2> ok 3         - aliases                                    72 ms890pg_graphql-1.6.2> ok 4         - allow_camel_names                          66 ms891cargo-pgrx-0.16.1>    Compiling aes v0.8.4892cargo-pgrx-0.12.6>    Compiling sct v0.7.1893pg_graphql-1.6.2> ok 5         - array_args_and_return_types              1794 ms894pg_graphql-1.6.2> ok 6         - bigint_is_string                           58 ms895cargo-pgrx-0.16.1>    Compiling tracing-error v0.2.1896pg_graphql-1.6.2> ok 7         - builtin_directives                         70 ms897pg_graphql-1.6.2> ok 8         - comment_directive                          13 ms898pg_graphql-1.6.2> ok 9         - comment_directive_description              62 ms899pg_graphql-1.6.2> ok 10        - compound_filters                          291 ms900pg_graphql-1.6.2> ok 11        - depth_limit                                64 ms901pg_graphql-1.6.2> ok 12        - empty_mutations                            64 ms902pg_graphql-1.6.2> ok 13        - enum_mappings                              66 ms903pg_graphql-1.6.2> ok 14        - extend_type_with_function                  64 ms904cargo-pgrx-0.16.1>    Compiling lzma-rust2 v0.13.0905pg_graphql-1.6.2> ok 15        - extend_type_with_function_relation        164 ms906pg_graphql-1.6.2> ok 16        - extend_type_with_generated_column          62 ms907pg_graphql-1.6.2> ok 17        - filter_by_node_id                          68 ms908pg_graphql-1.6.2> ok 18        - fragment_on_mutation                       58 ms909pg_graphql-1.6.2> ok 19        - fragment_on_query                          60 ms910cargo-pgrx-0.16.1>    Compiling crossbeam-channel v0.5.15911cargo-pgrx-0.12.6>    Compiling ureq v2.8.0912cargo-pgrx-0.16.1>    Compiling sha1 v0.10.6913cargo-pgrx-0.16.1>    Compiling smol_str v0.3.2914pg_graphql-1.6.2> ok 20        - function_calls                           1507 ms915pg_graphql-1.6.2> ok 21        - function_calls_default_args               123 ms916cargo-pgrx-0.16.1>    Compiling toml-span v0.4.1917pg_graphql-1.6.2> ok 22        - function_calls_unsupported                330 ms918pg_graphql-1.6.2> ok 23        - function_return_row_is_selectable          99 ms919pg_graphql-1.6.2> ok 24        - function_return_view_has_pkey              88 ms920pg_graphql-1.6.2> ok 25        - inflection_fields                         152 ms921pg_graphql-1.6.2> ok 26        - inflection_function                       142 ms922pg_graphql-1.6.2> ok 27        - inflection_relationships                  208 ms923pg_graphql-1.6.2> ok 28        - inflection_types                          162 ms924pg_graphql-1.6.2> ok 29        - introspection                             290 ms925pg_graphql-1.6.2> ok 30        - issue_163                                  59 ms926pg_graphql-1.6.2> ok 31        - issue_170                                  60 ms927pg_graphql-1.6.2> ok 32        - issue_225                                  57 ms928pg_graphql-1.6.2> ok 33        - issue_237_field_merging                   109 ms929pg_graphql-1.6.2> ok 34        - issue_237_field_merging_mismatched        102 ms930pg_graphql-1.6.2> ok 35        - issue_300                                  62 ms931pg_graphql-1.6.2> ok 36        - issue_306                                  64 ms932pg_graphql-1.6.2> ok 37        - issue_312                                  57 ms933pg_graphql-1.6.2> ok 38        - issue_334_ambiguous_function               59 ms934pg_graphql-1.6.2> ok 39        - issue_337                                  92 ms935pg_graphql-1.6.2> ok 40        - issue_339_function_return_json             58 ms936pg_graphql-1.6.2> ok 41        - issue_339_function_return_table            54 ms937pg_graphql-1.6.2> ok 42        - issue_353_too_many_fields                  65 ms938pg_graphql-1.6.2> ok 43        - issue_370_citext_as_string                 76 ms939pg_graphql-1.6.2> ok 44        - issue_373                                  63 ms940pg_graphql-1.6.2> ok 45        - issue_377_enum_search_path                109 ms941pg_graphql-1.6.2> ok 46        - issue_409_fkey_rls_nullability            129 ms942pg_graphql-1.6.2> ok 47        - issue_444                                  53 ms943pg_graphql-1.6.2> ok 48        - issue_463                                  66 ms944pg_graphql-1.6.2> ok 49        - issue_511                                  64 ms945pg_graphql-1.6.2> ok 50        - issue_533                                 121 ms946pg_graphql-1.6.2> ok 51        - issue_542_partial_unique                   97 ms947pg_graphql-1.6.2> ok 52        - issue_551_too_many_fields                  81 ms948pg_graphql-1.6.2> ok 53        - issue_557_1_to_1_nullability               58 ms949pg_graphql-1.6.2> ok 54        - issue_581_missing_desc_on_schema           62 ms950pg_graphql-1.6.2> ok 55        - issue_fragment_spread_cycles              265 ms951pg_graphql-1.6.2> ok 56        - json_is_stringified                        77 ms952cargo-pgrx-0.16.1>    Compiling atty v0.2.14953pg_graphql-1.6.2> ok 57        - max_page_size                              60 ms954cargo-pgrx-0.16.1>    Compiling ppmd-rust v1.2.1955cargo-pgrx-0.16.1>    Compiling home v0.5.11956pg_graphql-1.6.2> ok 58        - max_rows_directive                        241 ms957pg_graphql-1.6.2> ok 59        - multi_column_primary_key                   74 ms958pg_graphql-1.6.2> ok 60        - multiple_mutations                         63 ms959pg_graphql-1.6.2> ok 61        - multiple_queries                           63 ms960pg_graphql-1.6.2> ok 62        - mutation_delete                            68 ms961pg_graphql-1.6.2> ok 63        - mutation_delete_variable                   58 ms962cargo-pgrx-0.16.1>    Compiling unicode-segmentation v1.12.0963pg_graphql-1.6.2> ok 64        - mutation_insert                            78 ms964pg_graphql-1.6.2> ok 65        - mutation_update                            74 ms965cargo-pgrx-0.16.1>    Compiling twox-hash v2.1.2966pg_graphql-1.6.2> ok 66        - null_argument                              57 ms967pg_graphql-1.6.2> ok 67        - omit_exotic_types                          65 ms968cargo-pgrx-0.16.1>    Compiling concolor-query v0.0.4969pg_graphql-1.6.2> ok 68        - omit_weird_names                           99 ms970cargo-pgrx-0.16.1>    Compiling bitflags v1.3.2971pg_graphql-1.6.2> ok 69        - operation_name                             64 ms972cargo-pgrx-0.16.1>    Compiling deflate64 v0.1.9973cargo-pgrx-0.16.1>    Compiling constant_time_eq v0.3.1974pg_graphql-1.6.2> ok 70        - override_enum_name                         83 ms975cargo-pgrx-0.16.1>    Compiling fixedbitset v0.5.7976pg_graphql-1.6.2> ok 71        - override_field_name                        57 ms977pg_graphql-1.6.2> ok 72        - override_func_field_name                   66 ms978pg_graphql-1.6.2> ok 73        - override_relationship_field_name           64 ms979pg_graphql-1.6.2> ok 74        - override_type_name                         65 ms980pg_graphql-1.6.2> ok 75        - page_info                                  76 ms981pg_graphql-1.6.2> ok 76        - permissions_connection_column             102 ms982cargo-pgrx-0.16.1>    Compiling rustc-demangle v0.1.26983pg_graphql-1.6.2> ok 77        - permissions_functions                      91 ms984cargo-pgrx-0.16.1>    Compiling petgraph v0.8.2985pg_graphql-1.6.2> ok 78        - permissions_node_column                   102 ms986pg_graphql-1.6.2> ok 79        - permissions_table_level                   198 ms987cargo-pgrx-0.16.1>    Compiling zip v5.1.1988pg_graphql-1.6.2> ok 80        - permissions_types                         127 ms989pg_graphql-1.6.2> ok 81        - primary_key_is_required                    89 ms990pg_graphql-1.6.2> ok 82        - primary_key_queries                       307 ms991pg_graphql-1.6.2> ok 83        - relationship_one_to_one                    61 ms992pg_graphql-1.6.2> ok 84        - resolve___schema                           75 ms993pg_graphql-1.6.2> ok 85        - resolve___type                             64 ms994pg_graphql-1.6.2> ok 86        - resolve___typename                        138 ms995pg_graphql-1.6.2> ok 87        - resolve_array_type                         60 ms996pg_graphql-1.6.2> ok 88        - resolve_connection_filter                 112 ms997pg_graphql-1.6.2> ok 89        - resolve_connection_named                   60 ms998pg_graphql-1.6.2> ok 90        - resolve_connection_order_by                90 ms999cargo-pgrx-0.16.1>    Compiling backtrace v0.3.751000pg_graphql-1.6.2> ok 91        - resolve_connection_pagination_args        109 ms1001pg_graphql-1.6.2> ok 92        - resolve_connection_to_conn                 64 ms1002pg_graphql-1.6.2> ok 93        - resolve_connection_to_node                 64 ms1003pg_graphql-1.6.2> ok 94        - resolve_error_connection_edge_no_field       52 ms1004pg_graphql-1.6.2> ok 95        - resolve_error_connection_edge_node_no_field       53 ms1005pg_graphql-1.6.2> ok 96        - resolve_error_connection_no_field          53 ms1006pg_graphql-1.6.2> ok 97        - resolve_error_from_parser                  12 ms1007pg_graphql-1.6.2> ok 98        - resolve_error_mutation_no_field            57 ms1008pg_graphql-1.6.2> ok 99        - resolve_error_node_no_field                67 ms1009pg_graphql-1.6.2> ok 100       - resolve_error_query_no_field               48 ms1010pg_graphql-1.6.2> ok 101       - resolve_fragment                           59 ms1011pg_graphql-1.6.2> ok 102       - resolve_graphiql_schema                   126 ms1012pg_graphql-1.6.2> ok 103       - resolve_one                               110 ms1013pg_graphql-1.6.2> ok 104       - roundtrip_types                            78 ms1014pg_graphql-1.6.2> ok 105       - row_level_security                         62 ms1015pg_graphql-1.6.2> ok 106       - sqli_connection                            77 ms1016pg_graphql-1.6.2> ok 107       - string_filters                             75 ms1017pg_graphql-1.6.2> ok 108       - test_error_anon_and_named_operations       50 ms1018pg_graphql-1.6.2> ok 109       - test_error_invalid_offset                  96 ms1019pg_graphql-1.6.2> ok 110       - test_error_multiple_anon_operations        46 ms1020pg_graphql-1.6.2> ok 111       - test_error_mutation_transpilation          55 ms1021pg_graphql-1.6.2> ok 112       - test_error_operation_name_not_found        49 ms1022pg_graphql-1.6.2> ok 113       - test_error_operation_names_not_unique       55 ms1023pg_graphql-1.6.2> ok 114       - test_error_query_transpilation             58 ms1024pg_graphql-1.6.2> ok 115       - test_error_subscription                    51 ms1025pg_graphql-1.6.2> ok 116       - test_query__type                           52 ms1026pg_graphql-1.6.2> ok 117       - total_count                                90 ms1027pg_graphql-1.6.2> ok 118       - type_bigfloat                              57 ms1028pg_graphql-1.6.2> ok 119       - type_modifier_max_length                   67 ms1029pg_graphql-1.6.2> ok 120       - type_opaque                                59 ms1030pg_graphql-1.6.2> ok 121       - variable_default                           59 ms1031pg_graphql-1.6.2> ok 122       - views_integration                         186 ms1032pg_graphql-1.6.2> 1..1221033pg_graphql-1.6.2> # All 122 tests passed.1034pg_graphql-1.6.2> + pg_ctl stop -m i1035pg_graphql-1.6.2> waiting for server to shut down....2026-10-09 21:47:28.920 UTC [3164] LOG:  received immediate shutdown request1036pg_graphql-1.6.2> 2026-10-09 21:47:28.934 UTC [3164] LOG:  database system is shut down1037pg_graphql-1.6.2>  done1038pg_graphql-1.6.2> server stopped1039pg_graphql-1.6.2> Running phase: installPhase1040pg_graphql-1.6.2> Executing buildPgrxExtension install1041pg_graphql-1.6.2> Running phase: fixupPhase1042pg_graphql-1.6.2> shrinking RPATHs of ELF executables and libraries in /nix/store/8fjhm3ib8g4p8a3kbx82i5jn871inrxf-pg_graphql-1.6.21043pg_graphql-1.6.2> shrinking /nix/store/8fjhm3ib8g4p8a3kbx82i5jn871inrxf-pg_graphql-1.6.2/lib/pg_graphql-1.6.2.so1044pg_graphql-1.6.2> checking for references to /build/ in /nix/store/8fjhm3ib8g4p8a3kbx82i5jn871inrxf-pg_graphql-1.6.2...1045pg_graphql-1.6.2> patching script interpreter paths in /nix/store/8fjhm3ib8g4p8a3kbx82i5jn871inrxf-pg_graphql-1.6.21046pg_graphql-1.6.2> stripping (with command strip and flags -S -p) in  /nix/store/8fjhm3ib8g4p8a3kbx82i5jn871inrxf-pg_graphql-1.6.2/lib1047cargo-pgrx-0.16.1>    Compiling convert_case v0.8.01048cargo-pgrx-0.16.1>    Compiling concolor-control v0.0.71049cargo-pgrx-0.16.1>    Compiling tame-index v0.17.01050cargo-pgrx-0.16.1>    Compiling toml v0.8.231051cargo-pgrx-0.16.1>    Compiling der v0.7.101052cargo-pgrx-0.16.1>    Compiling cargo_toml v0.22.31053cargo-pgrx-0.16.1>    Compiling pathsearch v0.2.01054cargo-pgrx-0.16.1>    Compiling clap-cargo v0.15.21055cargo-pgrx-0.16.1>    Compiling cargo_metadata v0.18.11056cargo-pgrx-0.16.1>    Compiling cargo_metadata v0.19.21057cargo-pgrx-0.12.9>    Compiling git2 v0.17.21058cargo-pgrx-0.12.9>    Compiling crates-index v0.19.131059cargo-pgrx-0.12.9>    Compiling cargo-edit v0.12.21060cargo-pgrx-0.16.1>    Compiling rustls-platform-verifier v0.6.11061cargo-pgrx-0.16.1>    Compiling ureq-proto v0.5.21062cargo-pgrx-0.16.1>    Compiling xattr v1.6.11063cargo-pgrx-0.12.6>    Compiling git2 v0.17.21064cargo-pgrx-0.16.1>    Compiling webpki-root-certs v1.0.21065cargo-pgrx-0.16.1>    Compiling rustls-pemfile v2.2.01066cargo-pgrx-0.16.1>    Compiling derive_destructure2 v0.1.31067cargo-pgrx-0.16.1>    Compiling filetime v0.2.261068cargo-pgrx-0.12.6>    Compiling crates-index v0.19.131069cargo-pgrx-0.16.1>    Compiling pathdiff v0.2.31070cargo-pgrx-0.12.6>    Compiling cargo-edit v0.12.21071cargo-pgrx-0.16.1>    Compiling utf-8 v0.7.61072cargo-pgrx-0.16.1>    Compiling fastrand v2.3.01073cargo-pgrx-0.16.1>    Compiling cargo-pgrx v0.16.1 (/build/cargo-pgrx-0.16.1.tar.gz)1074cargo-pgrx-0.16.1>    Compiling xml-rs v0.8.271075cargo-pgrx-0.16.1>    Compiling termcolor v1.4.11076cargo-pgrx-0.16.1>    Compiling hex v0.4.31077cargo-pgrx-0.16.1>    Compiling scopeguard v1.2.01078cargo-pgrx-0.16.1>    Compiling unescape v0.1.01079cargo-pgrx-0.16.1>    Compiling dunce v1.0.51080cargo-pgrx-0.16.1>    Compiling env_home v0.1.01081cargo-pgrx-0.16.1>    Compiling which v7.0.31082cargo-pgrx-0.16.1>    Compiling cargo-edit v0.13.21083cargo-pgrx-0.16.1>    Compiling pgrx-sql-entity-graph v0.16.11084cargo-pgrx-0.16.1>    Compiling jobslot v0.2.231085cargo-pgrx-0.16.1>    Compiling serde-xml-rs v0.6.01086cargo-pgrx-0.16.1>    Compiling tempfile v3.23.01087cargo-pgrx-0.16.1>    Compiling ureq v3.1.21088cargo-pgrx-0.16.1>    Compiling tar v0.4.441089cargo-pgrx-0.16.1>    Compiling clap-cargo v0.14.11090cargo-pgrx-0.16.1>    Compiling pgrx-pg-config v0.16.11091cargo-pgrx-0.16.1>    Compiling bzip2 v0.5.21092cargo-pgrx-0.16.1>    Compiling color-eyre v0.6.51093cargo-pgrx-0.12.9>     Finished `release` profile [optimized] target(s) in 3m 39s1094cargo-pgrx-0.12.9> Executing cargoInstallPostBuildHook1095cargo-pgrx-0.12.9> Finished cargoInstallPostBuildHook1096cargo-pgrx-0.12.9> Finished cargoBuildHook1097cargo-pgrx-0.12.9> buildPhase completed in 3 minutes 40 seconds1098cargo-pgrx-0.12.9> Running phase: checkPhase1099cargo-pgrx-0.12.9> Executing cargoCheckHook1100cargo-pgrx-0.12.9> cargoCheckHook flags: -j 4 --profile release --target x86_64-unknown-linux-gnu --offline -- --skip=command::schema::tests::test_parse_managed_postmasters --skip=object_utils::tests::parses_managed_postmasters --skip=command::upgrade::tests::find_package_manifest_in_workspace --skip=command::upgrade::tests::process_workspace_manifest --skip=command::upgrade::tests::process_workspace_package_manifest1101cargo-pgrx-0.12.9>    Compiling cargo-pgrx v0.12.9 (/build/cargo-pgrx-0.12.9.tar.gz)1102cargo-pgrx-0.16.1>    Compiling zip-extract v0.2.31103cargo-pgrx-0.16.1>    Compiling env_proxy v0.4.11104cargo-pgrx-0.16.1>    Compiling regex v1.11.31105cargo-pgrx-0.12.9>     Finished `release` profile [optimized] target(s) in 2.47s1106cargo-pgrx-0.12.9>      Running unittests src/main.rs (target/x86_64-unknown-linux-gnu/release/deps/cargo_pgrx-616e780a81b473d7)1107cargo-pgrx-0.12.9> 1108cargo-pgrx-0.12.9> running 2 tests1109cargo-pgrx-0.12.9> test command::schema::tests::test_parse_universal_binary_slice ... ok1110cargo-pgrx-0.12.9> test command::schema::tests::test_slice_unknown_architecture ... ok1111cargo-pgrx-0.12.9> 1112cargo-pgrx-0.12.9> test result: ok. 2 passed; 0 failed; 0 ignored; 0 measured; 1 filtered out; finished in 0.00s1113cargo-pgrx-0.12.9> 1114cargo-pgrx-0.12.9> Finished cargoCheckHook1115cargo-pgrx-0.12.9> Running phase: installPhase1116cargo-pgrx-0.12.9> Executing cargoInstallHook1117cargo-pgrx-0.12.9> Finished cargoInstallHook1118cargo-pgrx-0.12.9> Running phase: fixupPhase1119cargo-pgrx-0.12.9> shrinking RPATHs of ELF executables and libraries in /nix/store/75x5bi256fm47h0nfjh41rm43260vf0g-cargo-pgrx-0.12.91120cargo-pgrx-0.12.9> shrinking /nix/store/75x5bi256fm47h0nfjh41rm43260vf0g-cargo-pgrx-0.12.9/bin/cargo-pgrx1121cargo-pgrx-0.12.9> checking for references to /build/ in /nix/store/75x5bi256fm47h0nfjh41rm43260vf0g-cargo-pgrx-0.12.9...1122cargo-pgrx-0.12.9> patching script interpreter paths in /nix/store/75x5bi256fm47h0nfjh41rm43260vf0g-cargo-pgrx-0.12.91123cargo-pgrx-0.12.9> stripping (with command strip and flags -S -p) in  /nix/store/75x5bi256fm47h0nfjh41rm43260vf0g-cargo-pgrx-0.12.9/bin1124building '/nix/store/ymdax0w8lzm9h8hzanfwj3q3yyn790hh-pg_graphql-1.5.11.drv'1125cargo-pgrx-0.12.6>     Finished `release` profile [optimized] target(s) in 3m 40s1126cargo-pgrx-0.12.6> Executing cargoInstallPostBuildHook1127cargo-pgrx-0.12.6> Finished cargoInstallPostBuildHook1128cargo-pgrx-0.12.6> Finished cargoBuildHook1129cargo-pgrx-0.12.6> buildPhase completed in 3 minutes 41 seconds1130cargo-pgrx-0.12.6> Running phase: checkPhase1131cargo-pgrx-0.12.6> Executing cargoCheckHook1132cargo-pgrx-0.12.6> cargoCheckHook flags: -j 4 --profile release --target x86_64-unknown-linux-gnu --offline -- --skip=command::schema::tests::test_parse_managed_postmasters --skip=object_utils::tests::parses_managed_postmasters --skip=command::upgrade::tests::find_package_manifest_in_workspace --skip=command::upgrade::tests::process_workspace_manifest --skip=command::upgrade::tests::process_workspace_package_manifest1133cargo-pgrx-0.12.6>    Compiling cargo-pgrx v0.12.6 (/build/cargo-pgrx-0.12.6.tar.gz)1134cargo-pgrx-0.12.6>     Finished `release` profile [optimized] target(s) in 1.85s1135cargo-pgrx-0.12.6>      Running unittests src/main.rs (target/x86_64-unknown-linux-gnu/release/deps/cargo_pgrx-32af97818d02847b)1136cargo-pgrx-0.12.6> 1137cargo-pgrx-0.12.6> running 2 tests1138cargo-pgrx-0.12.6> test command::schema::tests::test_parse_universal_binary_slice ... ok1139cargo-pgrx-0.12.6> test command::schema::tests::test_slice_unknown_architecture ... ok1140cargo-pgrx-0.12.6> 1141cargo-pgrx-0.12.6> test result: ok. 2 passed; 0 failed; 0 ignored; 0 measured; 1 filtered out; finished in 0.00s1142cargo-pgrx-0.12.6> 1143cargo-pgrx-0.12.6> Finished cargoCheckHook1144cargo-pgrx-0.12.6> Running phase: installPhase1145cargo-pgrx-0.12.6> Executing cargoInstallHook1146cargo-pgrx-0.12.6> Finished cargoInstallHook1147cargo-pgrx-0.12.6> Running phase: fixupPhase1148cargo-pgrx-0.12.6> shrinking RPATHs of ELF executables and libraries in /nix/store/gpih8bcsyq9f02pm7jqy5ix0qvb635p4-cargo-pgrx-0.12.61149cargo-pgrx-0.12.6> shrinking /nix/store/gpih8bcsyq9f02pm7jqy5ix0qvb635p4-cargo-pgrx-0.12.6/bin/cargo-pgrx1150cargo-pgrx-0.12.6> checking for references to /build/ in /nix/store/gpih8bcsyq9f02pm7jqy5ix0qvb635p4-cargo-pgrx-0.12.6...1151cargo-pgrx-0.12.6> patching script interpreter paths in /nix/store/gpih8bcsyq9f02pm7jqy5ix0qvb635p4-cargo-pgrx-0.12.61152cargo-pgrx-0.12.6> stripping (with command strip and flags -S -p) in  /nix/store/gpih8bcsyq9f02pm7jqy5ix0qvb635p4-cargo-pgrx-0.12.6/bin1153building '/nix/store/qlmsyj10573r3wg0jndybmcws6r2a1yh-pg_graphql-1.5.9.drv'1154cargo-pgrx-0.16.1>     Finished `release` profile [optimized] target(s) in 3m 50s1155cargo-pgrx-0.16.1> Executing cargoInstallPostBuildHook1156cargo-pgrx-0.16.1> Finished cargoInstallPostBuildHook1157cargo-pgrx-0.16.1> Finished cargoBuildHook1158cargo-pgrx-0.16.1> buildPhase completed in 3 minutes 51 seconds1159cargo-pgrx-0.16.1> Running phase: checkPhase1160cargo-pgrx-0.16.1> Executing cargoCheckHook1161cargo-pgrx-0.16.1> cargoCheckHook flags: -j 4 --profile release --target x86_64-unknown-linux-gnu --offline -- --skip=command::schema::tests::test_parse_managed_postmasters --skip=object_utils::tests::parses_managed_postmasters --skip=command::upgrade::tests::find_package_manifest_in_workspace --skip=command::upgrade::tests::process_workspace_manifest --skip=command::upgrade::tests::process_workspace_package_manifest1162cargo-pgrx-0.16.1>    Compiling cargo-pgrx v0.16.1 (/build/cargo-pgrx-0.16.1.tar.gz)1163cargo-pgrx-0.16.1>     Finished `release` profile [optimized] target(s) in 2.70s1164cargo-pgrx-0.16.1>      Running unittests src/main.rs (target/x86_64-unknown-linux-gnu/release/deps/cargo_pgrx-5102d402c0934e75)1165cargo-pgrx-0.16.1> 1166cargo-pgrx-0.16.1> running 2 tests1167cargo-pgrx-0.16.1> test command::schema::tests::test_parse_universal_binary_slice ... ok1168cargo-pgrx-0.16.1> test command::schema::tests::test_slice_unknown_architecture ... ok1169cargo-pgrx-0.16.1> 1170cargo-pgrx-0.16.1> test result: ok. 2 passed; 0 failed; 0 ignored; 0 measured; 1 filtered out; finished in 0.00s1171cargo-pgrx-0.16.1> 1172cargo-pgrx-0.16.1> Finished cargoCheckHook1173cargo-pgrx-0.16.1> Running phase: installPhase1174cargo-pgrx-0.16.1> Executing cargoInstallHook1175cargo-pgrx-0.16.1> Finished cargoInstallHook1176cargo-pgrx-0.16.1> Running phase: fixupPhase1177cargo-pgrx-0.16.1> shrinking RPATHs of ELF executables and libraries in /nix/store/9drk54aqinhpkff1c0835k52axq8hwna-cargo-pgrx-0.16.11178cargo-pgrx-0.16.1> shrinking /nix/store/9drk54aqinhpkff1c0835k52axq8hwna-cargo-pgrx-0.16.1/bin/cargo-pgrx1179cargo-pgrx-0.16.1> checking for references to /build/ in /nix/store/9drk54aqinhpkff1c0835k52axq8hwna-cargo-pgrx-0.16.1...1180cargo-pgrx-0.16.1> patching script interpreter paths in /nix/store/9drk54aqinhpkff1c0835k52axq8hwna-cargo-pgrx-0.16.11181cargo-pgrx-0.16.1> stripping (with command strip and flags -S -p) in  /nix/store/9drk54aqinhpkff1c0835k52axq8hwna-cargo-pgrx-0.16.1/bin1182pg_graphql-1.5.11> Running phase: unpackPhase1183pg_graphql-1.5.11> unpacking source archive /nix/store/7fifqwfl0gqcak1a1lqswmmpjpj11rag-source1184pg_graphql-1.5.11> source root is source1185pg_graphql-1.5.11> Executing cargoSetupPostUnpackHook1186pg_graphql-1.5.11> Finished cargoSetupPostUnpackHook1187pg_graphql-1.5.11> Running phase: patchPhase1188pg_graphql-1.5.11> Executing cargoSetupPostPatchHook1189pg_graphql-1.5.11> Validating consistency between /build/source/Cargo.lock and /build/cargo-vendor-dir/Cargo.lock1190pg_graphql-1.5.11> Finished cargoSetupPostPatchHook1191pg_graphql-1.5.11> Running phase: updateAutotoolsGnuConfigScriptsPhase1192pg_graphql-1.5.11> Running phase: configurePhase1193pg_graphql-1.5.11> Running phase: buildPhase1194pg_graphql-1.5.11> Executing cargo-pgrx buildPhase1195pg_graphql-1.5.11>    Validating /nix/store/w828ivs2af99jmnq3vali46cgpban5pa-postgresql-17.11/bin/pg_config1196pg_graphql-1.5.11>  Initializing data directory at /build/tmp.c6ssxHXHKX/data-171197pg_graphql-1.5.11> waiting for server to start....2026-10-09 21:48:32.463 GMT [73] LOG:  starting PostgreSQL 17.11 on x86_64-pc-linux-gnu, compiled by gcc (GCC) 15.2.0, 64-bit1198pg_graphql-1.5.11> 2026-10-09 21:48:32.463 GMT [73] LOG:  listening on Unix socket "/build/tmp.IJzZt3fayp/.s.PGSQL.5432"1199pg_graphql-1.5.11> 2026-10-09 21:48:32.465 GMT [76] LOG:  database system was shut down at 2026-10-09 21:48:32 GMT1200pg_graphql-1.5.11> 2026-10-09 21:48:32.468 GMT [73] LOG:  database system is ready to accept connections1201pg_graphql-1.5.11>  done1202pg_graphql-1.5.11> server started1203pg_graphql-1.5.11> createuser: error: connection to server at "localhost" (127.0.0.1), port 5432 failed: Connection refused1204pg_graphql-1.5.11> 	Is the server running on that host and accepting TCP/IP connections?1205pg_graphql-1.5.11> waiting for server to shut down....2026-10-09 21:48:32.551 GMT [73] LOG:  received fast shutdown request1206pg_graphql-1.5.11> 2026-10-09 21:48:32.552 GMT [73] LOG:  aborting any active transactions1207pg_graphql-1.5.11> 2026-10-09 21:48:32.556 GMT [73] LOG:  background worker "logical replication launcher" (PID 79) exited with exit code 11208pg_graphql-1.5.11> 2026-10-09 21:48:32.556 GMT [74] LOG:  shutting down1209pg_graphql-1.5.11> 2026-10-09 21:48:32.557 GMT [74] LOG:  checkpoint starting: shutdown immediate1210pg_graphql-1.5.11> 2026-10-09 21:48:32.562 GMT [74] LOG:  checkpoint complete: wrote 3 buffers (0.0%); 0 WAL file(s) added, 0 removed, 0 recycled; write=0.001 s, sync=0.001 s, total=0.006 s; sync files=2, longest=0.001 s, average=0.001 s; distance=0 kB, estimate=0 kB; lsn=0/14EC340, redo lsn=0/14EC3401211pg_graphql-1.5.11> 2026-10-09 21:48:32.566 GMT [73] LOG:  database system is shut down1212pg_graphql-1.5.11>  done1213pg_graphql-1.5.11> server stopped1214pg_graphql-1.5.11>        Using PgConfig("pg17") and `pg_config` from /nix/store/w828ivs2af99jmnq3vali46cgpban5pa-postgresql-17.11/bin/pg_config1215pg_graphql-1.5.11>     Building extension with features  pg171216pg_graphql-1.5.11>      Running command "/nix/store/d5wca6mxvyll7zc6ilbj7n99mwx538h8-rust-default-1.81.0/bin/cargo" "build" "--lib" "--release" "--features" " pg17" "--no-default-features" "--message-format=json-render-diagnostics" "--frozen" "-j" "4"1217pg_graphql-1.5.11>    Compiling proc-macro2 v1.0.931218pg_graphql-1.5.11>    Compiling unicode-ident v1.0.161219pg_graphql-1.5.11>    Compiling libc v0.2.1691220pg_graphql-1.5.11>    Compiling stable_deref_trait v1.2.01221pg_graphql-1.5.11>    Compiling memchr v2.7.41222pg_graphql-1.5.11>    Compiling thiserror v1.0.691223pg_graphql-1.5.11>    Compiling serde v1.0.2171224pg_graphql-1.5.11>    Compiling writeable v0.5.51225pg_graphql-1.5.11>    Compiling litemap v0.7.41226pg_graphql-1.5.11>    Compiling eyre v0.6.121227pg_graphql-1.5.11>    Compiling equivalent v1.0.11228pg_graphql-1.5.11>    Compiling hashbrown v0.15.21229pg_graphql-1.5.11>    Compiling quote v1.0.381230pg_graphql-1.5.11>    Compiling syn v2.0.981231pg_graphql-1.5.11>    Compiling indexmap v2.7.11232pg_graphql-1.5.11>    Compiling icu_locid_transform_data v1.5.01233pg_graphql-1.5.11>    Compiling icu_properties_data v1.5.01234pg_graphql-1.5.11>    Compiling utf16_iter v1.0.51235pg_graphql-1.5.11>    Compiling icu_normalizer_data v1.5.01236pg_graphql-1.5.11>    Compiling smallvec v1.13.21237pg_graphql-1.5.11>    Compiling serde_json v1.0.1381238pg_graphql-1.5.11>    Compiling shlex v1.3.01239pg_graphql-1.5.11>    Compiling write16 v1.0.01240pg_graphql-1.5.11>    Compiling glob v0.3.21241pg_graphql-1.5.11>    Compiling thiserror v2.0.111242pg_graphql-1.5.11>    Compiling utf8_iter v1.0.41243pg_graphql-1.5.11>    Compiling anyhow v1.0.951244pg_graphql-1.5.11>    Compiling clang-sys v1.8.11245pg_graphql-1.5.11>    Compiling is_ci v1.2.01246pg_graphql-1.5.11>    Compiling winnow v0.7.01247pg_graphql-1.5.11>    Compiling once_cell v1.20.21248pg_graphql-1.5.11>    Compiling indenter v0.3.31249pg_graphql-1.5.11>    Compiling cfg-if v1.0.01250pg_graphql-1.5.11>    Compiling cc v1.2.111251pg_graphql-1.5.11>    Compiling is-terminal v0.4.151252pg_graphql-1.5.11>    Compiling percent-encoding v2.3.11253pg_graphql-1.5.11>    Compiling minimal-lexical v0.2.11254pg_graphql-1.5.11>    Compiling owo-colors v4.1.01255pg_graphql-1.5.11>    Compiling regex-syntax v0.8.51256pg_graphql-1.5.11>    Compiling ucd-trie v0.1.71257pg_graphql-1.5.11>    Compiling synstructure v0.13.11258pg_graphql-1.5.11>    Compiling nom v7.1.31259pg_graphql-1.5.11>    Compiling regex-automata v0.4.91260pg_graphql-1.5.11>    Compiling form_urlencoded v1.2.11261pg_graphql-1.5.11>    Compiling libloading v0.8.61262pg_graphql-1.5.11>    Compiling supports-color v2.1.01263pg_graphql-1.5.11>    Compiling supports-color v3.0.21264pg_graphql-1.5.11>    Compiling itoa v1.0.141265pg_graphql-1.5.11>    Compiling unicode-width v0.1.141266pg_graphql-1.5.11>    Compiling syn v1.0.1091267pg_graphql-1.5.11>    Compiling ryu v1.0.191268pg_graphql-1.5.11>    Compiling yansi-term v0.1.21269pg_graphql-1.5.11>    Compiling either v1.13.01270pg_graphql-1.5.11>    Compiling zerofrom-derive v0.1.51271pg_graphql-1.5.11>    Compiling yoke-derive v0.7.51272pg_graphql-1.5.11>    Compiling serde_derive v1.0.2171273pg_graphql-1.5.11>    Compiling zerovec-derive v0.10.31274building '/nix/store/q59g94g70gbmybqnhf62wzgzaq9h8jx5-pg_graphql-1.6.1.drv'1275pg_graphql-1.5.11>    Compiling displaydoc v0.2.51276pg_graphql-1.5.11>    Compiling icu_provider_macros v1.5.01277pg_graphql-1.5.11>    Compiling zerofrom v0.1.51278pg_graphql-1.5.11>    Compiling yoke v0.7.51279pg_graphql-1.5.11>    Compiling zerovec v0.10.41280pg_graphql-1.5.11>    Compiling thiserror-impl v1.0.691281pg_graphql-1.5.11>    Compiling thiserror-impl v2.0.111282pg_graphql-1.5.11>    Compiling tinystr v0.7.61283pg_graphql-1.5.11>    Compiling icu_locid v1.5.01284pg_graphql-1.5.11>    Compiling icu_provider v1.5.01285pg_graphql-1.5.11>    Compiling icu_collections v1.5.01286pg_graphql-1.5.11>    Compiling icu_locid_transform v1.5.01287pg_graphql-1.5.11>    Compiling pest v2.7.151288pg_graphql-1.5.11>    Compiling icu_properties v1.5.11289pg_graphql-1.5.11>    Compiling bindgen v0.70.11290pg_graphql-1.5.11>    Compiling byteorder v1.5.01291pg_graphql-1.5.11>    Compiling semver-parser v0.10.31292pg_graphql-1.5.11>    Compiling itertools v0.13.01293pg_graphql-1.5.11>    Compiling serde_spanned v0.6.81294pg_graphql-1.5.11>    Compiling toml_datetime v0.6.81295pg_graphql-1.5.11>    Compiling icu_normalizer v1.5.01296pg_graphql-1.5.11>    Compiling toml_edit v0.22.231297pg_graphql-1.5.11>    Compiling annotate-snippets v0.9.21298pg_graphql-1.5.11>    Compiling idna_adapter v1.2.01299pg_graphql-1.5.11>    Compiling idna v1.0.31300pg_graphql-1.5.11>    Compiling url v2.5.41301pg_graphql-1.5.11>    Compiling pathsearch v0.2.01302pg_graphql-1.5.11>    Compiling regex v1.11.11303pg_graphql-1.5.11>    Compiling toml v0.8.191304pg_graphql-1.5.11>    Compiling cexpr v0.6.01305pg_graphql-1.5.11>    Compiling cargo_toml v0.19.21306pg_graphql-1.5.11>    Compiling bitflags v2.8.01307pg_graphql-1.5.11>    Compiling home v0.5.111308pg_graphql-1.5.11>    Compiling rustc-hash v1.1.01309pg_graphql-1.5.11>    Compiling same-file v1.0.61310pg_graphql-1.5.11>    Compiling walkdir v2.5.01311pg_graphql-1.5.11>    Compiling pgrx-pg-config v0.12.91312pg_graphql-1.5.9> Running phase: unpackPhase1313pg_graphql-1.5.9> unpacking source archive /nix/store/35k52w6qmay5vi6qhfy8cpfz0bwldvr5-source1314pg_graphql-1.5.9> source root is source1315pg_graphql-1.5.9> Executing cargoSetupPostUnpackHook1316pg_graphql-1.5.9> Finished cargoSetupPostUnpackHook1317pg_graphql-1.5.9> Running phase: patchPhase1318pg_graphql-1.5.9> Executing cargoSetupPostPatchHook1319pg_graphql-1.5.9> Validating consistency between /build/source/Cargo.lock and /build/cargo-vendor-dir/Cargo.lock1320pg_graphql-1.5.9> Finished cargoSetupPostPatchHook1321pg_graphql-1.5.9> Running phase: updateAutotoolsGnuConfigScriptsPhase1322pg_graphql-1.5.9> Running phase: configurePhase1323pg_graphql-1.5.9> Running phase: buildPhase1324pg_graphql-1.5.9> Executing cargo-pgrx buildPhase1325pg_graphql-1.5.9>    Validating /nix/store/w828ivs2af99jmnq3vali46cgpban5pa-postgresql-17.11/bin/pg_config1326pg_graphql-1.5.9>  Initializing data directory at /build/tmp.9PTXe3uqHS/data-171327pg_graphql-1.5.9> waiting for server to start....2026-10-09 21:48:43.276 GMT [73] LOG:  starting PostgreSQL 17.11 on x86_64-pc-linux-gnu, compiled by gcc (GCC) 15.2.0, 64-bit1328pg_graphql-1.5.9> 2026-10-09 21:48:43.277 GMT [73] LOG:  listening on Unix socket "/build/tmp.YPjuEVQDwK/.s.PGSQL.5432"1329pg_graphql-1.5.9> 2026-10-09 21:48:43.281 GMT [76] LOG:  database system was shut down at 2026-10-09 21:48:43 GMT1330pg_graphql-1.5.9> 2026-10-09 21:48:43.288 GMT [73] LOG:  database system is ready to accept connections1331pg_graphql-1.5.9>  done1332pg_graphql-1.5.9> server started1333pg_graphql-1.5.9> createuser: error: connection to server at "localhost" (127.0.0.1), port 5432 failed: Connection refused1334pg_graphql-1.5.9> 	Is the server running on that host and accepting TCP/IP connections?1335pg_graphql-1.5.9> waiting for server to shut down....2026-10-09 21:48:43.359 GMT [73] LOG:  received fast shutdown request1336pg_graphql-1.5.9> 2026-10-09 21:48:43.360 GMT [73] LOG:  aborting any active transactions1337pg_graphql-1.5.9> 2026-10-09 21:48:43.362 GMT [73] LOG:  background worker "logical replication launcher" (PID 79) exited with exit code 11338pg_graphql-1.5.9> 2026-10-09 21:48:43.366 GMT [74] LOG:  shutting down1339pg_graphql-1.5.9> 2026-10-09 21:48:43.370 GMT [74] LOG:  checkpoint starting: shutdown immediate1340pg_graphql-1.5.9> 2026-10-09 21:48:43.372 GMT [74] LOG:  checkpoint complete: wrote 3 buffers (0.0%); 0 WAL file(s) added, 0 removed, 0 recycled; write=0.001 s, sync=0.001 s, total=0.006 s; sync files=2, longest=0.001 s, average=0.001 s; distance=0 kB, estimate=0 kB; lsn=0/14EC340, redo lsn=0/14EC3401341pg_graphql-1.5.9> 2026-10-09 21:48:43.378 GMT [73] LOG:  database system is shut down1342pg_graphql-1.5.9>  done1343pg_graphql-1.5.9> server stopped1344pg_graphql-1.5.9>        Using PgConfig("pg17") and `pg_config` from /nix/store/w828ivs2af99jmnq3vali46cgpban5pa-postgresql-17.11/bin/pg_config1345pg_graphql-1.5.9>     Building extension with features  pg171346pg_graphql-1.5.9>      Running command "/nix/store/d5wca6mxvyll7zc6ilbj7n99mwx538h8-rust-default-1.81.0/bin/cargo" "build" "--lib" "--release" "--features" " pg17" "--no-default-features" "--message-format=json-render-diagnostics" "--frozen" "-j" "4"1347pg_graphql-1.5.9>    Compiling proc-macro2 v1.0.791348pg_graphql-1.5.9>    Compiling unicode-ident v1.0.121349pg_graphql-1.5.9>    Compiling libc v0.2.1531350pg_graphql-1.5.9>    Compiling thiserror v1.0.581351pg_graphql-1.5.9>    Compiling memchr v2.7.21352pg_graphql-1.5.9>    Compiling serde v1.0.1971353pg_graphql-1.5.9>    Compiling hashbrown v0.14.31354pg_graphql-1.5.9>    Compiling eyre v0.6.121355pg_graphql-1.5.9>    Compiling equivalent v1.0.11356pg_graphql-1.5.9>    Compiling quote v1.0.361357pg_graphql-1.5.9>    Compiling syn v2.0.581358pg_graphql-1.5.9>    Compiling indexmap v2.2.61359pg_graphql-1.5.9>    Compiling serde_json v1.0.1151360pg_graphql-1.5.9>    Compiling glob v0.3.11361pg_graphql-1.5.9>    Compiling tinyvec_macros v0.1.11362pg_graphql-1.5.9>    Compiling tinyvec v1.6.01363pg_graphql-1.5.9>    Compiling winnow v0.6.51364pg_graphql-1.5.9>    Compiling clang-sys v1.7.01365pg_graphql-1.5.9>    Compiling cfg-if v1.0.01366pg_graphql-1.5.9>    Compiling is_ci v1.2.01367pg_graphql-1.5.9>    Compiling once_cell v1.19.01368pg_graphql-1.5.9>    Compiling indenter v0.3.31369pg_graphql-1.5.9>    Compiling anyhow v1.0.821370pg_graphql-1.5.9>    Compiling unicode-normalization v0.1.231371pg_graphql-1.5.9>    Compiling is-terminal v0.4.131372pg_graphql-1.5.9>    Compiling unicode-bidi v0.3.151373pg_graphql-1.5.9>    Compiling percent-encoding v2.3.11374pg_graphql-1.5.9>    Compiling ucd-trie v0.1.61375pg_graphql-1.5.9>    Compiling owo-colors v4.1.01376pg_graphql-1.5.9>    Compiling minimal-lexical v0.2.11377pg_graphql-1.5.9>    Compiling cc v1.0.921378pg_graphql-1.5.9>    Compiling regex-syntax v0.8.31379pg_graphql-1.5.9>    Compiling libloading v0.8.31380pg_graphql-1.5.9>    Compiling nom v7.1.31381pg_graphql-1.5.9>    Compiling regex-automata v0.4.61382pg_graphql-1.5.9>    Compiling idna v0.5.01383pg_graphql-1.5.9>    Compiling form_urlencoded v1.2.11384pg_graphql-1.5.9>    Compiling supports-color v2.1.01385pg_graphql-1.5.9>    Compiling supports-color v3.0.11386pg_graphql-1.5.9>    Compiling thiserror-impl v1.0.581387pg_graphql-1.5.9>    Compiling serde_derive v1.0.1971388pg_graphql-1.5.9>    Compiling either v1.10.01389pg_graphql-1.5.9>    Compiling unicode-width v0.1.141390pg_graphql-1.5.9>    Compiling syn v1.0.1091391pg_graphql-1.5.9>    Compiling bindgen v0.70.11392pg_graphql-1.5.9>    Compiling ryu v1.0.171393pg_graphql-1.5.9>    Compiling yansi-term v0.1.21394pg_graphql-1.5.9>    Compiling itoa v1.0.111395pg_graphql-1.5.9>    Compiling annotate-snippets v0.9.21396pg_graphql-1.5.9>    Compiling itertools v0.12.11397pg_graphql-1.5.9>    Compiling pest v2.7.91398pg_graphql-1.5.9>    Compiling regex v1.10.41399pg_graphql-1.5.9>    Compiling pathsearch v0.2.01400pg_graphql-1.5.9>    Compiling url v2.5.01401pg_graphql-1.6.1> Running phase: unpackPhase1402pg_graphql-1.6.1> unpacking source archive /nix/store/dkddz4rv98rzjsvrcvwg300h6nxbcg54-source1403pg_graphql-1.5.9>    Compiling semver-parser v0.10.21404pg_graphql-1.6.1> source root is source1405pg_graphql-1.6.1> Executing cargoSetupPostUnpackHook1406pg_graphql-1.5.9>    Compiling cexpr v0.6.01407pg_graphql-1.5.11>    Compiling semver v0.11.01408pg_graphql-1.5.11>    Compiling getrandom v0.2.151409pg_graphql-1.5.11>    Compiling fixedbitset v0.4.21410pg_graphql-1.5.11>    Compiling fnv v1.0.71411pg_graphql-1.5.11>    Compiling unicode-segmentation v1.12.01412pg_graphql-1.5.9>    Compiling home v0.5.91413pg_graphql-1.5.9>    Compiling bitflags v2.5.01414pg_graphql-1.5.9>    Compiling same-file v1.0.61415pg_graphql-1.5.9>    Compiling shlex v1.3.01416pg_graphql-1.5.9>    Compiling rustc-hash v1.1.01417pg_graphql-1.5.9>    Compiling walkdir v2.5.01418pg_graphql-1.6.1> Finished cargoSetupPostUnpackHook1419pg_graphql-1.6.1> Running phase: patchPhase1420pg_graphql-1.6.1> Executing cargoSetupPostPatchHook1421pg_graphql-1.6.1> Validating consistency between /build/source/Cargo.lock and /build/cargo-vendor-dir/Cargo.lock1422pg_graphql-1.6.1> Finished cargoSetupPostPatchHook1423pg_graphql-1.6.1> Running phase: updateAutotoolsGnuConfigScriptsPhase1424pg_graphql-1.6.1> Running phase: configurePhase1425pg_graphql-1.6.1> Running phase: buildPhase1426pg_graphql-1.6.1> Executing cargo-pgrx buildPhase1427pg_graphql-1.6.1>    Validating /nix/store/w828ivs2af99jmnq3vali46cgpban5pa-postgresql-17.11/bin/pg_config1428pg_graphql-1.6.1>  Initializing data directory at /build/tmp.2vJC0KOKPK/data-171429pg_graphql-1.5.11>    Compiling strsim v0.10.01430pg_graphql-1.5.11>    Compiling ident_case v1.0.11431pg_graphql-1.6.1> waiting for server to start....2026-10-09 21:48:57.675 GMT [72] LOG:  starting PostgreSQL 17.11 on x86_64-pc-linux-gnu, compiled by gcc (GCC) 15.2.0, 64-bit1432pg_graphql-1.6.1> 2026-10-09 21:48:57.676 GMT [72] LOG:  listening on Unix socket "/build/tmp.xiICVON7AD/.s.PGSQL.5432"1433pg_graphql-1.6.1> 2026-10-09 21:48:57.684 GMT [75] LOG:  database system was shut down at 2026-10-09 21:48:57 GMT1434pg_graphql-1.6.1> 2026-10-09 21:48:57.688 GMT [72] LOG:  database system is ready to accept connections1435pg_graphql-1.6.1>  done1436pg_graphql-1.6.1> server started1437pg_graphql-1.6.1> createuser: error: connection to server at "localhost" (127.0.0.1), port 5432 failed: Connection refused1438pg_graphql-1.6.1> 	Is the server running on that host and accepting TCP/IP connections?1439pg_graphql-1.6.1> waiting for server to shut down....2026-10-09 21:48:57.757 GMT [72] LOG:  received fast shutdown request1440pg_graphql-1.6.1> 2026-10-09 21:48:57.762 GMT [72] LOG:  aborting any active transactions1441pg_graphql-1.6.1> 2026-10-09 21:48:57.768 GMT [72] LOG:  background worker "logical replication launcher" (PID 78) exited with exit code 11442pg_graphql-1.6.1> 2026-10-09 21:48:57.769 GMT [73] LOG:  shutting down1443pg_graphql-1.6.1> 2026-10-09 21:48:57.772 GMT [73] LOG:  checkpoint starting: shutdown immediate1444pg_graphql-1.6.1> 2026-10-09 21:48:57.813 GMT [73] LOG:  checkpoint complete: wrote 3 buffers (0.0%); 0 WAL file(s) added, 0 removed, 0 recycled; write=0.013 s, sync=0.005 s, total=0.044 s; sync files=2, longest=0.004 s, average=0.003 s; distance=0 kB, estimate=0 kB; lsn=0/14EC340, redo lsn=0/14EC3401445pg_graphql-1.6.1> 2026-10-09 21:48:57.823 GMT [72] LOG:  database system is shut down1446pg_graphql-1.5.11>    Compiling darling_core v0.14.41447pg_graphql-1.6.1>  done1448pg_graphql-1.6.1> server stopped1449pg_graphql-1.6.1>        Using PgConfig("pg17") and `pg_config` from /nix/store/w828ivs2af99jmnq3vali46cgpban5pa-postgresql-17.11/bin/pg_config1450pg_graphql-1.6.1>     Building extension with features  pg171451pg_graphql-1.6.1>      Running command "/nix/store/v22mxn4c646lqn0aa60pwqh8dh88gr5n-cargo-1.88.0-x86_64-unknown-linux-gnu/bin/cargo" "build" "--lib" "--release" "--features" " pg17" "--no-default-features" "--message-format=json-render-diagnostics" "--frozen" "-j" "4"1452pg_graphql-1.6.1>    Compiling proc-macro2 v1.0.1011453pg_graphql-1.6.1>    Compiling unicode-ident v1.0.161454pg_graphql-1.6.1>    Compiling libc v0.2.1751455pg_graphql-1.6.1>    Compiling stable_deref_trait v1.2.01456pg_graphql-1.6.1>    Compiling litemap v0.7.41457pg_graphql-1.6.1>    Compiling writeable v0.5.51458pg_graphql-1.5.11>    Compiling convert_case v0.6.01459pg_graphql-1.6.1>    Compiling serde v1.0.2191460pg_graphql-1.6.1>    Compiling memchr v2.7.41461pg_graphql-1.5.11>    Compiling petgraph v0.6.51462pg_graphql-1.6.1>    Compiling thiserror v2.0.161463pg_graphql-1.6.1>    Compiling eyre v0.6.121464pg_graphql-1.5.9>    Compiling toml_datetime v0.6.51465pg_graphql-1.5.9>    Compiling serde_spanned v0.6.51466pg_graphql-1.6.1>    Compiling icu_locid_transform_data v1.5.01467pg_graphql-1.6.1>    Compiling icu_properties_data v1.5.01468pg_graphql-1.6.1>    Compiling icu_normalizer_data v1.5.01469pg_graphql-1.6.1>    Compiling serde_json v1.0.1381470pg_graphql-1.6.1>    Compiling write16 v1.0.01471pg_graphql-1.6.1>    Compiling quote v1.0.401472pg_graphql-1.6.1>    Compiling utf8_iter v1.0.41473pg_graphql-1.5.9>    Compiling toml_edit v0.22.91474pg_graphql-1.5.11>    Compiling rustc_version v0.3.31475pg_graphql-1.6.1>    Compiling glob v0.3.21476pg_graphql-1.6.1>    Compiling syn v2.0.981477pg_graphql-1.6.1>    Compiling smallvec v1.13.21478pg_graphql-1.5.11>    Compiling pgrx-bindgen v0.12.91479pg_graphql-1.6.1>    Compiling shlex v1.3.01480pg_graphql-1.6.1>    Compiling utf16_iter v1.0.51481pg_graphql-1.6.1>    Compiling clang-sys v1.8.11482pg_graphql-1.5.11>    Compiling zerocopy-derive v0.7.351483pg_graphql-1.5.9>    Compiling semver v0.11.01484pg_graphql-1.6.1>    Compiling indenter v0.3.31485pg_graphql-1.5.11>    Compiling cee-scape v0.2.01486pg_graphql-1.6.1>    Compiling winnow v0.7.131487pg_graphql-1.6.1>    Compiling once_cell v1.21.31488pg_graphql-1.6.1>    Compiling anyhow v1.0.951489pg_graphql-1.5.9>    Compiling getrandom v0.2.141490pg_graphql-1.5.11>    Compiling radium v0.7.01491pg_graphql-1.5.9>    Compiling toml v0.8.121492pg_graphql-1.5.11>    Compiling unescape v0.1.01493pg_graphql-1.6.1>    Compiling cc v1.2.111494pg_graphql-1.5.11>    Compiling zerocopy v0.7.351495pg_graphql-1.6.1>    Compiling aho-corasick v1.1.31496pg_graphql-1.5.9>    Compiling cargo_toml v0.19.21497pg_graphql-1.6.1>    Compiling toml_parser v1.0.21498pg_graphql-1.5.11>    Compiling pgrx-sql-entity-graph v0.12.91499pg_graphql-1.5.11>    Compiling pgrx-pg-sys v0.12.91500pg_graphql-1.6.1>    Compiling toml_writer v1.0.21501pg_graphql-1.6.1>    Compiling percent-encoding v2.3.11502pg_graphql-1.6.1>    Compiling cfg-if v1.0.01503pg_graphql-1.6.1>    Compiling regex-syntax v0.8.51504pg_graphql-1.6.1>    Compiling owo-colors v4.2.21505pg_graphql-1.5.9>    Compiling unicode-segmentation v1.11.01506pg_graphql-1.6.1>    Compiling minimal-lexical v0.2.11507pg_graphql-1.6.1>    Compiling is_ci v1.2.01508pg_graphql-1.5.9>    Compiling pgrx-pg-config v0.12.61509pg_graphql-1.6.1>    Compiling synstructure v0.13.11510pg_graphql-1.6.1>    Compiling supports-color v3.0.21511pg_graphql-1.5.11>    Compiling darling_macro v0.14.41512pg_graphql-1.6.1>    Compiling nom v7.1.31513pg_graphql-1.6.1>    Compiling form_urlencoded v1.2.11514pg_graphql-1.6.1>    Compiling libloading v0.8.61515pg_graphql-1.5.11>    Compiling atomic-traits v0.3.01516pg_graphql-1.5.9>    Compiling fixedbitset v0.4.21517pg_graphql-1.5.11>    Compiling heapless v0.8.01518pg_graphql-1.6.1>    Compiling regex-automata v0.4.91519pg_graphql-1.5.9>    Compiling byteorder v1.5.01520pg_graphql-1.5.11>    Compiling tap v1.0.11521pg_graphql-1.5.9>    Compiling fnv v1.0.71522pg_graphql-1.5.9>    Compiling strsim v0.10.01523pg_graphql-1.5.11>    Compiling wyz v0.5.11524pg_graphql-1.5.11>    Compiling darling v0.14.41525pg_graphql-1.5.9>    Compiling ident_case v1.0.11526pg_graphql-1.6.1>    Compiling bindgen v0.71.11527pg_graphql-1.5.9>    Compiling darling_core v0.14.41528pg_graphql-1.5.11>    Compiling ppv-lite86 v0.2.201529pg_graphql-1.6.1>    Compiling equivalent v1.0.11530pg_graphql-1.6.1>    Compiling ryu v1.0.191531pg_graphql-1.6.1>    Compiling syn v1.0.1091532pg_graphql-1.6.1>    Compiling foldhash v0.1.51533pg_graphql-1.6.1>    Compiling zerofrom-derive v0.1.51534pg_graphql-1.5.11>    Compiling rand_core v0.6.41535pg_graphql-1.6.1>    Compiling yoke-derive v0.7.51536pg_graphql-1.5.11>    Compiling hash32 v0.3.11537pg_graphql-1.6.1>    Compiling zerovec-derive v0.10.31538pg_graphql-1.5.11>    Compiling enum-map-derive v0.17.01539pg_graphql-1.5.9>    Compiling petgraph v0.6.41540pg_graphql-1.5.9>    Compiling pgrx-bindgen v0.12.61541pg_graphql-1.5.9>    Compiling convert_case v0.6.01542pg_graphql-1.6.1>    Compiling displaydoc v0.2.51543pg_graphql-1.6.1>    Compiling serde_derive v1.0.2191544pg_graphql-1.5.11>    Compiling pgrx-macros v0.12.91545pg_graphql-1.5.9>    Compiling rustc_version v0.3.31546pg_graphql-1.5.9>    Compiling cee-scape v0.2.01547pg_graphql-1.6.1>    Compiling zerofrom v0.1.51548pg_graphql-1.6.1>    Compiling yoke v0.7.51549pg_graphql-1.6.1>    Compiling zerovec v0.10.41550pg_graphql-1.5.9>    Compiling unescape v0.1.01551pg_graphql-1.5.9>    Compiling radium v0.7.01552pg_graphql-1.6.1>    Compiling icu_provider_macros v1.5.01553pg_graphql-1.6.1>    Compiling thiserror-impl v2.0.161554pg_graphql-1.5.9>    Compiling pgrx-sql-entity-graph v0.12.61555pg_graphql-1.6.1>    Compiling allocator-api2 v0.2.211556pg_graphql-1.6.1>    Compiling tinystr v0.7.61557pg_graphql-1.5.9>    Compiling atomic-traits v0.3.01558pg_graphql-1.6.1>    Compiling icu_locid v1.5.01559pg_graphql-1.6.1>    Compiling icu_collections v1.5.01560pg_graphql-1.5.9>    Compiling darling_macro v0.14.41561pg_graphql-1.5.11>    Compiling sptr v0.3.21562pg_graphql-1.5.11>    Compiling half v1.8.31563pg_graphql-1.6.1>    Compiling icu_provider v1.5.01564pg_graphql-1.5.11>    Compiling funty v2.0.01565pg_graphql-1.6.1>    Compiling icu_locid_transform v1.5.01566pg_graphql-1.5.9>    Compiling pgrx-pg-sys v0.12.61567pg_graphql-1.6.1>    Compiling itoa v1.0.141568pg_graphql-1.6.1>    Compiling either v1.13.01569pg_graphql-1.5.9>    Compiling void v1.0.21570pg_graphql-1.6.1>    Compiling getrandom v0.3.11571pg_graphql-1.5.9>    Compiling heapless v0.8.01572pg_graphql-1.6.1>    Compiling unicode-width v0.2.11573pg_graphql-1.6.1>    Compiling icu_properties v1.5.11574pg_graphql-1.6.1>    Compiling anstyle v1.0.101575pg_graphql-1.5.9>    Compiling tap v1.0.11576pg_graphql-1.6.1>    Compiling annotate-snippets v0.11.51577pg_graphql-1.5.11>    Compiling bytes v1.10.01578pg_graphql-1.5.9>    Compiling wyz v0.5.11579pg_graphql-1.6.1>    Compiling itertools v0.13.01580pg_graphql-1.5.9>    Compiling unreachable v1.0.01581pg_graphql-1.5.9>    Compiling darling v0.14.41582pg_graphql-1.5.9>    Compiling hash32 v0.3.11583pg_graphql-1.5.9>    Compiling rand_core v0.6.41584pg_graphql-1.6.1>    Compiling hashbrown v0.15.21585pg_graphql-1.5.9>    Compiling enum-map-derive v0.17.01586pg_graphql-1.6.1>    Compiling regex v1.11.11587pg_graphql-1.6.1>    Compiling cexpr v0.6.01588pg_graphql-1.5.11>    Compiling combine v4.6.71589pg_graphql-1.6.1>    Compiling icu_normalizer v1.5.01590pg_graphql-1.6.1>    Compiling pathsearch v0.2.01591pg_graphql-1.6.1>    Compiling idna_adapter v1.2.01592pg_graphql-1.6.1>    Compiling idna v1.0.31593pg_graphql-1.5.9>    Compiling pgrx-macros v0.12.61594pg_graphql-1.6.1>    Compiling url v2.5.41595pg_graphql-1.6.1>    Compiling toml_datetime v0.7.01596pg_graphql-1.6.1>    Compiling serde_spanned v1.0.01597pg_graphql-1.6.1>    Compiling toml v0.9.51598pg_graphql-1.6.1>    Compiling bitflags v2.9.31599pg_graphql-1.6.1>    Compiling cargo_toml v0.22.31600pg_graphql-1.6.1>    Compiling rustc-hash v2.1.11601pg_graphql-1.6.1>    Compiling same-file v1.0.61602pg_graphql-1.5.9>    Compiling stable_deref_trait v1.2.01603pg_graphql-1.5.9>    Compiling funty v2.0.01604pg_graphql-1.6.1>    Compiling walkdir v2.5.01605pg_graphql-1.6.1>    Compiling pgrx-pg-config v0.16.11606pg_graphql-1.5.9>    Compiling half v1.8.31607pg_graphql-1.5.9>    Compiling ascii v0.9.31608pg_graphql-1.6.1>    Compiling indexmap v2.7.11609pg_graphql-1.5.9>    Compiling ppv-lite86 v0.2.171610pg_graphql-1.5.9>    Compiling sptr v0.3.21611pg_graphql-1.6.1>    Compiling strsim v0.10.01612pg_graphql-1.5.11>    Compiling bitvec v1.0.11613pg_graphql-1.6.1>    Compiling zerocopy v0.8.141614pg_graphql-1.6.1>    Compiling fnv v1.0.71615pg_graphql-1.6.1>    Compiling ident_case v1.0.11616pg_graphql-1.6.1>    Compiling fixedbitset v0.5.71617pg_graphql-1.6.1>    Compiling unicode-segmentation v1.12.01618pg_graphql-1.6.1>    Compiling convert_case v0.8.01619pg_graphql-1.6.1>    Compiling darling_core v0.14.41620pg_graphql-1.6.1>    Compiling petgraph v0.8.21621pg_graphql-1.5.9>    Compiling rand_chacha v0.3.11622pg_graphql-1.5.11>    Compiling serde_cbor v0.11.21623pg_graphql-1.5.9>    Compiling combine v3.8.11624pg_graphql-1.6.1>    Compiling pgrx-bindgen v0.16.11625pg_graphql-1.5.11>    Compiling enum-map v2.7.31626pg_graphql-1.5.11>    Compiling rand_chacha v0.3.11627pg_graphql-1.6.1>    Compiling zerocopy-derive v0.7.351628pg_graphql-1.5.11>    Compiling cached_proc_macro v0.18.11629pg_graphql-1.6.1>    Compiling cee-scape v0.2.01630pg_graphql-1.5.11>    Compiling uuid v1.12.11631pg_graphql-1.6.1>    Compiling thiserror v1.0.691632pg_graphql-1.6.1>    Compiling unescape v0.1.01633pg_graphql-1.6.1>    Compiling byteorder v1.5.01634pg_graphql-1.5.11>    Compiling instant v0.1.131635pg_graphql-1.5.11>    Compiling seahash v4.1.01636pg_graphql-1.6.1>    Compiling radium v0.7.01637pg_graphql-1.5.11>    Compiling hashbrown v0.14.51638pg_graphql-1.5.11>    Compiling cached_proc_macro_types v0.1.11639pg_graphql-1.5.11>    Compiling itertools v0.10.51640pg_graphql-1.6.1>    Compiling zerocopy v0.7.351641pg_graphql-1.5.11>    Compiling rand v0.8.51642pg_graphql-1.5.11>    Compiling cached v0.46.11643pg_graphql-1.6.1>    Compiling pgrx-sql-entity-graph v0.16.11644pg_graphql-1.5.11>    Compiling graphql-parser v0.4.11645pg_graphql-1.6.1>    Compiling pgrx-pg-sys v0.16.11646pg_graphql-1.6.1>    Compiling darling_macro v0.14.4