nixbot

builds

cancelled checks.x86_64-linux.ext-pg_jsonschema build #303 · raw · eval 6.4 s · 1.1 GiB allocated · ·

1these 59 derivations will be built:2  /nix/store/fjsw2bra91j37wrbg04gav3a54zy2njb-pg_jsonschema-0.3.3.drv3  /nix/store/480qgchkkr5y8k6mfj1g5s01gj32bvib-pg_jsonschema.drv4  /nix/store/lv80hhh3c5hl3szdlj40vaz3lzq2y2vs-postgresql-17-pg_jsonschema.drv5  /nix/store/2fn5752xxj2n2ab14kn1hjq3wsmqlrwk-cargo-pgrx-0.11.3.drv6  /nix/store/arjy95b7c5yplr9lay2vywffm50hzb71-pg_jsonschema-0.3.1.drv7  /nix/store/sr087rsy4l32dxvkv2bvah8asvz57rkv-cargo-pgrx-0.10.2.drv8  /nix/store/daia7nwbk09kg4v3cal091w0cckj3pqr-pg_jsonschema-0.2.0.drv9  /nix/store/qgv0kpmk6w70i8d3bp75z7jvdz46iwb5-pg_jsonschema-0.3.3.drv10  /nix/store/iry1cfph8v3bgc7xx9i6ynq59j7fml47-pg_jsonschema.drv11  /nix/store/s723qipbdbi45b54wc4sj5han8ism2j3-postgresql-15-pg_jsonschema.drv12  /nix/store/x7fb2mv0vsvxyd8dv0pa8bzwawx2g8gl-unit-script-postgresql-migrate-start.drv13  /nix/store/0b22z2cmnxwnf2mgqvipkw8kxf1108fl-unit-postgresql-migrate.service.drv14  /nix/store/y77mv6p69l51d4g9ibmnm3ja7f8r2x62-system-path.drv15  /nix/store/gx5ny834iadia85pmqnwxky387v1if9l-dbus-1.drv16  /nix/store/dkk42sa9f8lbyqsb4990z0vm1h0zisqa-X-Restart-Triggers-dbus.drv17  /nix/store/jhg77bmvlarmayg3zmr8wxdc6k8j8zk7-unit-dbus.service.drv18  /nix/store/0j9mx8y9hfnj3kbsghsxlrma53jwi3qj-user-units.drv19  /nix/store/98dnbdk5z2n7fihywin1w6vd2aqbb8rh-system-path.drv20  /nix/store/9wyydr3x6npg905ixv8npgn0pm56z0pq-dbus-1.drv21  /nix/store/72k1sgpmgjxc74mprs6m3y1k6y8gvp23-X-Restart-Triggers-dbus.drv22  /nix/store/gxfgyv3y55ccys62dsnvz3wk5vp4f0ma-unit-dbus.service.drv23  /nix/store/ibwp38inxzizjj1cbbjmddq3807ciycj-unit-postgresql.service.drv24  /nix/store/vi054bz129z24l9ggbyfwpachiaxpzs8-unit-postgresql-setup.service.drv25  /nix/store/4asn5n6jnxbph3n8j0iir9dwvw49f4kh-system-units.drv26  /nix/store/bmj1dzswh5hjp5y5hm1a2kznwjjdan0v-unit-dbus.service.drv27  /nix/store/aavhkb4p3a8y4cdahgpiyj32ds0srnw8-user-units.drv28  /nix/store/2yk616v23wqdp5asj40v6xanx0i2pwxh-etc.drv29  /nix/store/3jia1hlk457jk6dzb1gax2bbx5w3855x-unit-postgresql-setup.service.drv30  /nix/store/pwm4m7dq1ykn75vpxbryhkdgvqrb96xj-unit-postgresql.service.drv31  /nix/store/xk1xzk90qwmg6lq4fhdifmjcmi9x2c60-unit-dbus.service.drv32  /nix/store/8k4yz86yxqksbx42g1pilp49p3lli3rw-system-units.drv33  /nix/store/84vxda9sww07f52047pamw4r7gpfw0f3-etc.drv34  /nix/store/6n4agkwlib65w5vqid9kak3drj526ack-activate.drv35  /nix/store/kwpns31sn0j9b4wdxk2yg0amyz5kb22i-pg_jsonschema-0.3.3.drv36  /nix/store/bpfgnjlrn38i96w4fbcxcwxhwr7vq2xj-pg_jsonschema.drv37  /nix/store/dq8nvcp7ai58q3h55daxg7d3ac0a4c68-postgresql-orioledb-17-pg_jsonschema.drv38  /nix/store/gl3jzx4kd7z9a7gc066jai8rplik8jfc-postgresql-configfile-check.drv39  /nix/store/8ar3cm99jag6kiza9p634w9cgc3hp7rh-unit-postgresql-setup.service.drv40  /nix/store/apaw69g42lgddx9ird0c5v4vwb3a88i0-unit-postgresql.service.drv41  /nix/store/yw4ljnd7aqcm9yb36nvlq245ssmznzhf-system-path.drv42  /nix/store/gpp79h26pjwr5r22pc8s6xgpnbnsldrv-dbus-1.drv43  /nix/store/w3zm6qjp9id026nnrk4z4x7jq6pyj5lc-X-Restart-Triggers-dbus.drv44  /nix/store/liwyr8kb69lx8hgn9dl5fjrnhs9j14qw-unit-dbus.service.drv45  /nix/store/ays2brl8x1b9qqs310hdjn2dsbbskvdi-system-units.drv46  /nix/store/7vscs76s1i1z8za36qx45db270wsa638-unit-dbus.service.drv47  /nix/store/vk2y7vf273f8z9lsygac6scdg288h3j9-user-units.drv48  /nix/store/qcw1if51vpcwpdb3ga5fc2i03852b78j-etc.drv49  /nix/store/ygzwnifld1rghmg7sswjp2wj1i1zyam3-activate.drv50  /nix/store/jhsqljxcl2mksshk6nx5dfrmpvcs2bfx-nixos-system-server-test.drv51  /nix/store/rm7lix6vqmgrl3y8v0xb8nm3f85yy24i-postgresql-configfile-check.drv52  /nix/store/5ma51qqnsw1kjg82iid8h8dgxjjmmavy-activate.drv53  /nix/store/f400jfhdbppl87z513qwxxfs5fx046x6-postgresql-configfile-check.drv54  /nix/store/zbsfdqrh7afj9nmr84gxpi5r0wbkf352-nixos-system-server-test.drv55  /nix/store/xw0anl7ppwz5ca7wmjmfv1l26zncd95k-nixos-system-server-test.drv56  /nix/store/ljjxp80mxjf1mynz8sqcdr4rz41vm8bp-closure-info.drv57  /nix/store/qkhxfbrk73l52vdcjpi79gw9pxf9aa6j-run-nixos-vm.drv58  /nix/store/4yc8dxmz0j5vccnab49pzryl08r795wl-nixos-vm.drv59  /nix/store/gbikm2swm3nm98k01b557qh3miyl3vcr-nixos-test-driver-pg_jsonschema.drv60  /nix/store/qghx97y8khygalvrxxwfwwvhy4drkbnw-vm-test-run-pg_jsonschema.drv61these 2 paths will be fetched (43.0 MiB download, 603.1 MiB unpacked):62  /nix/store/w8jk9gvs9xmnfcrxr2sgnndzjprx3wzz-cargo-pgrx-0.10.2-vendor63  /nix/store/6ncpc43hwjvmjn3m4g5h2yfkdd083zqr-cargo-pgrx-0.11.3-vendor64building '/nix/store/fjsw2bra91j37wrbg04gav3a54zy2njb-pg_jsonschema-0.3.3.drv'65building '/nix/store/kwpns31sn0j9b4wdxk2yg0amyz5kb22i-pg_jsonschema-0.3.3.drv'66building '/nix/store/qgv0kpmk6w70i8d3bp75z7jvdz46iwb5-pg_jsonschema-0.3.3.drv'67pg_jsonschema-0.3.3> Running phase: unpackPhase68pg_jsonschema-0.3.3> unpacking source archive /nix/store/ygr3dv7kvi4bad2mn65ss6n9k8m51zj2-source69pg_jsonschema-0.3.3> Running phase: unpackPhase70pg_jsonschema-0.3.3> unpacking source archive /nix/store/ygr3dv7kvi4bad2mn65ss6n9k8m51zj2-source71pg_jsonschema-0.3.3> source root is source72pg_jsonschema-0.3.3> Executing cargoSetupPostUnpackHook73pg_jsonschema-0.3.3> source root is source74pg_jsonschema-0.3.3> Executing cargoSetupPostUnpackHook75pg_jsonschema-0.3.3> Running phase: unpackPhase76pg_jsonschema-0.3.3> unpacking source archive /nix/store/ygr3dv7kvi4bad2mn65ss6n9k8m51zj2-source77pg_jsonschema-0.3.3> source root is source78pg_jsonschema-0.3.3> Executing cargoSetupPostUnpackHook79pg_jsonschema-0.3.3> Finished cargoSetupPostUnpackHook80pg_jsonschema-0.3.3> Finished cargoSetupPostUnpackHook81pg_jsonschema-0.3.3> Running phase: patchPhase82pg_jsonschema-0.3.3> Executing cargoSetupPostPatchHook83pg_jsonschema-0.3.3> Validating consistency between /build/source/Cargo.lock and /build/cargo-vendor-dir/Cargo.lock84pg_jsonschema-0.3.3> Running phase: patchPhase85pg_jsonschema-0.3.3> Executing cargoSetupPostPatchHook86pg_jsonschema-0.3.3> Finished cargoSetupPostPatchHook87pg_jsonschema-0.3.3> Running phase: updateAutotoolsGnuConfigScriptsPhase88pg_jsonschema-0.3.3> Validating consistency between /build/source/Cargo.lock and /build/cargo-vendor-dir/Cargo.lock89pg_jsonschema-0.3.3> Finished cargoSetupPostPatchHook90pg_jsonschema-0.3.3> Running phase: configurePhase91pg_jsonschema-0.3.3> Running phase: updateAutotoolsGnuConfigScriptsPhase92pg_jsonschema-0.3.3> Running phase: buildPhase93pg_jsonschema-0.3.3> Finished cargoSetupPostUnpackHook94pg_jsonschema-0.3.3> Processing git tags...95pg_jsonschema-0.3.3> Executing cargo-pgrx buildPhase96pg_jsonschema-0.3.3> Running phase: configurePhase97pg_jsonschema-0.3.3>    Validating /nix/store/bqpxbn1hjfk3fnlwfixyi68w3y7amy9k-postgresql-15.19/bin/pg_config98pg_jsonschema-0.3.3>  Initializing data directory at /build/tmp.vhK8nMVCOW/data-1599pg_jsonschema-0.3.3> Running phase: patchPhase100pg_jsonschema-0.3.3> Running phase: buildPhase101pg_jsonschema-0.3.3> Executing cargoSetupPostPatchHook102pg_jsonschema-0.3.3> Processing git tags...103pg_jsonschema-0.3.3> Validating consistency between /build/source/Cargo.lock and /build/cargo-vendor-dir/Cargo.lock104pg_jsonschema-0.3.3> Executing cargo-pgrx buildPhase105pg_jsonschema-0.3.3> Finished cargoSetupPostPatchHook106pg_jsonschema-0.3.3> Running phase: updateAutotoolsGnuConfigScriptsPhase107pg_jsonschema-0.3.3>    Validating /nix/store/w828ivs2af99jmnq3vali46cgpban5pa-postgresql-17.11/bin/pg_config108pg_jsonschema-0.3.3> Running phase: configurePhase109pg_jsonschema-0.3.3>  Initializing data directory at /build/tmp.zWQoTC51Ez/data-17110pg_jsonschema-0.3.3> Running phase: buildPhase111pg_jsonschema-0.3.3> Processing git tags...112pg_jsonschema-0.3.3> Executing cargo-pgrx buildPhase113pg_jsonschema-0.3.3>    Validating /nix/store/4isspxcc39w2zbr91kphxhsixbvghgaj-postgresql-17_22/bin/pg_config114pg_jsonschema-0.3.3>  Initializing data directory at /build/tmp.mxrUw7QU0K/data-17115pg_jsonschema-0.3.3> waiting for server to start....2026-10-09 21:44:56.225 GMT [75] LOG:  starting PostgreSQL 15.19 on x86_64-pc-linux-gnu, compiled by gcc (GCC) 15.2.0, 64-bit116pg_jsonschema-0.3.3> 2026-10-09 21:44:56.226 GMT [75] LOG:  listening on Unix socket "/build/tmp.sOBcoKxZOf/.s.PGSQL.5432"117pg_jsonschema-0.3.3> 2026-10-09 21:44:56.250 GMT [78] LOG:  database system was shut down at 2026-10-09 21:44:56 GMT118pg_jsonschema-0.3.3> 2026-10-09 21:44:56.272 GMT [75] LOG:  database system is ready to accept connections119pg_jsonschema-0.3.3>  done120pg_jsonschema-0.3.3> server started121pg_jsonschema-0.3.3> waiting for server to start....2026-10-09 21:44:56.310 GMT [75] LOG:  starting PostgreSQL 17.11 on x86_64-pc-linux-gnu, compiled by gcc (GCC) 15.2.0, 64-bit122pg_jsonschema-0.3.3> 2026-10-09 21:44:56.311 GMT [75] LOG:  listening on Unix socket "/build/tmp.heYQKUI5Yv/.s.PGSQL.5432"123pg_jsonschema-0.3.3> createuser: error: connection to server at "localhost" (127.0.0.1), port 5432 failed: Connection refused124pg_jsonschema-0.3.3> 	Is the server running on that host and accepting TCP/IP connections?125pg_jsonschema-0.3.3> waiting for server to shut down....2026-10-09 21:44:56.312 GMT [75] LOG:  received fast shutdown request126pg_jsonschema-0.3.3> 2026-10-09 21:44:56.319 GMT [75] LOG:  aborting any active transactions127pg_jsonschema-0.3.3> 2026-10-09 21:44:56.323 GMT [75] LOG:  background worker "logical replication launcher" (PID 81) exited with exit code 1128pg_jsonschema-0.3.3> 2026-10-09 21:44:56.332 GMT [78] LOG:  database system was shut down at 2026-10-09 21:44:56 GMT129pg_jsonschema-0.3.3> 2026-10-09 21:44:56.337 GMT [75] LOG:  database system is ready to accept connections130pg_jsonschema-0.3.3> 2026-10-09 21:44:56.340 GMT [76] LOG:  shutting down131pg_jsonschema-0.3.3> 2026-10-09 21:44:56.342 GMT [76] LOG:  checkpoint starting: shutdown immediate132pg_jsonschema-0.3.3>  done133pg_jsonschema-0.3.3> server started134pg_jsonschema-0.3.3> 2026-10-09 21:44:56.385 GMT [76] LOG:  checkpoint complete: wrote 3 buffers (0.0%); 0 WAL file(s) added, 0 removed, 0 recycled; write=0.015 s, sync=0.004 s, total=0.045 s; sync files=2, longest=0.002 s, average=0.002 s; distance=0 kB, estimate=0 kB135pg_jsonschema-0.3.3> createuser: error: connection to server at "localhost" (127.0.0.1), port 5432 failed: Connection refused136pg_jsonschema-0.3.3> 	Is the server running on that host and accepting TCP/IP connections?137pg_jsonschema-0.3.3> waiting for server to shut down....2026-10-09 21:44:56.399 GMT [75] LOG:  received fast shutdown request138pg_jsonschema-0.3.3> 2026-10-09 21:44:56.400 GMT [75] LOG:  database system is shut down139pg_jsonschema-0.3.3> 2026-10-09 21:44:56.406 GMT [75] LOG:  aborting any active transactions140pg_jsonschema-0.3.3>  done141pg_jsonschema-0.3.3> server stopped142pg_jsonschema-0.3.3> 2026-10-09 21:44:56.417 GMT [75] LOG:  background worker "logical replication launcher" (PID 81) exited with exit code 1143pg_jsonschema-0.3.3> 2026-10-09 21:44:56.420 GMT [76] LOG:  shutting down144pg_jsonschema-0.3.3> warning: `/build/source/.cargo/config` is deprecated in favor of `config.toml`145pg_jsonschema-0.3.3> note: if you need to support cargo 1.38 or earlier, you can symlink `config` to `config.toml`146pg_jsonschema-0.3.3> 2026-10-09 21:44:56.425 GMT [76] LOG:  checkpoint starting: shutdown immediate147pg_jsonschema-0.3.3> 2026-10-09 21:44:56.453 GMT [76] LOG:  checkpoint complete: wrote 3 buffers (0.0%); 0 WAL file(s) added, 0 removed, 0 recycled; write=0.007 s, sync=0.007 s, total=0.033 s; sync files=2, longest=0.004 s, average=0.004 s; distance=0 kB, estimate=0 kB; lsn=0/14EC340, redo lsn=0/14EC340148pg_jsonschema-0.3.3> 2026-10-09 21:44:56.478 GMT [75] LOG:  database system is shut down149pg_jsonschema-0.3.3>  done150pg_jsonschema-0.3.3> server stopped151pg_jsonschema-0.3.3> waiting for server to start....2026-10-09 21:44:56.507 GMT [75] LOG:  starting PostgreSQL 17.11 on x86_64-pc-linux-gnu, compiled by gcc (GCC) 15.2.0, 64-bit152pg_jsonschema-0.3.3> 2026-10-09 21:44:56.509 GMT [75] LOG:  listening on Unix socket "/build/tmp.34cdwX2fk2/.s.PGSQL.5432"153pg_jsonschema-0.3.3> warning: `/build/source/.cargo/config` is deprecated in favor of `config.toml`154pg_jsonschema-0.3.3> note: if you need to support cargo 1.38 or earlier, you can symlink `config` to `config.toml`155pg_jsonschema-0.3.3> 2026-10-09 21:44:56.511 GMT [78] LOG:  database system was shut down at 2026-10-09 21:44:56 GMT156pg_jsonschema-0.3.3> 2026-10-09 21:44:56.515 GMT [75] LOG:  database system is ready to accept connections157pg_jsonschema-0.3.3>  done158pg_jsonschema-0.3.3> server started159pg_jsonschema-0.3.3> createuser: error: connection to server at "localhost" (127.0.0.1), port 5432 failed: Connection refused160pg_jsonschema-0.3.3> 	Is the server running on that host and accepting TCP/IP connections?161pg_jsonschema-0.3.3> waiting for server to shut down....2026-10-09 21:44:56.585 GMT [75] LOG:  received fast shutdown request162pg_jsonschema-0.3.3> 2026-10-09 21:44:56.586 GMT [75] LOG:  aborting any active transactions163pg_jsonschema-0.3.3> 2026-10-09 21:44:56.597 GMT [75] LOG:  background worker "logical replication launcher" (PID 81) exited with exit code 1164pg_jsonschema-0.3.3> 2026-10-09 21:44:56.598 GMT [76] LOG:  shutting down165pg_jsonschema-0.3.3> 2026-10-09 21:44:56.601 GMT [76] LOG:  checkpoint starting: shutdown immediate166pg_jsonschema-0.3.3> 2026-10-09 21:44:56.652 GMT [76] LOG:  checkpoint complete: wrote 3 buffers (0.0%); 0 WAL file(s) added, 0 removed, 0 recycled; write=0.018 s, sync=0.008 s, total=0.054 s; sync files=2, longest=0.004 s, average=0.004 s; distance=0 kB, estimate=0 kB; lsn=0/14EC918, redo lsn=0/14EC918167pg_jsonschema-0.3.3> 2026-10-09 21:44:56.662 GMT [75] LOG:  database system is shut down168pg_jsonschema-0.3.3>  done169pg_jsonschema-0.3.3> server stopped170pg_jsonschema-0.3.3> warning: `/build/source/.cargo/config` is deprecated in favor of `config.toml`171pg_jsonschema-0.3.3> note: if you need to support cargo 1.38 or earlier, you can symlink `config` to `config.toml`172pg_jsonschema-0.3.3>        Using PgConfig("pg15") and `pg_config` from /nix/store/bqpxbn1hjfk3fnlwfixyi68w3y7amy9k-postgresql-15.19/bin/pg_config173pg_jsonschema-0.3.3>     Building extension with features  pg15174pg_jsonschema-0.3.3>      Running command "/nix/store/pyy42gsq79knd27wxp7xr92div792djv-rust-default-1.80.0/bin/cargo" "build" "--lib" "--release" "--features" " pg15" "--no-default-features" "--message-format=json-render-diagnostics" "--frozen" "-j" "4"175pg_jsonschema-0.3.3> warning: `/build/source/.cargo/config` is deprecated in favor of `config.toml`176pg_jsonschema-0.3.3> note: if you need to support cargo 1.38 or earlier, you can symlink `config` to `config.toml`177pg_jsonschema-0.3.3>        Using PgConfig("pg17") and `pg_config` from /nix/store/w828ivs2af99jmnq3vali46cgpban5pa-postgresql-17.11/bin/pg_config178pg_jsonschema-0.3.3>     Building extension with features  pg17179pg_jsonschema-0.3.3>      Running command "/nix/store/pyy42gsq79knd27wxp7xr92div792djv-rust-default-1.80.0/bin/cargo" "build" "--lib" "--release" "--features" " pg17" "--no-default-features" "--message-format=json-render-diagnostics" "--frozen" "-j" "4"180pg_jsonschema-0.3.3> warning: `/build/source/.cargo/config` is deprecated in favor of `config.toml`181pg_jsonschema-0.3.3> note: if you need to support cargo 1.38 or earlier, you can symlink `config` to `config.toml`182building '/nix/store/sr087rsy4l32dxvkv2bvah8asvz57rkv-cargo-pgrx-0.10.2.drv'183pg_jsonschema-0.3.3>        Using PgConfig("pg17") and `pg_config` from /nix/store/4isspxcc39w2zbr91kphxhsixbvghgaj-postgresql-17_22/bin/pg_config184pg_jsonschema-0.3.3>     Building extension with features  pg17185pg_jsonschema-0.3.3>      Running command "/nix/store/pyy42gsq79knd27wxp7xr92div792djv-rust-default-1.80.0/bin/cargo" "build" "--lib" "--release" "--features" " pg17" "--no-default-features" "--message-format=json-render-diagnostics" "--frozen" "-j" "4"186pg_jsonschema-0.3.3> warning: `/build/source/.cargo/config` is deprecated in favor of `config.toml`187pg_jsonschema-0.3.3> note: if you need to support cargo 1.38 or earlier, you can symlink `config` to `config.toml`188pg_jsonschema-0.3.3>    Compiling proc-macro2 v1.0.79189pg_jsonschema-0.3.3>    Compiling unicode-ident v1.0.12190pg_jsonschema-0.3.3>    Compiling libc v0.2.153191pg_jsonschema-0.3.3>    Compiling thiserror v1.0.58192pg_jsonschema-0.3.3>    Compiling proc-macro2 v1.0.79193pg_jsonschema-0.3.3>    Compiling unicode-ident v1.0.12194pg_jsonschema-0.3.3>    Compiling libc v0.2.153195pg_jsonschema-0.3.3>    Compiling serde v1.0.197196cargo-pgrx-0.10.2> Running phase: unpackPhase197cargo-pgrx-0.10.2> unpacking source archive /nix/store/2xkgm7ny5nw10jb2gwsz4k9mhgv2b66d-cargo-pgrx-0.10.2.tar.gz198cargo-pgrx-0.10.2> source root is cargo-pgrx-0.10.2.tar.gz199cargo-pgrx-0.10.2> Executing cargoSetupPostUnpackHook200pg_jsonschema-0.3.3>    Compiling thiserror v1.0.58201pg_jsonschema-0.3.3>    Compiling serde v1.0.197202pg_jsonschema-0.3.3>    Compiling proc-macro2 v1.0.79203pg_jsonschema-0.3.3>    Compiling unicode-ident v1.0.12204pg_jsonschema-0.3.3>    Compiling libc v0.2.153205pg_jsonschema-0.3.3>    Compiling thiserror v1.0.58206pg_jsonschema-0.3.3>    Compiling serde v1.0.197207pg_jsonschema-0.3.3>    Compiling autocfg v1.2.0208pg_jsonschema-0.3.3>    Compiling autocfg v1.2.0209pg_jsonschema-0.3.3>    Compiling memchr v2.7.2210pg_jsonschema-0.3.3>    Compiling autocfg v1.2.0211pg_jsonschema-0.3.3>    Compiling memchr v2.7.2212pg_jsonschema-0.3.3>    Compiling equivalent v1.0.1213cargo-pgrx-0.10.2> Finished cargoSetupPostUnpackHook214cargo-pgrx-0.10.2> Running phase: patchPhase215cargo-pgrx-0.10.2> Executing cargoSetupPostPatchHook216cargo-pgrx-0.10.2> Validating consistency between /build/cargo-pgrx-0.10.2.tar.gz/Cargo.lock and /build/cargo-pgrx-0.10.2-vendor/Cargo.lock217cargo-pgrx-0.10.2> Finished cargoSetupPostPatchHook218pg_jsonschema-0.3.3>    Compiling eyre v0.6.12219pg_jsonschema-0.3.3>    Compiling memchr v2.7.2220cargo-pgrx-0.10.2> Running phase: updateAutotoolsGnuConfigScriptsPhase221cargo-pgrx-0.10.2> Running phase: configurePhase222pg_jsonschema-0.3.3>    Compiling hashbrown v0.14.3223pg_jsonschema-0.3.3>    Compiling eyre v0.6.12224cargo-pgrx-0.10.2> Running phase: buildPhase225cargo-pgrx-0.10.2> Executing cargoBuildHook226cargo-pgrx-0.10.2> cargoBuildHook flags: -j 4 --target x86_64-unknown-linux-gnu --offline --profile release227pg_jsonschema-0.3.3>    Compiling equivalent v1.0.1228pg_jsonschema-0.3.3>    Compiling hashbrown v0.14.3229pg_jsonschema-0.3.3>    Compiling quote v1.0.36230cargo-pgrx-0.10.2>    Compiling proc-macro2 v1.0.67231cargo-pgrx-0.10.2>    Compiling unicode-ident v1.0.12232cargo-pgrx-0.10.2>    Compiling libc v0.2.148233cargo-pgrx-0.10.2>    Compiling cfg-if v1.0.0234pg_jsonschema-0.3.3>    Compiling equivalent v1.0.1235pg_jsonschema-0.3.3>    Compiling quote v1.0.36236pg_jsonschema-0.3.3>    Compiling quote v1.0.36237cargo-pgrx-0.10.2>    Compiling once_cell v1.18.0238pg_jsonschema-0.3.3>    Compiling syn v2.0.58239pg_jsonschema-0.3.3>    Compiling hashbrown v0.14.3240pg_jsonschema-0.3.3>    Compiling anyhow v1.0.82241pg_jsonschema-0.3.3>    Compiling syn v2.0.58242pg_jsonschema-0.3.3>    Compiling syn v2.0.58243pg_jsonschema-0.3.3>    Compiling indexmap v2.2.6244pg_jsonschema-0.3.3>    Compiling eyre v0.6.12245building '/nix/store/2fn5752xxj2n2ab14kn1hjq3wsmqlrwk-cargo-pgrx-0.11.3.drv'246cargo-pgrx-0.10.2>    Compiling serde v1.0.188247cargo-pgrx-0.11.3> Running phase: unpackPhase248cargo-pgrx-0.11.3> unpacking source archive /nix/store/dl68dnaj2w2lv2n447pp33f2s5f5101w-cargo-pgrx-0.11.3.tar.gz249cargo-pgrx-0.11.3> source root is cargo-pgrx-0.11.3.tar.gz250cargo-pgrx-0.11.3> Executing cargoSetupPostUnpackHook251pg_jsonschema-0.3.3>    Compiling anyhow v1.0.82252pg_jsonschema-0.3.3>    Compiling serde_json v1.0.115253pg_jsonschema-0.3.3>    Compiling indexmap v2.2.6254cargo-pgrx-0.10.2>    Compiling bitflags v2.4.0255pg_jsonschema-0.3.3>    Compiling anyhow v1.0.82256pg_jsonschema-0.3.3>    Compiling indexmap v2.2.6257pg_jsonschema-0.3.3>    Compiling num-traits v0.2.18258pg_jsonschema-0.3.3>    Compiling serde_json v1.0.115259pg_jsonschema-0.3.3>    Compiling num-traits v0.2.18260cargo-pgrx-0.10.2>    Compiling quote v1.0.33261pg_jsonschema-0.3.3>    Compiling glob v0.3.1262cargo-pgrx-0.11.3> Finished cargoSetupPostUnpackHook263pg_jsonschema-0.3.3>    Compiling tinyvec_macros v0.1.1264cargo-pgrx-0.10.2>    Compiling syn v2.0.37265pg_jsonschema-0.3.3>    Compiling glob v0.3.1266pg_jsonschema-0.3.3>    Compiling serde_json v1.0.115267cargo-pgrx-0.10.2>    Compiling cc v1.0.83268cargo-pgrx-0.11.3> Running phase: patchPhase269cargo-pgrx-0.11.3> Executing cargoSetupPostPatchHook270cargo-pgrx-0.11.3> Validating consistency between /build/cargo-pgrx-0.11.3.tar.gz/Cargo.lock and /build/cargo-pgrx-0.11.3-vendor/Cargo.lock271cargo-pgrx-0.11.3> Finished cargoSetupPostPatchHook272cargo-pgrx-0.11.3> Running phase: updateAutotoolsGnuConfigScriptsPhase273cargo-pgrx-0.10.2>    Compiling log v0.4.20274pg_jsonschema-0.3.3>    Compiling num-traits v0.2.18275cargo-pgrx-0.11.3> Running phase: configurePhase276cargo-pgrx-0.11.3> Running phase: buildPhase277cargo-pgrx-0.11.3> Executing cargoBuildHook278cargo-pgrx-0.11.3> cargoBuildHook flags: -j 4 --target x86_64-unknown-linux-gnu --offline --profile release279pg_jsonschema-0.3.3>    Compiling tinyvec_macros v0.1.1280pg_jsonschema-0.3.3>    Compiling tinyvec v1.6.0281cargo-pgrx-0.10.2>    Compiling memchr v2.6.3282cargo-pgrx-0.11.3>    Compiling proc-macro2 v1.0.78283cargo-pgrx-0.11.3>    Compiling unicode-ident v1.0.12284cargo-pgrx-0.11.3>    Compiling cfg-if v1.0.0285cargo-pgrx-0.11.3>    Compiling libc v0.2.152286pg_jsonschema-0.3.3>    Compiling clang-sys v1.7.0287pg_jsonschema-0.3.3>    Compiling tinyvec_macros v0.1.1288pg_jsonschema-0.3.3>    Compiling glob v0.3.1289pg_jsonschema-0.3.3>    Compiling clang-sys v1.7.0290pg_jsonschema-0.3.3>    Compiling tinyvec v1.6.0291cargo-pgrx-0.11.3>    Compiling serde v1.0.195292pg_jsonschema-0.3.3>    Compiling tinyvec v1.6.0293pg_jsonschema-0.3.3>    Compiling winnow v0.6.5294pg_jsonschema-0.3.3>    Compiling once_cell v1.19.0295pg_jsonschema-0.3.3>    Compiling clang-sys v1.7.0296pg_jsonschema-0.3.3>    Compiling winnow v0.6.5297pg_jsonschema-0.3.3>    Compiling indenter v0.3.3298pg_jsonschema-0.3.3>    Compiling indenter v0.3.3299cargo-pgrx-0.10.2>    Compiling autocfg v1.1.0300cargo-pgrx-0.11.3>    Compiling quote v1.0.35301pg_jsonschema-0.3.3>    Compiling is_ci v1.2.0302pg_jsonschema-0.3.3>    Compiling winnow v0.6.5303cargo-pgrx-0.11.3>    Compiling once_cell v1.19.0304cargo-pgrx-0.10.2>    Compiling ring v0.16.20305pg_jsonschema-0.3.3>    Compiling is_ci v1.2.0306pg_jsonschema-0.3.3>    Compiling unicode-normalization v0.1.23307pg_jsonschema-0.3.3>    Compiling is_ci v1.2.0308pg_jsonschema-0.3.3>    Compiling indenter v0.3.3309cargo-pgrx-0.10.2>    Compiling syn v1.0.109310pg_jsonschema-0.3.3>    Compiling once_cell v1.19.0311pg_jsonschema-0.3.3>    Compiling once_cell v1.19.0312cargo-pgrx-0.11.3>    Compiling syn v2.0.48313cargo-pgrx-0.11.3>    Compiling cc v1.0.83314cargo-pgrx-0.11.3>    Compiling memchr v2.7.1315cargo-pgrx-0.10.2>    Compiling pkg-config v0.3.27316pg_jsonschema-0.3.3>    Compiling unicode-normalization v0.1.23317pg_jsonschema-0.3.3>    Compiling is-terminal v0.4.13318cargo-pgrx-0.10.2>    Compiling vcpkg v0.2.15319pg_jsonschema-0.3.3>    Compiling unicode-normalization v0.1.23320pg_jsonschema-0.3.3>    Compiling cfg-if v1.0.0321pg_jsonschema-0.3.3>    Compiling percent-encoding v2.3.1322pg_jsonschema-0.3.3>    Compiling is-terminal v0.4.13323cargo-pgrx-0.10.2>    Compiling crossbeam-utils v0.8.16324pg_jsonschema-0.3.3>    Compiling minimal-lexical v0.2.1325cargo-pgrx-0.11.3>    Compiling log v0.4.20326pg_jsonschema-0.3.3>    Compiling cfg-if v1.0.0327pg_jsonschema-0.3.3>    Compiling is-terminal v0.4.13328pg_jsonschema-0.3.3>    Compiling percent-encoding v2.3.1329pg_jsonschema-0.3.3>    Compiling regex-syntax v0.8.3330pg_jsonschema-0.3.3>    Compiling owo-colors v4.1.0331pg_jsonschema-0.3.3>    Compiling unicode-bidi v0.3.15332pg_jsonschema-0.3.3>    Compiling ucd-trie v0.1.6333pg_jsonschema-0.3.3>    Compiling owo-colors v4.1.0334cargo-pgrx-0.10.2>    Compiling openssl-sys v0.9.93335cargo-pgrx-0.11.3>    Compiling ring v0.17.7336cargo-pgrx-0.10.2>    Compiling rustix v0.38.13337pg_jsonschema-0.3.3>    Compiling owo-colors v4.1.0338pg_jsonschema-0.3.3>    Compiling cc v1.0.92339pg_jsonschema-0.3.3>    Compiling minimal-lexical v0.2.1340pg_jsonschema-0.3.3>    Compiling cc v1.0.92341pg_jsonschema-0.3.3>    Compiling regex-syntax v0.8.3342cargo-pgrx-0.11.3>    Compiling hashbrown v0.14.3343cargo-pgrx-0.11.3>    Compiling bitflags v2.4.2344pg_jsonschema-0.3.3>    Compiling percent-encoding v2.3.1345pg_jsonschema-0.3.3>    Compiling cc v1.0.92346cargo-pgrx-0.10.2>    Compiling tinyvec_macros v0.1.1347pg_jsonschema-0.3.3>    Compiling cfg-if v1.0.0348pg_jsonschema-0.3.3>    Compiling unicode-bidi v0.3.15349cargo-pgrx-0.11.3>    Compiling syn v1.0.109350pg_jsonschema-0.3.3>    Compiling regex-syntax v0.8.3351pg_jsonschema-0.3.3>    Compiling ucd-trie v0.1.6352pg_jsonschema-0.3.3>    Compiling unicode-bidi v0.3.15353cargo-pgrx-0.10.2>    Compiling spin v0.5.2354cargo-pgrx-0.10.2>    Compiling untrusted v0.7.1355cargo-pgrx-0.10.2>    Compiling crc32fast v1.3.2356pg_jsonschema-0.3.3>    Compiling idna v0.5.0357cargo-pgrx-0.11.3>    Compiling crc32fast v1.3.2358cargo-pgrx-0.11.3>    Compiling rustix v0.38.30359cargo-pgrx-0.10.2>    Compiling equivalent v1.0.1360pg_jsonschema-0.3.3>    Compiling ucd-trie v0.1.6361cargo-pgrx-0.10.2>    Compiling hashbrown v0.14.0362cargo-pgrx-0.11.3>    Compiling equivalent v1.0.1363pg_jsonschema-0.3.3>    Compiling minimal-lexical v0.2.1364cargo-pgrx-0.11.3>    Compiling tinyvec_macros v0.1.1365pg_jsonschema-0.3.3>    Compiling idna v0.5.0366cargo-pgrx-0.11.3>    Compiling tinyvec v1.6.0367pg_jsonschema-0.3.3>    Compiling nom v7.1.3368pg_jsonschema-0.3.3>    Compiling libloading v0.8.3369cargo-pgrx-0.11.3>    Compiling indexmap v2.1.0370cargo-pgrx-0.10.2>    Compiling indexmap v2.0.0371pg_jsonschema-0.3.3>    Compiling nom v7.1.3372pg_jsonschema-0.3.3>    Compiling regex-automata v0.4.6373pg_jsonschema-0.3.3>    Compiling form_urlencoded v1.2.1374cargo-pgrx-0.10.2>    Compiling tinyvec v1.6.0375pg_jsonschema-0.3.3>    Compiling regex-automata v0.4.6376pg_jsonschema-0.3.3>    Compiling regex-automata v0.4.6377pg_jsonschema-0.3.3>    Compiling thiserror-impl v1.0.58378pg_jsonschema-0.3.3>    Compiling thiserror-impl v1.0.58379pg_jsonschema-0.3.3>    Compiling nom v7.1.3380pg_jsonschema-0.3.3>    Compiling serde_derive v1.0.197381pg_jsonschema-0.3.3>    Compiling serde_derive v1.0.197382cargo-pgrx-0.11.3>    Compiling aho-corasick v1.1.2383cargo-pgrx-0.11.3>    Compiling tracing-core v0.1.32384pg_jsonschema-0.3.3>    Compiling thiserror-impl v1.0.58385cargo-pgrx-0.10.2>    Compiling memoffset v0.9.0386pg_jsonschema-0.3.3>    Compiling serde_derive v1.0.197387cargo-pgrx-0.10.2>    Compiling serde_derive v1.0.188388cargo-pgrx-0.10.2>    Compiling aho-corasick v1.1.0389pg_jsonschema-0.3.3>    Compiling idna v0.5.0390cargo-pgrx-0.11.3>    Compiling regex-syntax v0.8.2391pg_jsonschema-0.3.3>    Compiling pest v2.7.9392pg_jsonschema-0.3.3>    Compiling supports-color v2.1.0393pg_jsonschema-0.3.3>    Compiling pest v2.7.9394pg_jsonschema-0.3.3>    Compiling pest v2.7.9395pg_jsonschema-0.3.3>    Compiling form_urlencoded v1.2.1396pg_jsonschema-0.3.3>    Compiling libloading v0.8.3397pg_jsonschema-0.3.3>    Compiling form_urlencoded v1.2.1398pg_jsonschema-0.3.3>    Compiling libloading v0.8.3399pg_jsonschema-0.3.3>    Compiling supports-color v3.0.1400pg_jsonschema-0.3.3>    Compiling supports-color v2.1.0401pg_jsonschema-0.3.3>    Compiling yansi-term v0.1.2402pg_jsonschema-0.3.3>    Compiling supports-color v2.1.0403pg_jsonschema-0.3.3>    Compiling supports-color v3.0.1404pg_jsonschema-0.3.3>    Compiling itoa v1.0.11405pg_jsonschema-0.3.3>    Compiling supports-color v3.0.1406pg_jsonschema-0.3.3>    Compiling unicode-width v0.1.14407cargo-pgrx-0.11.3>    Compiling serde_derive v1.0.195408pg_jsonschema-0.3.3>    Compiling unicode-width v0.1.14409pg_jsonschema-0.3.3>    Compiling either v1.10.0410pg_jsonschema-0.3.3>    Compiling ryu v1.0.17411pg_jsonschema-0.3.3>    Compiling itoa v1.0.11412cargo-pgrx-0.10.2>    Compiling tracing-core v0.1.31413pg_jsonschema-0.3.3>    Compiling itoa v1.0.11414pg_jsonschema-0.3.3>    Compiling bindgen v0.70.1415pg_jsonschema-0.3.3>    Compiling either v1.10.0416pg_jsonschema-0.3.3>    Compiling ryu v1.0.17417pg_jsonschema-0.3.3>    Compiling either v1.10.0418pg_jsonschema-0.3.3>    Compiling ryu v1.0.17419pg_jsonschema-0.3.3>    Compiling unicode-width v0.1.14420pg_jsonschema-0.3.3>    Compiling yansi-term v0.1.2421pg_jsonschema-0.3.3>    Compiling yansi-term v0.1.2422pg_jsonschema-0.3.3>    Compiling bindgen v0.70.1423pg_jsonschema-0.3.3>    Compiling bindgen v0.70.1424pg_jsonschema-0.3.3>    Compiling annotate-snippets v0.9.2425pg_jsonschema-0.3.3>    Compiling annotate-snippets v0.9.2426pg_jsonschema-0.3.3>    Compiling itertools v0.12.1427pg_jsonschema-0.3.3>    Compiling semver-parser v0.10.2428pg_jsonschema-0.3.3>    Compiling semver-parser v0.10.2429pg_jsonschema-0.3.3>    Compiling annotate-snippets v0.9.2430pg_jsonschema-0.3.3>    Compiling itertools v0.12.1431pg_jsonschema-0.3.3>    Compiling semver-parser v0.10.2432pg_jsonschema-0.3.3>    Compiling itertools v0.12.1433cargo-pgrx-0.10.2>    Compiling adler v1.0.2434cargo-pgrx-0.10.2>    Compiling lazy_static v1.4.0435cargo-pgrx-0.10.2>    Compiling regex-syntax v0.6.29436pg_jsonschema-0.3.3>    Compiling pathsearch v0.2.0437pg_jsonschema-0.3.3>    Compiling cexpr v0.6.0438pg_jsonschema-0.3.3>    Compiling regex v1.10.4439pg_jsonschema-0.3.3>    Compiling pathsearch v0.2.0440pg_jsonschema-0.3.3>    Compiling url v2.5.0441pg_jsonschema-0.3.3>    Compiling url v2.5.0442pg_jsonschema-0.3.3>    Compiling pathsearch v0.2.0443pg_jsonschema-0.3.3>    Compiling url v2.5.0444pg_jsonschema-0.3.3>    Compiling num-integer v0.1.46445pg_jsonschema-0.3.3>    Compiling cexpr v0.6.0446pg_jsonschema-0.3.3>    Compiling cexpr v0.6.0447pg_jsonschema-0.3.3>    Compiling num-bigint v0.4.4448pg_jsonschema-0.3.3>    Compiling regex v1.10.4449pg_jsonschema-0.3.3>    Compiling shlex v1.3.0450pg_jsonschema-0.3.3>    Compiling bitflags v2.5.0451pg_jsonschema-0.3.3>    Compiling regex v1.10.4452pg_jsonschema-0.3.3>    Compiling num-integer v0.1.46453pg_jsonschema-0.3.3>    Compiling same-file v1.0.6454pg_jsonschema-0.3.3>    Compiling serde_spanned v0.6.5455cargo-pgrx-0.10.2>    Compiling regex-syntax v0.7.5456pg_jsonschema-0.3.3>    Compiling toml_datetime v0.6.5457pg_jsonschema-0.3.3>    Compiling toml_datetime v0.6.5458pg_jsonschema-0.3.3>    Compiling rustc-hash v1.1.0459pg_jsonschema-0.3.3>    Compiling serde_spanned v0.6.5460pg_jsonschema-0.3.3>    Compiling toml_edit v0.22.9461pg_jsonschema-0.3.3>    Compiling home v0.5.9462pg_jsonschema-0.3.3>    Compiling num-integer v0.1.46463pg_jsonschema-0.3.3>    Compiling toml_edit v0.22.9464pg_jsonschema-0.3.3>    Compiling num-bigint v0.4.4465pg_jsonschema-0.3.3>    Compiling serde_spanned v0.6.5466pg_jsonschema-0.3.3>    Compiling toml_datetime v0.6.5467pg_jsonschema-0.3.3>    Compiling num-bigint v0.4.4468cargo-pgrx-0.11.3>    Compiling crossbeam-utils v0.8.19469pg_jsonschema-0.3.3>    Compiling toml_edit v0.22.9470pg_jsonschema-0.3.3>    Compiling shlex v1.3.0471pg_jsonschema-0.3.3>    Compiling bitflags v2.5.0472cargo-pgrx-0.10.2>    Compiling thiserror-core v1.0.38473pg_jsonschema-0.3.3>    Compiling same-file v1.0.6474pg_jsonschema-0.3.3>    Compiling rustc-hash v1.1.0475pg_jsonschema-0.3.3>    Compiling home v0.5.9476cargo-pgrx-0.10.2>    Compiling linux-raw-sys v0.4.7477pg_jsonschema-0.3.3>    Compiling bitflags v2.5.0478pg_jsonschema-0.3.3>    Compiling home v0.5.9479cargo-pgrx-0.11.3>    Compiling adler v1.0.2480pg_jsonschema-0.3.3>    Compiling rustc-hash v1.1.0481pg_jsonschema-0.3.3>    Compiling toml v0.8.12482pg_jsonschema-0.3.3>    Compiling walkdir v2.5.0483cargo-pgrx-0.11.3>    Compiling linux-raw-sys v0.4.13484pg_jsonschema-0.3.3>    Compiling same-file v1.0.6485pg_jsonschema-0.3.3>    Compiling shlex v1.3.0486cargo-pgrx-0.10.2>    Compiling regex-automata v0.3.8487pg_jsonschema-0.3.3>    Compiling walkdir v2.5.0488cargo-pgrx-0.11.3>    Compiling regex-syntax v0.6.29489pg_jsonschema-0.3.3>    Compiling toml v0.8.12490pg_jsonschema-0.3.3>    Compiling cargo_toml v0.19.2491pg_jsonschema-0.3.3>    Compiling toml v0.8.12492pg_jsonschema-0.3.3>    Compiling cargo_toml v0.19.2493cargo-pgrx-0.11.3>    Compiling miniz_oxide v0.7.1494pg_jsonschema-0.3.3>    Compiling pgrx-pg-config v0.12.6495pg_jsonschema-0.3.3>    Compiling cargo_toml v0.19.2496pg_jsonschema-0.3.3>    Compiling pgrx-pg-config v0.12.6497pg_jsonschema-0.3.3>    Compiling walkdir v2.5.0498pg_jsonschema-0.3.3>    Compiling semver v0.11.0499cargo-pgrx-0.11.3>    Compiling regex-automata v0.1.10500pg_jsonschema-0.3.3>    Compiling semver v0.11.0501pg_jsonschema-0.3.3>    Compiling semver v0.11.0502pg_jsonschema-0.3.3>    Compiling pgrx-pg-config v0.12.6503pg_jsonschema-0.3.3>    Compiling num-rational v0.4.1504pg_jsonschema-0.3.3>    Compiling num-rational v0.4.1505pg_jsonschema-0.3.3>    Compiling num-rational v0.4.1506pg_jsonschema-0.3.3>    Compiling unicode-segmentation v1.11.0507pg_jsonschema-0.3.3>    Compiling unicode-segmentation v1.11.0508pg_jsonschema-0.3.3>    Compiling fixedbitset v0.4.2509pg_jsonschema-0.3.3>    Compiling fixedbitset v0.4.2510pg_jsonschema-0.3.3>    Compiling unicode-segmentation v1.11.0511pg_jsonschema-0.3.3>    Compiling petgraph v0.6.4512pg_jsonschema-0.3.3>    Compiling fixedbitset v0.4.2513cargo-pgrx-0.10.2>    Compiling regex-automata v0.1.10514pg_jsonschema-0.3.3>    Compiling petgraph v0.6.4515pg_jsonschema-0.3.3>    Compiling convert_case v0.6.0516pg_jsonschema-0.3.3>    Compiling convert_case v0.6.0517pg_jsonschema-0.3.3>    Compiling petgraph v0.6.4518pg_jsonschema-0.3.3>    Compiling pgrx-bindgen v0.12.6519pg_jsonschema-0.3.3>    Compiling pgrx-bindgen v0.12.6520cargo-pgrx-0.11.3>    Compiling regex-automata v0.4.4521pg_jsonschema-0.3.3>    Compiling convert_case v0.6.0522pg_jsonschema-0.3.3>    Compiling rustc_version v0.3.3523pg_jsonschema-0.3.3>    Compiling rustc_version v0.3.3524pg_jsonschema-0.3.3>    Compiling pgrx-bindgen v0.12.6525cargo-pgrx-0.10.2>    Compiling miniz_oxide v0.7.1526pg_jsonschema-0.3.3>    Compiling aho-corasick v1.1.3527pg_jsonschema-0.3.3>    Compiling rustc_version v0.3.3528pg_jsonschema-0.3.3>    Compiling aho-corasick v1.1.3529pg_jsonschema-0.3.3>    Compiling aho-corasick v1.1.3530pg_jsonschema-0.3.3>    Compiling cee-scape v0.2.0531pg_jsonschema-0.3.3>    Compiling cee-scape v0.2.0532cargo-pgrx-0.11.3>    Compiling tracing-attributes v0.1.27533cargo-pgrx-0.10.2>    Compiling thiserror-core-impl v1.0.38534pg_jsonschema-0.3.3>    Compiling getrandom v0.2.14535pg_jsonschema-0.3.3>    Compiling cee-scape v0.2.0536pg_jsonschema-0.3.3>    Compiling getrandom v0.2.14537cargo-pgrx-0.11.3>    Compiling unicode-normalization v0.1.22538pg_jsonschema-0.3.3>    Compiling lock_api v0.4.11539pg_jsonschema-0.3.3>    Compiling getrandom v0.2.14540pg_jsonschema-0.3.3>    Compiling unescape v0.1.0541pg_jsonschema-0.3.3>    Compiling lock_api v0.4.11542pg_jsonschema-0.3.3>    Compiling lock_api v0.4.11543pg_jsonschema-0.3.3>    Compiling version_check v0.9.4544pg_jsonschema-0.3.3>    Compiling radium v0.7.0545cargo-pgrx-0.10.2>    Compiling tracing-attributes v0.1.26546pg_jsonschema-0.3.3>    Compiling parking_lot_core v0.9.9547pg_jsonschema-0.3.3>    Compiling radium v0.7.0548pg_jsonschema-0.3.3>    Compiling radium v0.7.0549pg_jsonschema-0.3.3>    Compiling unescape v0.1.0550pg_jsonschema-0.3.3>    Compiling parking_lot_core v0.9.9551pg_jsonschema-0.3.3>    Compiling unescape v0.1.0552cargo-pgrx-0.10.2>    Compiling unicode-normalization v0.1.22553cargo-pgrx-0.11.3>    Compiling getrandom v0.2.12554pg_jsonschema-0.3.3>    Compiling version_check v0.9.4555cargo-pgrx-0.11.3>    Compiling overload v0.1.1556cargo-pgrx-0.11.3>    Compiling spin v0.9.8557cargo-pgrx-0.11.3>    Compiling untrusted v0.9.0558cargo-pgrx-0.11.3>    Compiling utf8parse v0.2.1559pg_jsonschema-0.3.3>    Compiling version_check v0.9.4560cargo-pgrx-0.10.2>    Compiling crossbeam-epoch v0.9.15561cargo-pgrx-0.11.3>    Compiling eyre v0.6.11562pg_jsonschema-0.3.3>    Compiling ahash v0.8.11563cargo-pgrx-0.11.3>    Compiling unicode-bidi v0.3.15564cargo-pgrx-0.10.2>    Compiling atty v0.2.14565cargo-pgrx-0.10.2>    Compiling serde_json v1.0.107566cargo-pgrx-0.11.3>    Compiling serde_json v1.0.111567pg_jsonschema-0.3.3>    Compiling parking_lot_core v0.9.9568pg_jsonschema-0.3.3>    Compiling pgrx-sql-entity-graph v0.12.6569cargo-pgrx-0.10.2>    Compiling overload v0.1.1570cargo-pgrx-0.10.2>    Compiling percent-encoding v2.3.0571cargo-pgrx-0.10.2>    Compiling unicode-bidi v0.3.13572cargo-pgrx-0.10.2>    Compiling static_assertions v1.1.0573cargo-pgrx-0.10.2>    Compiling eyre v0.6.8574cargo-pgrx-0.11.3>    Compiling lazy_static v1.4.0575cargo-pgrx-0.10.2>    Compiling pin-project-lite v0.2.13576cargo-pgrx-0.10.2>    Compiling thiserror v1.0.48577pg_jsonschema-0.3.3>    Compiling ahash v0.8.11578cargo-pgrx-0.10.2>    Compiling utf8parse v0.2.1579cargo-pgrx-0.11.3>    Compiling percent-encoding v2.3.1580cargo-pgrx-0.10.2>    Compiling is_ci v1.1.1581cargo-pgrx-0.10.2>    Compiling supports-color v1.3.1582cargo-pgrx-0.11.3>    Compiling static_assertions v1.1.0583cargo-pgrx-0.11.3>    Compiling pin-project-lite v0.2.13584cargo-pgrx-0.10.2>    Compiling anstyle-parse v0.2.1585cargo-pgrx-0.11.3>    Compiling thiserror v1.0.56586cargo-pgrx-0.10.2>    Compiling tracing v0.1.37587cargo-pgrx-0.11.3>    Compiling tracing v0.1.40588cargo-pgrx-0.10.2>    Compiling idna v0.4.0589cargo-pgrx-0.10.2>    Compiling twox-hash v1.6.3590cargo-pgrx-0.11.3>    Compiling twox-hash v1.6.3591pg_jsonschema-0.3.3>    Compiling ahash v0.8.11592cargo-pgrx-0.10.2>    Compiling form_urlencoded v1.2.0593cargo-pgrx-0.11.3>    Compiling derive_more v0.99.17594cargo-pgrx-0.11.3>    Compiling form_urlencoded v1.2.1595cargo-pgrx-0.10.2>    Compiling nu-ansi-term v0.46.0596pg_jsonschema-0.3.3>    Compiling pgrx-sql-entity-graph v0.12.6597cargo-pgrx-0.11.3>    Compiling sharded-slab v0.1.7598cargo-pgrx-0.10.2>    Compiling flate2 v1.0.27599cargo-pgrx-0.11.3>    Compiling idna v0.5.0600cargo-pgrx-0.10.2>    Compiling matchers v0.1.0601cargo-pgrx-0.10.2>    Compiling regex v1.9.5602cargo-pgrx-0.11.3>    Compiling anstyle-parse v0.2.3603pg_jsonschema-0.3.3>    Compiling pgrx-sql-entity-graph v0.12.6604cargo-pgrx-0.10.2>    Compiling serde_spanned v0.6.3605cargo-pgrx-0.10.2>    Compiling toml_datetime v0.6.3606cargo-pgrx-0.10.2>    Compiling sharded-slab v0.1.4607cargo-pgrx-0.10.2>    Compiling tracing-log v0.1.3608pg_jsonschema-0.3.3>    Compiling pgrx-pg-sys v0.12.6609pg_jsonschema-0.3.3>    Compiling pgrx-pg-sys v0.12.6610cargo-pgrx-0.11.3>    Compiling nu-ansi-term v0.46.0611cargo-pgrx-0.10.2>    Compiling thiserror-impl v1.0.48612cargo-pgrx-0.11.3>    Compiling flate2 v1.0.28613cargo-pgrx-0.10.2>    Compiling thread_local v1.1.7614cargo-pgrx-0.11.3>    Compiling regex v1.10.3615cargo-pgrx-0.10.2>    Compiling anstyle v1.0.3616cargo-pgrx-0.10.2>    Compiling ryu v1.0.15617cargo-pgrx-0.10.2>    Compiling semver v1.0.18618cargo-pgrx-0.11.3>    Compiling matchers v0.1.0619cargo-pgrx-0.10.2>    Compiling byteorder v1.4.3620cargo-pgrx-0.10.2>    Compiling itoa v1.0.9621cargo-pgrx-0.10.2>    Compiling indenter v0.3.3622pg_jsonschema-0.3.3>    Compiling pgrx-pg-sys v0.12.6623cargo-pgrx-0.10.2>    Compiling openssl v0.10.57624cargo-pgrx-0.10.2>    Compiling smallvec v1.11.0625cargo-pgrx-0.10.2>    Compiling foreign-types-shared v0.1.1626pg_jsonschema-0.3.3>    Compiling atomic-traits v0.3.0627cargo-pgrx-0.10.2>    Compiling scopeguard v1.2.0628pg_jsonschema-0.3.3>    Compiling atomic-traits v0.3.0629cargo-pgrx-0.10.2>    Compiling winnow v0.5.15630cargo-pgrx-0.10.2>    Compiling camino v1.1.6631pg_jsonschema-0.3.3>    Compiling num-iter v0.1.44632pg_jsonschema-0.3.3>    Compiling num-complex v0.4.5633pg_jsonschema-0.3.3>    Compiling num-iter v0.1.44634cargo-pgrx-0.10.2>    Compiling anstyle-query v1.0.0635cargo-pgrx-0.10.2>    Compiling anyhow v1.0.75636cargo-pgrx-0.10.2>    Compiling colorchoice v1.0.0637pg_jsonschema-0.3.3>    Compiling num-complex v0.4.5638pg_jsonschema-0.3.3>    Compiling time-core v0.1.2639pg_jsonschema-0.3.3>    Compiling heapless v0.8.0640cargo-pgrx-0.10.2>    Compiling anstream v0.5.0641cargo-pgrx-0.11.3>    Compiling serde_spanned v0.6.5642pg_jsonschema-0.3.3>    Compiling bit-vec v0.6.3643pg_jsonschema-0.3.3>    Compiling num-conv v0.1.0644cargo-pgrx-0.11.3>    Compiling toml_datetime v0.6.5645pg_jsonschema-0.3.3>    Compiling powerfmt v0.2.0646pg_jsonschema-0.3.3>    Compiling heapless v0.8.0647cargo-pgrx-0.10.2>    Compiling foreign-types v0.3.2648cargo-pgrx-0.10.2>    Compiling tracing-subscriber v0.3.17649cargo-pgrx-0.11.3>    Compiling thiserror-impl v1.0.56650cargo-pgrx-0.11.3>    Compiling tracing-log v0.2.0651pg_jsonschema-0.3.3>    Compiling scopeguard v1.2.0652cargo-pgrx-0.11.3>    Compiling thread_local v1.1.7653pg_jsonschema-0.3.3>    Compiling scopeguard v1.2.0654pg_jsonschema-0.3.3>    Compiling atomic-traits v0.3.0655cargo-pgrx-0.10.2>    Compiling toml_edit v0.20.0656cargo-pgrx-0.11.3>    Compiling anstyle-query v1.0.2657cargo-pgrx-0.11.3>    Compiling indenter v0.3.3658cargo-pgrx-0.11.3>    Compiling camino v1.1.6659pg_jsonschema-0.3.3>    Compiling bit-vec v0.6.3660pg_jsonschema-0.3.3>    Compiling powerfmt v0.2.0661cargo-pgrx-0.11.3>    Compiling anyhow v1.0.79662pg_jsonschema-0.3.3>    Compiling smallvec v1.13.2663pg_jsonschema-0.3.3>    Compiling byteorder v1.5.0664pg_jsonschema-0.3.3>    Compiling num-iter v0.1.44665pg_jsonschema-0.3.3>    Compiling smallvec v1.13.2666cargo-pgrx-0.11.3>    Compiling anstyle v1.0.4667cargo-pgrx-0.11.3>    Compiling itoa v1.0.10668pg_jsonschema-0.3.3>    Compiling tap v1.0.1669pg_jsonschema-0.3.3>    Compiling num-complex v0.4.5670pg_jsonschema-0.3.3>    Compiling num-conv v0.1.0671cargo-pgrx-0.11.3>    Compiling ryu v1.0.16672pg_jsonschema-0.3.3>    Compiling hash32 v0.3.1673pg_jsonschema-0.3.3>    Compiling wyz v0.5.1674pg_jsonschema-0.3.3>    Compiling tap v1.0.1675pg_jsonschema-0.3.3>    Compiling time-core v0.1.2676pg_jsonschema-0.3.3>    Compiling deranged v0.3.11677cargo-pgrx-0.11.3>    Compiling semver v1.0.21678pg_jsonschema-0.3.3>    Compiling byteorder v1.5.0679cargo-pgrx-0.11.3>    Compiling colorchoice v1.0.0680pg_jsonschema-0.3.3>    Compiling time-core v0.1.2681cargo-pgrx-0.11.3>    Compiling smallvec v1.13.1682pg_jsonschema-0.3.3>    Compiling hash32 v0.3.1683cargo-pgrx-0.11.3>    Compiling winnow v0.5.34684pg_jsonschema-0.3.3>    Compiling time-macros v0.2.18685pg_jsonschema-0.3.3>    Compiling tap v1.0.1686cargo-pgrx-0.11.3>    Compiling byteorder v1.5.0687pg_jsonschema-0.3.3>    Compiling bit-vec v0.6.3688cargo-pgrx-0.11.3>    Compiling ruzstd v0.5.0689cargo-pgrx-0.11.3>    Compiling tracing-subscriber v0.3.18690pg_jsonschema-0.3.3>    Compiling scopeguard v1.2.0691pg_jsonschema-0.3.3>    Compiling powerfmt v0.2.0692pg_jsonschema-0.3.3>    Compiling smallvec v1.13.2693cargo-pgrx-0.10.2>    Compiling ruzstd v0.4.0694pg_jsonschema-0.3.3>    Compiling byteorder v1.5.0695pg_jsonschema-0.3.3>    Compiling num-conv v0.1.0696pg_jsonschema-0.3.3>    Compiling wyz v0.5.1697pg_jsonschema-0.3.3>    Compiling heapless v0.8.0698pg_jsonschema-0.3.3>    Compiling bit-set v0.5.3699pg_jsonschema-0.3.3>    Compiling time-macros v0.2.18700cargo-pgrx-0.11.3>    Compiling toml_edit v0.21.0701cargo-pgrx-0.10.2>    Compiling url v2.4.1702cargo-pgrx-0.11.3>    Compiling anstream v0.6.11703pg_jsonschema-0.3.3>    Compiling hash32 v0.3.1704cargo-pgrx-0.10.2>    Compiling owo-colors v3.5.0705pg_jsonschema-0.3.3>    Compiling deranged v0.3.11706pg_jsonschema-0.3.3>    Compiling num v0.4.1707pg_jsonschema-0.3.3>    Compiling deranged v0.3.11708cargo-pgrx-0.10.2>    Compiling terminal_size v0.3.0709pg_jsonschema-0.3.3>    Compiling bit-set v0.5.3710cargo-pgrx-0.10.2>    Compiling openssl-macros v0.1.1711pg_jsonschema-0.3.3>    Compiling time-macros v0.2.18712pg_jsonschema-0.3.3>    Compiling bit-set v0.5.3713pg_jsonschema-0.3.3>    Compiling wyz v0.5.1714pg_jsonschema-0.3.3>    Compiling num v0.4.1715pg_jsonschema-0.3.3>    Compiling pgrx-macros v0.12.6716cargo-pgrx-0.10.2>    Compiling backtrace v0.3.69717pg_jsonschema-0.3.3>    Compiling pgrx-macros v0.12.6718cargo-pgrx-0.10.2>    Compiling gimli v0.28.0719cargo-pgrx-0.10.2>    Compiling prettyplease v0.2.15720pg_jsonschema-0.3.3>    Compiling num v0.4.1721pg_jsonschema-0.3.3>    Compiling pgrx-macros v0.12.6722cargo-pgrx-0.10.2>    Compiling strsim v0.10.0723cargo-pgrx-0.11.3>    Compiling crossbeam-epoch v0.9.18724cargo-pgrx-0.11.3>    Compiling url v2.5.0725cargo-pgrx-0.10.2>    Compiling native-tls v0.2.11726cargo-pgrx-0.10.2>    Compiling clap_lex v0.5.1727cargo-pgrx-0.11.3>    Compiling terminal_size v0.3.0728cargo-pgrx-0.10.2>    Compiling heck v0.4.1729cargo-pgrx-0.11.3>    Compiling backtrace v0.3.69730cargo-pgrx-0.11.3>    Compiling gimli v0.28.1731cargo-pgrx-0.10.2>    Compiling rustls v0.21.7732cargo-pgrx-0.10.2>    Compiling rayon-core v1.11.0733cargo-pgrx-0.10.2>    Compiling option-ext v0.2.0734cargo-pgrx-0.11.3>    Compiling clap_lex v0.6.0735cargo-pgrx-0.10.2>    Compiling doc-comment v0.3.3736cargo-pgrx-0.10.2>    Compiling dirs-sys v0.4.1737cargo-pgrx-0.11.3>    Compiling rustls v0.21.10738cargo-pgrx-0.10.2>    Compiling addr2line v0.21.0739cargo-pgrx-0.10.2>    Compiling clap_derive v4.4.2740pg_jsonschema-0.3.3>    Compiling uuid v1.8.0741cargo-pgrx-0.11.3>    Compiling base64 v0.21.7742pg_jsonschema-0.3.3>    Compiling uuid v1.8.0743cargo-pgrx-0.10.2>    Compiling clap_builder v4.4.4744pg_jsonschema-0.3.3>    Compiling enum-map-derive v0.17.0745pg_jsonschema-0.3.3>    Compiling enum-map-derive v0.17.0746pg_jsonschema-0.3.3>    Compiling uuid v1.8.0747cargo-pgrx-0.11.3>    Compiling prettyplease v0.2.16748cargo-pgrx-0.11.3>    Compiling doc-comment v0.3.3749pg_jsonschema-0.3.3>    Compiling enum-map-derive v0.17.0750cargo-pgrx-0.11.3>    Compiling strsim v0.10.0751cargo-pgrx-0.11.3>    Compiling owo-colors v3.5.0752pg_jsonschema-0.3.3>    Compiling sptr v0.3.2753cargo-pgrx-0.11.3>    Compiling heck v0.4.1754pg_jsonschema-0.3.3>    Compiling zerocopy v0.7.32755cargo-pgrx-0.10.2>    Compiling object v0.32.1756cargo-pgrx-0.11.3>    Compiling option-ext v0.2.0757pg_jsonschema-0.3.3>    Compiling lazy_static v1.4.0758cargo-pgrx-0.11.3>    Compiling rayon-core v1.12.1759pg_jsonschema-0.3.3>    Compiling lazy_static v1.4.0760cargo-pgrx-0.11.3>    Compiling dirs-sys v0.4.1761pg_jsonschema-0.3.3>    Compiling funty v2.0.0762cargo-pgrx-0.11.3>    Compiling clap_derive v4.4.7763pg_jsonschema-0.3.3>    Compiling stable_deref_trait v1.2.0764pg_jsonschema-0.3.3>    Compiling lazy_static v1.4.0765pg_jsonschema-0.3.3>    Compiling half v1.8.3766pg_jsonschema-0.3.3>    Compiling half v1.8.3767pg_jsonschema-0.3.3>    Compiling zerocopy v0.7.32768cargo-pgrx-0.10.2>    Compiling toml v0.8.0769pg_jsonschema-0.3.3>    Compiling funty v2.0.0770cargo-pgrx-0.11.3>    Compiling clap_builder v4.4.18771cargo-pgrx-0.11.3>    Compiling rustls-pemfile v1.0.4772pg_jsonschema-0.3.3>    Compiling sptr v0.3.2773pg_jsonschema-0.3.3>    Compiling stable_deref_trait v1.2.0774pg_jsonschema-0.3.3>    Compiling funty v2.0.0775cargo-pgrx-0.11.3>    Compiling addr2line v0.21.0776pg_jsonschema-0.3.3>    Compiling sptr v0.3.2777pg_jsonschema-0.3.3>    Compiling half v1.8.3778cargo-pgrx-0.11.3>    Compiling crossbeam-deque v0.8.5779pg_jsonschema-0.3.3>    Compiling bitvec v1.0.1780pg_jsonschema-0.3.3>    Compiling stable_deref_trait v1.2.0781pg_jsonschema-0.3.3>    Compiling zerocopy v0.7.32782pg_jsonschema-0.3.3>    Compiling bitvec v1.0.1783pg_jsonschema-0.3.3>    Compiling time v0.3.35784cargo-pgrx-0.11.3>    Compiling toml v0.8.8785pg_jsonschema-0.3.3>    Compiling serde_cbor v0.11.2786cargo-pgrx-0.10.2>    Compiling tracing-error v0.2.0787pg_jsonschema-0.3.3>    Compiling bitvec v1.0.1788cargo-pgrx-0.10.2>    Compiling crossbeam-deque v0.8.3789cargo-pgrx-0.11.3>    Compiling tracing-error v0.2.0790pg_jsonschema-0.3.3>    Compiling time v0.3.35791cargo-pgrx-0.11.3>    Compiling object v0.32.2792pg_jsonschema-0.3.3>    Compiling serde_cbor v0.11.2793cargo-pgrx-0.10.2>    Compiling crossbeam-channel v0.5.8794cargo-pgrx-0.10.2>    Compiling cargo-platform v0.1.3795pg_jsonschema-0.3.3>    Compiling serde_cbor v0.11.2796pg_jsonschema-0.3.3>    Compiling fraction v0.13.1797cargo-pgrx-0.10.2>    Compiling rustls-webpki v0.101.5798pg_jsonschema-0.3.3>    Compiling fraction v0.13.1799cargo-pgrx-0.10.2>    Compiling rustls-webpki v0.100.3800cargo-pgrx-0.11.3>    Compiling rustls-webpki v0.101.7801cargo-pgrx-0.11.3>    Compiling sct v0.7.1802cargo-pgrx-0.10.2>    Compiling sct v0.7.0803cargo-pgrx-0.11.3>    Compiling cargo-platform v0.1.6804pg_jsonschema-0.3.3>    Compiling fraction v0.13.1805cargo-pgrx-0.10.2>    Compiling num_cpus v1.16.0806pg_jsonschema-0.3.3>    Compiling time v0.3.35807pg_jsonschema-0.3.3>    Compiling enum-map v2.7.3808pg_jsonschema-0.3.3>    Compiling fancy-regex v0.11.0809cargo-pgrx-0.11.3>    Compiling fixedbitset v0.4.2810cargo-pgrx-0.10.2>    Compiling fixedbitset v0.4.2811pg_jsonschema-0.3.3>    Compiling enum-map v2.7.3812pg_jsonschema-0.3.3>    Compiling enum-map v2.7.3813pg_jsonschema-0.3.3>    Compiling fancy-regex v0.11.0814pg_jsonschema-0.3.3>    Compiling fancy-regex v0.11.0815cargo-pgrx-0.10.2>    Compiling unicode-segmentation v1.10.1816pg_jsonschema-0.3.3>    Compiling iso8601 v0.6.1817cargo-pgrx-0.10.2>    Compiling rustc-demangle v0.1.23818cargo-pgrx-0.11.3>    Compiling unicode-segmentation v1.10.1819cargo-pgrx-0.11.3>    Compiling rustc-demangle v0.1.23820cargo-pgrx-0.10.2>    Compiling openssl-probe v0.1.5821cargo-pgrx-0.11.3>    Compiling openssl-probe v0.1.5822cargo-pgrx-0.10.2>    Compiling convert_case v0.6.0823cargo-pgrx-0.11.3>    Compiling rustls-native-certs v0.6.3824cargo-pgrx-0.10.2>    Compiling petgraph v0.6.4825pg_jsonschema-0.3.3>    Compiling parking_lot v0.12.1826cargo-pgrx-0.11.3>    Compiling convert_case v0.6.0827pg_jsonschema-0.3.3>    Compiling iso8601 v0.6.1828pg_jsonschema-0.3.3>    Compiling iso8601 v0.6.1829pg_jsonschema-0.3.3>    Compiling base64 v0.21.7830pg_jsonschema-0.3.3>    Compiling num-cmp v0.1.0831pg_jsonschema-0.3.3>    Compiling bytecount v0.6.7832pg_jsonschema-0.3.3>    Compiling parking_lot v0.12.1833pg_jsonschema-0.3.3>    Compiling parking_lot v0.12.1834pg_jsonschema-0.3.3>    Compiling seahash v4.1.0835cargo-pgrx-0.11.3>    Compiling petgraph v0.6.4836pg_jsonschema-0.3.3>    Compiling jsonschema v0.17.1837cargo-pgrx-0.11.3>    Compiling cargo_metadata v0.17.0838pg_jsonschema-0.3.3>    Compiling num-cmp v0.1.0839pg_jsonschema-0.3.3>    Compiling base64 v0.21.7840pg_jsonschema-0.3.3>    Compiling seahash v4.1.0841pg_jsonschema-0.3.3>    Compiling bytecount v0.6.7842pg_jsonschema-0.3.3>    Compiling base64 v0.21.7843pg_jsonschema-0.3.3>    Compiling bytecount v0.6.7844pg_jsonschema-0.3.3>    Compiling seahash v4.1.0845pg_jsonschema-0.3.3>    Compiling jsonschema v0.17.1846pg_jsonschema-0.3.3>    Compiling num-cmp v0.1.0847pg_jsonschema-0.3.3>    Compiling jsonschema v0.17.1848cargo-pgrx-0.10.2>    Compiling webpki-roots v0.23.1849cargo-pgrx-0.10.2>    Compiling cargo_metadata v0.17.0850cargo-pgrx-0.10.2>    Compiling pathsearch v0.2.0851cargo-pgrx-0.10.2>    Compiling color-spantrace v0.2.0852cargo-pgrx-0.10.2>    Compiling cargo_toml v0.16.1853cargo-pgrx-0.11.3>    Compiling color-spantrace v0.2.1854cargo-pgrx-0.10.2>    Compiling clap v4.4.4855cargo-pgrx-0.10.2>    Compiling dirs v5.0.1856cargo-pgrx-0.11.3>    Compiling cargo_toml v0.16.3857cargo-pgrx-0.11.3>    Compiling clap v4.4.18858cargo-pgrx-0.11.3>    Compiling pathsearch v0.2.0859cargo-pgrx-0.11.3>    Compiling dirs v5.0.1860pg_jsonschema-0.3.3>    Compiling pgrx v0.12.6861pg_jsonschema-0.3.3>    Compiling pgrx v0.12.6862pg_jsonschema-0.3.3>    Compiling pgrx v0.12.6863cargo-pgrx-0.10.2>    Compiling base64 v0.21.4864cargo-pgrx-0.10.2>    Compiling either v1.9.0865cargo-pgrx-0.10.2>    Compiling xml-rs v0.8.18866cargo-pgrx-0.11.3>    Compiling unescape v0.1.0867cargo-pgrx-0.11.3>    Compiling xml-rs v0.8.19868cargo-pgrx-0.10.2>    Compiling fastrand v2.0.0869cargo-pgrx-0.10.2>    Compiling cargo-pgrx v0.10.2 (/build/cargo-pgrx-0.10.2.tar.gz)870cargo-pgrx-0.10.2>    Compiling unescape v0.1.0871cargo-pgrx-0.10.2>    Compiling pgrx-sql-entity-graph v0.10.2872cargo-pgrx-0.11.3>    Compiling fastrand v2.0.1873cargo-pgrx-0.11.3>    Compiling webpki-roots v0.25.3874cargo-pgrx-0.11.3>    Compiling cargo-pgrx v0.11.3 (/build/cargo-pgrx-0.11.3.tar.gz)875cargo-pgrx-0.11.3>    Compiling either v1.9.0876cargo-pgrx-0.11.3>    Compiling rayon v1.8.1877cargo-pgrx-0.10.2>    Compiling tempfile v3.8.0878cargo-pgrx-0.10.2>    Compiling serde-xml-rs v0.6.0879cargo-pgrx-0.11.3>    Compiling ureq v2.9.1880cargo-pgrx-0.10.2>    Compiling rayon v1.7.0881cargo-pgrx-0.11.3>    Compiling tempfile v3.9.0882cargo-pgrx-0.11.3>    Compiling serde-xml-rs v0.6.0883cargo-pgrx-0.11.3>    Compiling pgrx-sql-entity-graph v0.11.3884cargo-pgrx-0.10.2>    Compiling ureq v2.7.1885pg_jsonschema-0.3.3>    Compiling pg_jsonschema v0.3.3 (/build/source)886pg_jsonschema-0.3.3>    Compiling pg_jsonschema v0.3.3 (/build/source)887pg_jsonschema-0.3.3>     Finished `release` profile [optimized] target(s) in 2m 22s888pg_jsonschema-0.3.3>   Installing extension889pg_jsonschema-0.3.3>      Copying control file to /nix/store/4ka0dipb1nn591s34zq8smqd4gd7575l-pg_jsonschema-0.3.3/nix/store/4isspxcc39w2zbr91kphxhsixbvghgaj-postgresql-17_22/share/postgresql/extension/pg_jsonschema.control890pg_jsonschema-0.3.3>      Copying shared library to /nix/store/4ka0dipb1nn591s34zq8smqd4gd7575l-pg_jsonschema-0.3.3/nix/store/padf4ncg4rn0a9c2l7q9a7864fryh458-postgresql-17_22-lib/lib/pg_jsonschema.so891pg_jsonschema-0.3.3>   Discovered 4 SQL entities: 0 schemas (0 unique), 4 functions, 0 types, 0 enums, 0 sqls, 0 ords, 0 hashes, 0 aggregates, 0 triggers892pg_jsonschema-0.3.3>   Rebuilding pgrx_embed, in debug mode, for SQL generation with features  pg17893pg_jsonschema-0.3.3> warning: `/build/source/.cargo/config` is deprecated in favor of `config.toml`894pg_jsonschema-0.3.3> note: if you need to support cargo 1.38 or earlier, you can symlink `config` to `config.toml`895pg_jsonschema-0.3.3>    Compiling proc-macro2 v1.0.79896pg_jsonschema-0.3.3>    Compiling unicode-ident v1.0.12897pg_jsonschema-0.3.3>    Compiling memchr v2.7.2898pg_jsonschema-0.3.3>    Compiling libc v0.2.153899pg_jsonschema-0.3.3>    Compiling autocfg v1.2.0900pg_jsonschema-0.3.3>    Compiling pg_jsonschema v0.3.3 (/build/source)901pg_jsonschema-0.3.3>    Compiling thiserror v1.0.58902pg_jsonschema-0.3.3>    Compiling quote v1.0.36903pg_jsonschema-0.3.3>    Compiling syn v2.0.58904pg_jsonschema-0.3.3>     Finished `release` profile [optimized] target(s) in 2m 25s905pg_jsonschema-0.3.3>    Compiling serde v1.0.197906pg_jsonschema-0.3.3>   Installing extension907pg_jsonschema-0.3.3>      Copying control file to /nix/store/933bw5lr15i0p5cf4jr8m7icl7b53q4x-pg_jsonschema-0.3.3/nix/store/w828ivs2af99jmnq3vali46cgpban5pa-postgresql-17.11/share/postgresql/extension/pg_jsonschema.control908pg_jsonschema-0.3.3>      Copying shared library to /nix/store/933bw5lr15i0p5cf4jr8m7icl7b53q4x-pg_jsonschema-0.3.3/nix/store/23h47m2xklxbni4g761fwzkq6vpv7sqh-postgresql-17.11-lib/lib/pg_jsonschema.so909pg_jsonschema-0.3.3>   Discovered 4 SQL entities: 0 schemas (0 unique), 4 functions, 0 types, 0 enums, 0 sqls, 0 ords, 0 hashes, 0 aggregates, 0 triggers910pg_jsonschema-0.3.3>   Rebuilding pgrx_embed, in debug mode, for SQL generation with features  pg17911pg_jsonschema-0.3.3> warning: `/build/source/.cargo/config` is deprecated in favor of `config.toml`912pg_jsonschema-0.3.3> note: if you need to support cargo 1.38 or earlier, you can symlink `config` to `config.toml`913pg_jsonschema-0.3.3>    Compiling cfg-if v1.0.0914pg_jsonschema-0.3.3>    Compiling proc-macro2 v1.0.79915pg_jsonschema-0.3.3>    Compiling unicode-ident v1.0.12916pg_jsonschema-0.3.3>    Compiling memchr v2.7.2917pg_jsonschema-0.3.3>    Compiling libc v0.2.153918pg_jsonschema-0.3.3>    Compiling hashbrown v0.14.3919pg_jsonschema-0.3.3>    Compiling autocfg v1.2.0920pg_jsonschema-0.3.3>    Compiling equivalent v1.0.1921pg_jsonschema-0.3.3>    Compiling once_cell v1.19.0922pg_jsonschema-0.3.3>    Compiling tinyvec_macros v0.1.1923pg_jsonschema-0.3.3>    Compiling eyre v0.6.12924pg_jsonschema-0.3.3>     Finished `release` profile [optimized] target(s) in 2m 26s925pg_jsonschema-0.3.3>   Installing extension926pg_jsonschema-0.3.3>      Copying control file to /nix/store/kgx4zz9h2nsr86ra9hj5dmfadr6h80qy-pg_jsonschema-0.3.3/nix/store/bqpxbn1hjfk3fnlwfixyi68w3y7amy9k-postgresql-15.19/share/postgresql/extension/pg_jsonschema.control927pg_jsonschema-0.3.3>    Compiling thiserror v1.0.58928pg_jsonschema-0.3.3>    Compiling tinyvec v1.6.0929pg_jsonschema-0.3.3>      Copying shared library to /nix/store/kgx4zz9h2nsr86ra9hj5dmfadr6h80qy-pg_jsonschema-0.3.3/nix/store/9hl97qalsxjhx8mj6dl9bxwzlfkmlaii-postgresql-15.19-lib/lib/pg_jsonschema.so930pg_jsonschema-0.3.3>   Discovered 4 SQL entities: 0 schemas (0 unique), 4 functions, 0 types, 0 enums, 0 sqls, 0 ords, 0 hashes, 0 aggregates, 0 triggers931pg_jsonschema-0.3.3>   Rebuilding pgrx_embed, in debug mode, for SQL generation with features  pg15932pg_jsonschema-0.3.3> warning: `/build/source/.cargo/config` is deprecated in favor of `config.toml`933pg_jsonschema-0.3.3> note: if you need to support cargo 1.38 or earlier, you can symlink `config` to `config.toml`934pg_jsonschema-0.3.3>    Compiling proc-macro2 v1.0.79935pg_jsonschema-0.3.3>    Compiling unicode-ident v1.0.12936pg_jsonschema-0.3.3>    Compiling libc v0.2.153937pg_jsonschema-0.3.3>    Compiling memchr v2.7.2938pg_jsonschema-0.3.3>    Compiling autocfg v1.2.0939pg_jsonschema-0.3.3>    Compiling serde v1.0.197940pg_jsonschema-0.3.3>    Compiling indexmap v2.2.6941pg_jsonschema-0.3.3>    Compiling cfg-if v1.0.0942pg_jsonschema-0.3.3>    Compiling quote v1.0.36943pg_jsonschema-0.3.3>    Compiling hashbrown v0.14.3944pg_jsonschema-0.3.3>    Compiling num-traits v0.2.18945pg_jsonschema-0.3.3>    Compiling glob v0.3.1946pg_jsonschema-0.3.3>    Compiling thiserror v1.0.58947pg_jsonschema-0.3.3>    Compiling syn v2.0.58948pg_jsonschema-0.3.3>    Compiling minimal-lexical v0.2.1949pg_jsonschema-0.3.3>    Compiling indenter v0.3.3950pg_jsonschema-0.3.3>    Compiling anyhow v1.0.82951pg_jsonschema-0.3.3>    Compiling equivalent v1.0.1952pg_jsonschema-0.3.3>    Compiling quote v1.0.36953pg_jsonschema-0.3.3>    Compiling nom v7.1.3954pg_jsonschema-0.3.3>    Compiling clang-sys v1.7.0955pg_jsonschema-0.3.3>    Compiling indexmap v2.2.6956pg_jsonschema-0.3.3>    Compiling syn v2.0.58957pg_jsonschema-0.3.3>    Compiling once_cell v1.19.0958pg_jsonschema-0.3.3>    Compiling serde v1.0.197959pg_jsonschema-0.3.3>    Compiling cfg-if v1.0.0960pg_jsonschema-0.3.3>    Compiling equivalent v1.0.1961pg_jsonschema-0.3.3>    Compiling tinyvec_macros v0.1.1962pg_jsonschema-0.3.3>    Compiling hashbrown v0.14.3963pg_jsonschema-0.3.3>    Compiling eyre v0.6.12964pg_jsonschema-0.3.3>    Compiling tinyvec v1.6.0965pg_jsonschema-0.3.3>    Compiling once_cell v1.19.0966pg_jsonschema-0.3.3>    Compiling num-traits v0.2.18967pg_jsonschema-0.3.3>    Compiling eyre v0.6.12968pg_jsonschema-0.3.3>    Compiling unicode-normalization v0.1.23969pg_jsonschema-0.3.3>    Compiling anyhow v1.0.82970pg_jsonschema-0.3.3>    Compiling indexmap v2.2.6971pg_jsonschema-0.3.3>    Compiling glob v0.3.1972pg_jsonschema-0.3.3>    Compiling tinyvec_macros v0.1.1973pg_jsonschema-0.3.3>    Compiling percent-encoding v2.3.1974pg_jsonschema-0.3.3>    Compiling tinyvec v1.6.0975pg_jsonschema-0.3.3>    Compiling num-traits v0.2.18976pg_jsonschema-0.3.3>    Compiling winnow v0.6.5977pg_jsonschema-0.3.3>    Compiling indenter v0.3.3978pg_jsonschema-0.3.3>    Compiling minimal-lexical v0.2.1979pg_jsonschema-0.3.3>    Compiling glob v0.3.1980pg_jsonschema-0.3.3>    Compiling serde_json v1.0.115981pg_jsonschema-0.3.3>    Compiling clang-sys v1.7.0982pg_jsonschema-0.3.3>    Compiling anyhow v1.0.82983pg_jsonschema-0.3.3>    Compiling unicode-bidi v0.3.15984pg_jsonschema-0.3.3>    Compiling nom v7.1.3985pg_jsonschema-0.3.3>    Compiling unicode-normalization v0.1.23986pg_jsonschema-0.3.3>    Compiling indenter v0.3.3987pg_jsonschema-0.3.3>    Compiling minimal-lexical v0.2.1988pg_jsonschema-0.3.3>    Compiling clang-sys v1.7.0989pg_jsonschema-0.3.3>    Compiling is_ci v1.2.0990pg_jsonschema-0.3.3>    Compiling nom v7.1.3991pg_jsonschema-0.3.3>    Compiling idna v0.5.0992pg_jsonschema-0.3.3>    Compiling unicode-bidi v0.3.15993pg_jsonschema-0.3.3>    Compiling form_urlencoded v1.2.1994pg_jsonschema-0.3.3>    Compiling is_ci v1.2.0995pg_jsonschema-0.3.3>    Compiling percent-encoding v2.3.1996pg_jsonschema-0.3.3>    Compiling unicode-normalization v0.1.23997pg_jsonschema-0.3.3>    Compiling winnow v0.6.5998pg_jsonschema-0.3.3>    Compiling winnow v0.6.5999pg_jsonschema-0.3.3>    Compiling serde_json v1.0.1151000pg_jsonschema-0.3.3>    Compiling is_ci v1.2.01001pg_jsonschema-0.3.3>    Compiling serde_json v1.0.1151002pg_jsonschema-0.3.3>    Compiling is-terminal v0.4.131003pg_jsonschema-0.3.3>    Compiling thiserror-impl v1.0.581004pg_jsonschema-0.3.3>    Compiling serde_derive v1.0.1971005pg_jsonschema-0.3.3>    Compiling form_urlencoded v1.2.11006pg_jsonschema-0.3.3>    Compiling percent-encoding v2.3.11007pg_jsonschema-0.3.3>    Compiling ryu v1.0.171008pg_jsonschema-0.3.3>    Compiling idna v0.5.01009pg_jsonschema-0.3.3>    Compiling unicode-bidi v0.3.151010pg_jsonschema-0.3.3>    Compiling regex-syntax v0.8.31011pg_jsonschema-0.3.3>    Compiling cc v1.0.921012pg_jsonschema-0.3.3>    Compiling form_urlencoded v1.2.11013pg_jsonschema-0.3.3>    Compiling idna v0.5.01014pg_jsonschema-0.3.3>    Compiling is-terminal v0.4.131015pg_jsonschema-0.3.3>    Compiling ucd-trie v0.1.61016pg_jsonschema-0.3.3>    Compiling owo-colors v4.1.01017pg_jsonschema-0.3.3>    Compiling cc v1.0.921018pg_jsonschema-0.3.3>    Compiling ryu v1.0.171019pg_jsonschema-0.3.3>    Compiling owo-colors v4.1.01020pg_jsonschema-0.3.3>    Compiling itoa v1.0.111021pg_jsonschema-0.3.3>    Compiling is-terminal v0.4.131022pg_jsonschema-0.3.3>    Compiling ryu v1.0.171023pg_jsonschema-0.3.3>    Compiling ucd-trie v0.1.61024cargo-pgrx-0.11.3>    Compiling pgrx-pg-config v0.11.31025pg_jsonschema-0.3.3>    Compiling regex-syntax v0.8.31026pg_jsonschema-0.3.3>    Compiling itoa v1.0.111027pg_jsonschema-0.3.3>    Compiling regex-automata v0.4.61028pg_jsonschema-0.3.3>    Compiling cc v1.0.921029pg_jsonschema-0.3.3>    Compiling pest v2.7.91030pg_jsonschema-0.3.3>    Compiling supports-color v2.1.01031pg_jsonschema-0.3.3>    Compiling url v2.5.01032pg_jsonschema-0.3.3>    Compiling ucd-trie v0.1.61033pg_jsonschema-0.3.3>    Compiling itoa v1.0.111034pg_jsonschema-0.3.3>    Compiling owo-colors v4.1.01035pg_jsonschema-0.3.3>    Compiling regex-syntax v0.8.31036pg_jsonschema-0.3.3>    Compiling thiserror-impl v1.0.581037pg_jsonschema-0.3.3>    Compiling supports-color v2.1.01038pg_jsonschema-0.3.3>    Compiling supports-color v2.1.01039pg_jsonschema-0.3.3>    Compiling serde_derive v1.0.1971040pg_jsonschema-0.3.3>    Compiling url v2.5.01041pg_jsonschema-0.3.3>    Compiling url v2.5.01042pg_jsonschema-0.3.3>    Compiling thiserror-impl v1.0.581043cargo-pgrx-0.11.3>    Compiling clap-cargo v0.11.01044pg_jsonschema-0.3.3>    Compiling regex-automata v0.4.61045pg_jsonschema-0.3.3>    Compiling serde_derive v1.0.1971046pg_jsonschema-0.3.3>    Compiling supports-color v3.0.11047pg_jsonschema-0.3.3>    Compiling libloading v0.8.31048pg_jsonschema-0.3.3>    Compiling unicode-width v0.1.141049pg_jsonschema-0.3.3>    Compiling supports-color v3.0.11050pg_jsonschema-0.3.3>    Compiling libloading v0.8.31051pg_jsonschema-0.3.3>    Compiling bindgen v0.70.11052pg_jsonschema-0.3.3>    Compiling supports-color v3.0.11053pg_jsonschema-0.3.3>    Compiling either v1.10.01054pg_jsonschema-0.3.3>    Compiling libloading v0.8.31055pg_jsonschema-0.3.3>    Compiling yansi-term v0.1.21056cargo-pgrx-0.10.2>    Compiling pgrx-pg-config v0.10.21057pg_jsonschema-0.3.3>    Compiling yansi-term v0.1.21058pg_jsonschema-0.3.3>    Compiling either v1.10.01059pg_jsonschema-0.3.3>    Compiling pest v2.7.91060pg_jsonschema-0.3.3>    Compiling bindgen v0.70.11061pg_jsonschema-0.3.3>    Compiling annotate-snippets v0.9.21062pg_jsonschema-0.3.3>    Compiling regex-automata v0.4.61063pg_jsonschema-0.3.3>    Compiling itertools v0.12.11064pg_jsonschema-0.3.3>    Compiling unicode-width v0.1.141065pg_jsonschema-0.3.3>    Compiling pest v2.7.91066cargo-pgrx-0.10.2>    Compiling clap-cargo v0.11.01067cargo-pgrx-0.10.2>    Compiling color-eyre v0.6.21068pg_jsonschema-0.3.3>    Compiling regex v1.10.41069pg_jsonschema-0.3.3>    Compiling unicode-width v0.1.141070cargo-pgrx-0.11.3>    Compiling color-eyre v0.6.21071pg_jsonschema-0.3.3>    Compiling either v1.10.01072pg_jsonschema-0.3.3>    Compiling annotate-snippets v0.9.21073pg_jsonschema-0.3.3>    Compiling semver-parser v0.10.21074pg_jsonschema-0.3.3>    Compiling bindgen v0.70.11075pg_jsonschema-0.3.3>    Compiling yansi-term v0.1.21076pg_jsonschema-0.3.3>    Compiling regex v1.10.41077pg_jsonschema-0.3.3>    Compiling annotate-snippets v0.9.21078pg_jsonschema-0.3.3>    Compiling itertools v0.12.11079pg_jsonschema-0.3.3>    Compiling regex v1.10.41080pg_jsonschema-0.3.3>    Compiling num-integer v0.1.461081pg_jsonschema-0.3.3>    Compiling itertools v0.12.11082pg_jsonschema-0.3.3>    Compiling pathsearch v0.2.01083pg_jsonschema-0.3.3>    Compiling semver-parser v0.10.21084pg_jsonschema-0.3.3>    Compiling semver-parser v0.10.21085pg_jsonschema-0.3.3>    Compiling serde_spanned v0.6.51086pg_jsonschema-0.3.3>    Compiling toml_datetime v0.6.51087pg_jsonschema-0.3.3>    Compiling cexpr v0.6.01088cargo-pgrx-0.11.3>    Compiling env_proxy v0.4.11089cargo-pgrx-0.10.2>    Compiling env_proxy v0.4.11090cargo-pgrx-0.11.3>    Compiling nix v0.27.11091cargo-pgrx-0.10.2>    Compiling fork v0.1.221092pg_jsonschema-0.3.3>    Compiling toml_edit v0.22.91093cargo-pgrx-0.10.2>    Compiling nix v0.27.11094cargo-pgrx-0.11.3>    Compiling num_cpus v1.16.01095pg_jsonschema-0.3.3>    Compiling num-integer v0.1.461096cargo-pgrx-0.11.3>    Compiling fork v0.1.221097pg_jsonschema-0.3.3>    Compiling num-bigint v0.4.41098pg_jsonschema-0.3.3>    Compiling num-integer v0.1.461099cargo-pgrx-0.10.2>    Compiling libloading v0.8.01100cargo-pgrx-0.11.3>    Compiling libloading v0.8.11101pg_jsonschema-0.3.3>    Compiling pathsearch v0.2.01102pg_jsonschema-0.3.3>    Compiling pathsearch v0.2.01103pg_jsonschema-0.3.3>    Compiling cexpr v0.6.01104pg_jsonschema-0.3.3>    Compiling home v0.5.91105pg_jsonschema-0.3.3>    Compiling cexpr v0.6.01106pg_jsonschema-0.3.3>    Compiling same-file v1.0.61107pg_jsonschema-0.3.3>    Compiling unicode-segmentation v1.11.01108pg_jsonschema-0.3.3>    Compiling fixedbitset v0.4.21109pg_jsonschema-0.3.3>    Compiling num-bigint v0.4.41110pg_jsonschema-0.3.3>    Compiling num-bigint v0.4.41111pg_jsonschema-0.3.3>    Compiling unicode-segmentation v1.11.01112pg_jsonschema-0.3.3>    Compiling rustc-hash v1.1.01113pg_jsonschema-0.3.3>    Compiling home v0.5.91114pg_jsonschema-0.3.3>    Compiling bitflags v2.5.01115pg_jsonschema-0.3.3>    Compiling shlex v1.3.01116pg_jsonschema-0.3.3>    Compiling bitflags v2.5.01117pg_jsonschema-0.3.3>    Compiling fixedbitset v0.4.21118pg_jsonschema-0.3.3>    Compiling rustc-hash v1.1.01119pg_jsonschema-0.3.3>    Compiling rustc-hash v1.1.01120pg_jsonschema-0.3.3>    Compiling toml v0.8.121121pg_jsonschema-0.3.3>    Compiling same-file v1.0.61122pg_jsonschema-0.3.3>    Compiling bitflags v2.5.01123pg_jsonschema-0.3.3>    Compiling unicode-segmentation v1.11.01124pg_jsonschema-0.3.3>    Compiling shlex v1.3.01125pg_jsonschema-0.3.3>    Compiling home v0.5.91126pg_jsonschema-0.3.3>    Compiling shlex v1.3.01127pg_jsonschema-0.3.3>    Compiling fixedbitset v0.4.21128pg_jsonschema-0.3.3>    Compiling same-file v1.0.61129pg_jsonschema-0.3.3>    Compiling petgraph v0.6.41130pg_jsonschema-0.3.3>    Compiling convert_case v0.6.01131pg_jsonschema-0.3.3>    Compiling walkdir v2.5.01132pg_jsonschema-0.3.3>    Compiling cargo_toml v0.19.21133pg_jsonschema-0.3.3>    Compiling serde_spanned v0.6.51134pg_jsonschema-0.3.3>    Compiling convert_case v0.6.01135pg_jsonschema-0.3.3>    Compiling toml_datetime v0.6.51136pg_jsonschema-0.3.3>    Compiling toml_edit v0.22.91137pg_jsonschema-0.3.3>    Compiling petgraph v0.6.41138pg_jsonschema-0.3.3>    Compiling serde_spanned v0.6.51139pg_jsonschema-0.3.3>    Compiling walkdir v2.5.01140pg_jsonschema-0.3.3>    Compiling pgrx-pg-config v0.12.61141pg_jsonschema-0.3.3>    Compiling toml_datetime v0.6.51142pg_jsonschema-0.3.3>    Compiling petgraph v0.6.41143pg_jsonschema-0.3.3>    Compiling toml_edit v0.22.91144pg_jsonschema-0.3.3>    Compiling walkdir v2.5.01145pg_jsonschema-0.3.3>    Compiling semver v0.11.01146pg_jsonschema-0.3.3>    Compiling semver v0.11.01147pg_jsonschema-0.3.3>    Compiling toml v0.8.121148pg_jsonschema-0.3.3>    Compiling convert_case v0.6.01149pg_jsonschema-0.3.3>    Compiling num-rational v0.4.11150pg_jsonschema-0.3.3>    Compiling unescape v0.1.01151pg_jsonschema-0.3.3>    Compiling pgrx-bindgen v0.12.61152pg_jsonschema-0.3.3>    Compiling cargo_toml v0.19.21153pg_jsonschema-0.3.3>    Compiling num-rational v0.4.11154pg_jsonschema-0.3.3>    Compiling semver v0.11.01155pg_jsonschema-0.3.3>    Compiling rustc_version v0.3.31156pg_jsonschema-0.3.3>    Compiling toml v0.8.121157pg_jsonschema-0.3.3>    Compiling unescape v0.1.01158pg_jsonschema-0.3.3>    Compiling num-rational v0.4.11159pg_jsonschema-0.3.3>    Compiling cee-scape v0.2.01160pg_jsonschema-0.3.3>    Compiling unescape v0.1.01161pg_jsonschema-0.3.3>    Compiling cargo_toml v0.19.21162pg_jsonschema-0.3.3>    Compiling rustc_version v0.3.31163pg_jsonschema-0.3.3>    Compiling getrandom v0.2.141164pg_jsonschema-0.3.3>    Compiling lock_api v0.4.111165pg_jsonschema-0.3.3>    Compiling aho-corasick v1.1.31166pg_jsonschema-0.3.3>    Compiling cee-scape v0.2.01167pg_jsonschema-0.3.3>    Compiling radium v0.7.01168pg_jsonschema-0.3.3>    Compiling rustc_version v0.3.31169pg_jsonschema-0.3.3>    Compiling pgrx-pg-config v0.12.61170pg_jsonschema-0.3.3>    Compiling version_check v0.9.41171pg_jsonschema-0.3.3>    Compiling parking_lot_core v0.9.91172pg_jsonschema-0.3.3>    Compiling pgrx-pg-config v0.12.61173pg_jsonschema-0.3.3>    Compiling ahash v0.8.111174pg_jsonschema-0.3.3>    Compiling pgrx-bindgen v0.12.61175pg_jsonschema-0.3.3>    Compiling pgrx-bindgen v0.12.61176pg_jsonschema-0.3.3>    Compiling getrandom v0.2.141177pg_jsonschema-0.3.3>    Compiling lock_api v0.4.111178pg_jsonschema-0.3.3>    Compiling cee-scape v0.2.01179pg_jsonschema-0.3.3>    Compiling pgrx-pg-sys v0.12.61180pg_jsonschema-0.3.3>    Compiling aho-corasick v1.1.31181pg_jsonschema-0.3.3>    Compiling getrandom v0.2.141182pg_jsonschema-0.3.3>    Compiling version_check v0.9.41183pg_jsonschema-0.3.3>    Compiling lock_api v0.4.111184pg_jsonschema-0.3.3>    Compiling aho-corasick v1.1.31185pg_jsonschema-0.3.3>    Compiling radium v0.7.01186pg_jsonschema-0.3.3>    Compiling parking_lot_core v0.9.91187pg_jsonschema-0.3.3>    Compiling parking_lot_core v0.9.91188pg_jsonschema-0.3.3>    Compiling ahash v0.8.111189pg_jsonschema-0.3.3>    Compiling pgrx-pg-sys v0.12.61190pg_jsonschema-0.3.3>    Compiling radium v0.7.01191pg_jsonschema-0.3.3>    Compiling version_check v0.9.41192pg_jsonschema-0.3.3>    Compiling pgrx-pg-sys v0.12.61193pg_jsonschema-0.3.3>    Compiling ahash v0.8.111194pg_jsonschema-0.3.3>    Compiling atomic-traits v0.3.01195pg_jsonschema-0.3.3>    Compiling pgrx-sql-entity-graph v0.12.61196pg_jsonschema-0.3.3>    Compiling num-iter v0.1.441197pg_jsonschema-0.3.3>    Compiling num-complex v0.4.51198pg_jsonschema-0.3.3>    Compiling atomic-traits v0.3.01199pg_jsonschema-0.3.3>    Compiling num-conv v0.1.01200pg_jsonschema-0.3.3>    Compiling scopeguard v1.2.01201pg_jsonschema-0.3.3>    Compiling smallvec v1.13.21202pg_jsonschema-0.3.3>    Compiling byteorder v1.5.01203pg_jsonschema-0.3.3>    Compiling bit-vec v0.6.31204pg_jsonschema-0.3.3>    Compiling atomic-traits v0.3.01205pg_jsonschema-0.3.3>    Compiling powerfmt v0.2.01206pg_jsonschema-0.3.3>    Compiling pgrx-sql-entity-graph v0.12.61207pg_jsonschema-0.3.3>    Compiling heapless v0.8.01208pg_jsonschema-0.3.3>    Compiling pgrx-sql-entity-graph v0.12.61209pg_jsonschema-0.3.3>    Compiling num-iter v0.1.441210pg_jsonschema-0.3.3>    Compiling num-complex v0.4.51211pg_jsonschema-0.3.3>    Compiling time-core v0.1.21212pg_jsonschema-0.3.3>    Compiling num-iter v0.1.441213pg_jsonschema-0.3.3>    Compiling tap v1.0.11214pg_jsonschema-0.3.3>    Compiling wyz v0.5.11215pg_jsonschema-0.3.3>    Compiling num-complex v0.4.51216pg_jsonschema-0.3.3>    Compiling time-macros v0.2.181217pg_jsonschema-0.3.3>    Compiling num-conv v0.1.01218pg_jsonschema-0.3.3>    Compiling powerfmt v0.2.01219pg_jsonschema-0.3.3>    Compiling time-core v0.1.21220pg_jsonschema-0.3.3>    Compiling heapless v0.8.01221pg_jsonschema-0.3.3>    Compiling scopeguard v1.2.01222pg_jsonschema-0.3.3>    Compiling tap v1.0.11223pg_jsonschema-0.3.3>    Compiling smallvec v1.13.21224pg_jsonschema-0.3.3>    Compiling bit-vec v0.6.31225pg_jsonschema-0.3.3>    Compiling bit-vec v0.6.31226pg_jsonschema-0.3.3>    Compiling powerfmt v0.2.01227pg_jsonschema-0.3.3>    Compiling byteorder v1.5.01228pg_jsonschema-0.3.3>    Compiling tap v1.0.11229pg_jsonschema-0.3.3>    Compiling heapless v0.8.01230pg_jsonschema-0.3.3>    Compiling time-core v0.1.21231pg_jsonschema-0.3.3>    Compiling num-conv v0.1.01232pg_jsonschema-0.3.3>    Compiling scopeguard v1.2.01233pg_jsonschema-0.3.3>    Compiling hash32 v0.3.11234pg_jsonschema-0.3.3>    Compiling smallvec v1.13.21235pg_jsonschema-0.3.3>    Compiling bit-set v0.5.31236pg_jsonschema-0.3.3>    Compiling byteorder v1.5.01237pg_jsonschema-0.3.3>    Compiling deranged v0.3.111238pg_jsonschema-0.3.3>    Compiling hash32 v0.3.11239pg_jsonschema-0.3.3>    Compiling wyz v0.5.11240pg_jsonschema-0.3.3>    Compiling time-macros v0.2.181241pg_jsonschema-0.3.3>    Compiling time-macros v0.2.181242pg_jsonschema-0.3.3>    Compiling bit-set v0.5.31243pg_jsonschema-0.3.3>    Compiling hash32 v0.3.11244cargo-pgrx-0.10.2>     Finished release [optimized] target(s) in 3m 07s1245cargo-pgrx-0.10.2> Executing cargoInstallPostBuildHook1246cargo-pgrx-0.10.2> Finished cargoInstallPostBuildHook1247cargo-pgrx-0.10.2> Finished cargoBuildHook1248cargo-pgrx-0.10.2> buildPhase completed in 3 minutes 8 seconds1249cargo-pgrx-0.10.2> Running phase: checkPhase1250cargo-pgrx-0.10.2> Executing cargoCheckHook1251cargo-pgrx-0.10.2> cargoCheckHook flags: -j 4 --profile release --target x86_64-unknown-linux-gnu --offline -- --skip=command::schema::tests::test_parse_managed_postmasters --skip=object_utils::tests::parses_managed_postmasters --skip=command::upgrade::tests::find_package_manifest_in_workspace --skip=command::upgrade::tests::process_workspace_manifest --skip=command::upgrade::tests::process_workspace_package_manifest1252cargo-pgrx-0.10.2>    Compiling cargo-pgrx v0.10.2 (/build/cargo-pgrx-0.10.2.tar.gz)1253pg_jsonschema-0.3.3>    Compiling pgrx-macros v0.12.61254pg_jsonschema-0.3.3>    Compiling num v0.4.11255pg_jsonschema-0.3.3>    Compiling wyz v0.5.11256pg_jsonschema-0.3.3>    Compiling deranged v0.3.111257pg_jsonschema-0.3.3>    Compiling deranged v0.3.111258pg_jsonschema-0.3.3>    Compiling bit-set v0.5.31259pg_jsonschema-0.3.3>    Compiling pgrx-macros v0.12.61260pg_jsonschema-0.3.3>    Compiling uuid v1.8.01261pg_jsonschema-0.3.3>    Compiling num v0.4.11262cargo-pgrx-0.11.3>     Finished release [optimized] target(s) in 3m 07s1263cargo-pgrx-0.11.3> Executing cargoInstallPostBuildHook1264pg_jsonschema-0.3.3>    Compiling enum-map-derive v0.17.01265pg_jsonschema-0.3.3>    Compiling num v0.4.11266cargo-pgrx-0.11.3> Finished cargoInstallPostBuildHook1267cargo-pgrx-0.11.3> Finished cargoBuildHook1268cargo-pgrx-0.11.3> buildPhase completed in 3 minutes 8 seconds1269cargo-pgrx-0.11.3> Running phase: checkPhase1270cargo-pgrx-0.11.3> Executing cargoCheckHook1271cargo-pgrx-0.11.3> cargoCheckHook flags: -j 4 --profile release --target x86_64-unknown-linux-gnu --offline -- --skip=command::schema::tests::test_parse_managed_postmasters --skip=object_utils::tests::parses_managed_postmasters --skip=command::upgrade::tests::find_package_manifest_in_workspace --skip=command::upgrade::tests::process_workspace_manifest --skip=command::upgrade::tests::process_workspace_package_manifest1272pg_jsonschema-0.3.3>    Compiling half v1.8.31273pg_jsonschema-0.3.3>    Compiling pgrx-macros v0.12.61274cargo-pgrx-0.11.3>    Compiling cargo-pgrx v0.11.3 (/build/cargo-pgrx-0.11.3.tar.gz)1275cargo-pgrx-0.10.2>     Finished release [optimized] target(s) in 2.80s1276cargo-pgrx-0.10.2>      Running unittests src/main.rs (target/x86_64-unknown-linux-gnu/release/deps/cargo_pgrx-264f57afe1414a16)1277cargo-pgrx-0.10.2> 1278cargo-pgrx-0.10.2> running 2 tests1279cargo-pgrx-0.10.2> test command::schema::tests::test_slice_unknown_architecture ... ok1280cargo-pgrx-0.10.2> test command::schema::tests::test_parse_universal_binary_slice ... ok1281cargo-pgrx-0.10.2> 1282cargo-pgrx-0.10.2> test result: ok. 2 passed; 0 failed; 0 ignored; 0 measured; 1 filtered out; finished in 0.00s1283cargo-pgrx-0.10.2> 1284cargo-pgrx-0.10.2> Finished cargoCheckHook1285cargo-pgrx-0.10.2> Running phase: installPhase1286cargo-pgrx-0.10.2> Executing cargoInstallHook1287cargo-pgrx-0.10.2> Finished cargoInstallHook1288cargo-pgrx-0.10.2> Running phase: fixupPhase1289cargo-pgrx-0.10.2> shrinking RPATHs of ELF executables and libraries in /nix/store/nyv61xsgl76i7n29m2hc46y4c7hqg32j-cargo-pgrx-0.10.21290cargo-pgrx-0.10.2> shrinking /nix/store/nyv61xsgl76i7n29m2hc46y4c7hqg32j-cargo-pgrx-0.10.2/bin/cargo-pgrx1291cargo-pgrx-0.10.2> checking for references to /build/ in /nix/store/nyv61xsgl76i7n29m2hc46y4c7hqg32j-cargo-pgrx-0.10.2...1292cargo-pgrx-0.10.2> patching script interpreter paths in /nix/store/nyv61xsgl76i7n29m2hc46y4c7hqg32j-cargo-pgrx-0.10.21293cargo-pgrx-0.10.2> stripping (with command strip and flags -S -p) in  /nix/store/nyv61xsgl76i7n29m2hc46y4c7hqg32j-cargo-pgrx-0.10.2/bin1294pg_jsonschema-0.3.3>    Compiling sptr v0.3.21295pg_jsonschema-0.3.3>    Compiling funty v2.0.01296building '/nix/store/daia7nwbk09kg4v3cal091w0cckj3pqr-pg_jsonschema-0.2.0.drv'1297cargo-pgrx-0.11.3>     Finished release [optimized] target(s) in 2.78s1298cargo-pgrx-0.11.3>      Running unittests src/main.rs (target/x86_64-unknown-linux-gnu/release/deps/cargo_pgrx-2b25c13887ec945f)1299cargo-pgrx-0.11.3> 1300cargo-pgrx-0.11.3> running 2 tests1301cargo-pgrx-0.11.3> test command::schema::tests::test_parse_universal_binary_slice ... ok1302cargo-pgrx-0.11.3> test command::schema::tests::test_slice_unknown_architecture ... ok1303cargo-pgrx-0.11.3> 1304cargo-pgrx-0.11.3> test result: ok. 2 passed; 0 failed; 0 ignored; 0 measured; 1 filtered out; finished in 0.00s1305cargo-pgrx-0.11.3> 1306cargo-pgrx-0.11.3> Finished cargoCheckHook1307cargo-pgrx-0.11.3> Running phase: installPhase1308cargo-pgrx-0.11.3> Executing cargoInstallHook1309cargo-pgrx-0.11.3> Finished cargoInstallHook1310cargo-pgrx-0.11.3> Running phase: fixupPhase1311cargo-pgrx-0.11.3> shrinking RPATHs of ELF executables and libraries in /nix/store/zamd1pk6540kqkqiq48kilycabbj0hdr-cargo-pgrx-0.11.31312cargo-pgrx-0.11.3> shrinking /nix/store/zamd1pk6540kqkqiq48kilycabbj0hdr-cargo-pgrx-0.11.3/bin/cargo-pgrx1313cargo-pgrx-0.11.3> checking for references to /build/ in /nix/store/zamd1pk6540kqkqiq48kilycabbj0hdr-cargo-pgrx-0.11.3...1314cargo-pgrx-0.11.3> patching script interpreter paths in /nix/store/zamd1pk6540kqkqiq48kilycabbj0hdr-cargo-pgrx-0.11.31315cargo-pgrx-0.11.3> stripping (with command strip and flags -S -p) in  /nix/store/zamd1pk6540kqkqiq48kilycabbj0hdr-cargo-pgrx-0.11.3/bin1316pg_jsonschema-0.3.3>    Compiling uuid v1.8.01317pg_jsonschema-0.3.3>    Compiling enum-map-derive v0.17.01318pg_jsonschema-0.3.3>    Compiling zerocopy v0.7.321319pg_jsonschema-0.3.3>    Compiling lazy_static v1.4.01320pg_jsonschema-0.3.3>    Compiling sptr v0.3.21321pg_jsonschema-0.3.3>    Compiling funty v2.0.01322pg_jsonschema-0.3.3>    Compiling stable_deref_trait v1.2.01323pg_jsonschema-0.3.3>    Compiling half v1.8.31324pg_jsonschema-0.3.3>    Compiling bitvec v1.0.11325pg_jsonschema-0.3.3>    Compiling serde_cbor v0.11.21326pg_jsonschema-0.3.3>    Compiling enum-map v2.7.31327pg_jsonschema-0.3.3>    Compiling fraction v0.13.11328pg_jsonschema-0.3.3>    Compiling fancy-regex v0.11.01329pg_jsonschema-0.3.3>    Compiling time v0.3.351330pg_jsonschema-0.3.3>    Compiling parking_lot v0.12.11331pg_jsonschema-0.3.3>    Compiling iso8601 v0.6.11332pg_jsonschema-0.3.3>    Compiling bytecount v0.6.71333pg_jsonschema-0.3.3>    Compiling num-cmp v0.1.01334pg_jsonschema-0.3.3>    Compiling base64 v0.21.71335pg_jsonschema-0.3.3>    Compiling seahash v4.1.01336pg_jsonschema-0.3.3>    Compiling jsonschema v0.17.11337pg_jsonschema-0.3.3>    Compiling zerocopy v0.7.321338pg_jsonschema-0.3.3>    Compiling lazy_static v1.4.01339pg_jsonschema-0.3.3>    Compiling stable_deref_trait v1.2.01340pg_jsonschema-0.3.3>    Compiling bitvec v1.0.11341pg_jsonschema-0.3.3>    Compiling fraction v0.13.11342pg_jsonschema-0.3.3>    Compiling enum-map v2.7.31343pg_jsonschema-0.3.3>    Compiling serde_cbor v0.11.21344pg_jsonschema-0.3.3>    Compiling fancy-regex v0.11.01345pg_jsonschema-0.3.3>    Compiling parking_lot v0.12.11346pg_jsonschema-0.3.3>    Compiling time v0.3.351347pg_jsonschema-0.3.3>    Compiling iso8601 v0.6.11348pg_jsonschema-0.3.3>    Compiling seahash v4.1.01349pg_jsonschema-0.3.3>    Compiling bytecount v0.6.71350pg_jsonschema-0.3.3>    Compiling base64 v0.21.71351pg_jsonschema-0.3.3>    Compiling num-cmp v0.1.01352pg_jsonschema-0.3.3>    Compiling jsonschema v0.17.11353pg_jsonschema-0.3.3>    Compiling uuid v1.8.01354pg_jsonschema-0.3.3>    Compiling enum-map-derive v0.17.01355pg_jsonschema-0.3.3>    Compiling funty v2.0.01356pg_jsonschema-0.3.3>    Compiling half v1.8.31357pg_jsonschema-0.3.3>    Compiling stable_deref_trait v1.2.01358pg_jsonschema-0.3.3>    Compiling sptr v0.3.21359pg_jsonschema-0.3.3>    Compiling lazy_static v1.4.01360pg_jsonschema-0.3.3>    Compiling zerocopy v0.7.321361pg_jsonschema-0.3.3>    Compiling fraction v0.13.11362pg_jsonschema-0.3.3>    Compiling serde_cbor v0.11.21363pg_jsonschema-0.3.3>    Compiling enum-map v2.7.31364pg_jsonschema-0.3.3>    Compiling bitvec v1.0.11365pg_jsonschema-0.3.3>    Compiling fancy-regex v0.11.01366pg_jsonschema-0.3.3>    Compiling time v0.3.351367pg_jsonschema-0.3.3>    Compiling parking_lot v0.12.11368pg_jsonschema-0.3.3>    Compiling iso8601 v0.6.11369pg_jsonschema-0.3.3>    Compiling num-cmp v0.1.01370pg_jsonschema-0.3.3>    Compiling seahash v4.1.01371pg_jsonschema-0.3.3>    Compiling bytecount v0.6.71372pg_jsonschema-0.3.3>    Compiling base64 v0.21.71373pg_jsonschema-0.3.3>    Compiling jsonschema v0.17.11374building '/nix/store/arjy95b7c5yplr9lay2vywffm50hzb71-pg_jsonschema-0.3.1.drv'1375pg_jsonschema-0.2.0> Running phase: unpackPhase1376pg_jsonschema-0.2.0> unpacking source archive /nix/store/b5xs8c4ar8yxbxqwm9ih4b0ck04df51z-source1377pg_jsonschema-0.2.0> source root is source1378pg_jsonschema-0.2.0> Executing cargoSetupPostUnpackHook1379pg_jsonschema-0.2.0> Finished cargoSetupPostUnpackHook1380pg_jsonschema-0.2.0> Running phase: patchPhase1381pg_jsonschema-0.2.0> Executing cargoSetupPostPatchHook1382pg_jsonschema-0.2.0> Validating consistency between /build/source/Cargo.lock and /build/cargo-vendor-dir/Cargo.lock1383pg_jsonschema-0.2.0> Finished cargoSetupPostPatchHook1384pg_jsonschema-0.2.0> Running phase: updateAutotoolsGnuConfigScriptsPhase1385pg_jsonschema-0.2.0> Running phase: configurePhase1386pg_jsonschema-0.2.0> Running phase: buildPhase1387pg_jsonschema-0.2.0> Processing git tags...1388pg_jsonschema-0.2.0> Executing cargo-pgrx buildPhase1389pg_jsonschema-0.2.0>    Validating /nix/store/bqpxbn1hjfk3fnlwfixyi68w3y7amy9k-postgresql-15.19/bin/pg_config1390pg_jsonschema-0.2.0>  Initializing data directory at /build/tmp.nzrYckR1R6/data-151391pg_jsonschema-0.2.0> waiting for server to start....2026-10-09 21:48:23.884 GMT [105] LOG:  starting PostgreSQL 15.19 on x86_64-pc-linux-gnu, compiled by gcc (GCC) 15.2.0, 64-bit1392pg_jsonschema-0.2.0> 2026-10-09 21:48:23.884 GMT [105] LOG:  listening on Unix socket "/build/tmp.GwXtSw0cBh/.s.PGSQL.5432"1393pg_jsonschema-0.2.0> 2026-10-09 21:48:23.886 GMT [108] LOG:  database system was shut down at 2026-10-09 21:48:23 GMT1394pg_jsonschema-0.2.0> 2026-10-09 21:48:23.890 GMT [105] LOG:  database system is ready to accept connections1395pg_jsonschema-0.2.0>  done1396pg_jsonschema-0.2.0> server started1397pg_jsonschema-0.2.0> createuser: error: connection to server at "localhost" (127.0.0.1), port 5432 failed: Connection refused1398pg_jsonschema-0.2.0> 	Is the server running on that host and accepting TCP/IP connections?1399pg_jsonschema-0.2.0> waiting for server to shut down....2026-10-09 21:48:23.969 GMT [105] LOG:  received fast shutdown request1400pg_jsonschema-0.2.0> 2026-10-09 21:48:23.972 GMT [105] LOG:  aborting any active transactions1401pg_jsonschema-0.2.0> 2026-10-09 21:48:23.976 GMT [105] LOG:  background worker "logical replication launcher" (PID 111) exited with exit code 11402pg_jsonschema-0.2.0> 2026-10-09 21:48:23.976 GMT [106] LOG:  shutting down1403pg_jsonschema-0.2.0> 2026-10-09 21:48:23.979 GMT [106] LOG:  checkpoint starting: shutdown immediate1404pg_jsonschema-0.2.0> 2026-10-09 21:48:23.981 GMT [106] LOG:  checkpoint complete: wrote 3 buffers (0.0%); 0 WAL file(s) added, 0 removed, 0 recycled; write=0.001 s, sync=0.001 s, total=0.006 s; sync files=2, longest=0.001 s, average=0.001 s; distance=0 kB, estimate=0 kB1405pg_jsonschema-0.2.0> 2026-10-09 21:48:23.986 GMT [105] LOG:  database system is shut down1406pg_jsonschema-0.2.0>  done1407pg_jsonschema-0.2.0> server stopped1408pg_jsonschema-0.2.0>        Using PgConfig("pg15") and `pg_config` from /nix/store/bqpxbn1hjfk3fnlwfixyi68w3y7amy9k-postgresql-15.19/bin/pg_config1409pg_jsonschema-0.2.0>     Building extension with features  pg151410pg_jsonschema-0.2.0>      Running command "/nix/store/xvdnvsc9za90knw98dsf2ci7g8ddfykb-rust-default-1.76.0/bin/cargo" "build" "--release" "--features" " pg15" "--no-default-features" "--message-format=json-render-diagnostics" "--frozen" "-j" "4"1411pg_jsonschema-0.2.0>    Compiling proc-macro2 v1.0.671412pg_jsonschema-0.2.0>    Compiling unicode-ident v1.0.111413pg_jsonschema-0.2.0>    Compiling autocfg v1.1.01414pg_jsonschema-0.2.0>    Compiling libc v0.2.1481415pg_jsonschema-0.2.0>    Compiling serde v1.0.1711416pg_jsonschema-0.2.0>    Compiling hashbrown v0.14.01417pg_jsonschema-0.2.0>    Compiling eyre v0.6.81418pg_jsonschema-0.2.0>    Compiling equivalent v1.0.11419pg_jsonschema-0.2.0>    Compiling thiserror v1.0.431420pg_jsonschema-0.2.0>    Compiling quote v1.0.331421pg_jsonschema-0.2.0>    Compiling indexmap v2.0.01422pg_jsonschema-0.2.0>    Compiling anyhow v1.0.721423pg_jsonschema-0.2.0>    Compiling syn v2.0.261424pg_jsonschema-0.2.0>    Compiling syn v1.0.1091425pg_jsonschema-0.2.0>    Compiling num-traits v0.2.151426pg_jsonschema-0.2.0>    Compiling serde_json v1.0.1031427pg_jsonschema-0.2.0>    Compiling glob v0.3.11428pg_jsonschema-0.2.0>    Compiling tinyvec_macros v0.1.11429pg_jsonschema-0.2.0>    Compiling tinyvec v1.6.01430pg_jsonschema-0.2.0>    Compiling clang-sys v1.6.11431pg_jsonschema-0.2.0>    Compiling num-integer v0.1.451432pg_jsonschema-0.2.0>    Compiling cfg-if v1.0.01433pg_jsonschema-0.2.0>    Compiling winnow v0.5.01434pg_jsonschema-0.2.0>    Compiling once_cell v1.18.01435pg_jsonschema-0.2.0>    Compiling indenter v0.3.31436pg_jsonschema-0.2.0>    Compiling ucd-trie v0.1.61437pg_jsonschema-0.2.0>    Compiling unicode-normalization v0.1.221438pg_jsonschema-0.2.0>    Compiling lock_api v0.4.101439pg_jsonschema-0.2.0>    Compiling memchr v2.6.31440pg_jsonschema-0.2.0>    Compiling unicode-bidi v0.3.131441pg_jsonschema-0.2.0>    Compiling minimal-lexical v0.2.11442pg_jsonschema-0.2.0>    Compiling percent-encoding v2.3.01443pg_jsonschema-0.2.0>    Compiling option-ext v0.2.01444pg_jsonschema-0.2.0>    Compiling regex-syntax v0.7.51445pg_jsonschema-0.2.0>    Compiling semver v1.0.181446pg_jsonschema-0.2.0>    Compiling nom v7.1.31447pg_jsonschema-0.2.0>    Compiling dirs-sys v0.4.11448pg_jsonschema-0.2.0>    Compiling libloading v0.7.41449pg_jsonschema-0.2.0>    Compiling form_urlencoded v1.2.01450pg_jsonschema-0.2.0>    Compiling idna v0.4.01451pg_jsonschema-0.2.0>    Compiling regex-automata v0.3.81452pg_jsonschema-0.2.0>    Compiling serde_derive v1.0.1711453pg_jsonschema-0.2.0>    Compiling thiserror-impl v1.0.431454pg_jsonschema-0.3.1> Running phase: unpackPhase1455pg_jsonschema-0.3.1> unpacking source archive /nix/store/3mpr3m7c70z1akn8nn71ddvh8phwjdzg-source1456pg_jsonschema-0.3.1> source root is source1457pg_jsonschema-0.3.1> Executing cargoSetupPostUnpackHook1458pg_jsonschema-0.2.0>    Compiling pest v2.7.11459pg_jsonschema-0.2.0>    Compiling num-bigint v0.4.31460pg_jsonschema-0.3.1> Finished cargoSetupPostUnpackHook1461pg_jsonschema-0.3.1> Running phase: patchPhase1462pg_jsonschema-0.3.1> Executing cargoSetupPostPatchHook1463pg_jsonschema-0.3.1> Validating consistency between /build/source/Cargo.lock and /build/cargo-vendor-dir/Cargo.lock1464pg_jsonschema-0.3.1> Finished cargoSetupPostPatchHook1465pg_jsonschema-0.3.1> Running phase: updateAutotoolsGnuConfigScriptsPhase1466pg_jsonschema-0.3.1> Running phase: configurePhase1467pg_jsonschema-0.2.0>    Compiling semver-parser v0.10.21468pg_jsonschema-0.3.1> Running phase: buildPhase1469pg_jsonschema-0.3.1> Processing git tags...1470pg_jsonschema-0.3.1> Executing cargo-pgrx buildPhase1471pg_jsonschema-0.3.1>    Validating /nix/store/bqpxbn1hjfk3fnlwfixyi68w3y7amy9k-postgresql-15.19/bin/pg_config1472pg_jsonschema-0.3.1>  Initializing data directory at /build/tmp.4hBacUQFwz/data-151473pg_jsonschema-0.2.0>    Compiling scopeguard v1.2.01474pg_jsonschema-0.2.0>    Compiling bindgen v0.68.11475pg_jsonschema-0.2.0>    Compiling ryu v1.0.151476pg_jsonschema-0.2.0>    Compiling itoa v1.0.91477pg_jsonschema-0.2.0>    Compiling semver v0.11.01478pg_jsonschema-0.3.1> waiting for server to start....2026-10-09 21:48:32.464 GMT [105] LOG:  starting PostgreSQL 15.19 on x86_64-pc-linux-gnu, compiled by gcc (GCC) 15.2.0, 64-bit1479pg_jsonschema-0.3.1> 2026-10-09 21:48:32.464 GMT [105] LOG:  listening on Unix socket "/build/tmp.porjeUSfeX/.s.PGSQL.5432"1480pg_jsonschema-0.3.1> 2026-10-09 21:48:32.467 GMT [108] LOG:  database system was shut down at 2026-10-09 21:48:32 GMT1481pg_jsonschema-0.3.1> 2026-10-09 21:48:32.470 GMT [105] LOG:  database system is ready to accept connections1482pg_jsonschema-0.3.1>  done1483pg_jsonschema-0.3.1> server started1484pg_jsonschema-0.3.1> createuser: error: connection to server at "localhost" (127.0.0.1), port 5432 failed: Connection refused1485pg_jsonschema-0.3.1> 	Is the server running on that host and accepting TCP/IP connections?1486pg_jsonschema-0.3.1> waiting for server to shut down....2026-10-09 21:48:32.551 GMT [105] LOG:  received fast shutdown request1487pg_jsonschema-0.3.1> 2026-10-09 21:48:32.553 GMT [105] LOG:  aborting any active transactions1488pg_jsonschema-0.3.1> 2026-10-09 21:48:32.556 GMT [105] LOG:  background worker "logical replication launcher" (PID 111) exited with exit code 11489pg_jsonschema-0.3.1> 2026-10-09 21:48:32.558 GMT [106] LOG:  shutting down1490pg_jsonschema-0.3.1> 2026-10-09 21:48:32.561 GMT [106] LOG:  checkpoint starting: shutdown immediate1491pg_jsonschema-0.3.1> 2026-10-09 21:48:32.568 GMT [106] LOG:  checkpoint complete: wrote 3 buffers (0.0%); 0 WAL file(s) added, 0 removed, 0 recycled; write=0.006 s, sync=0.001 s, total=0.010 s; sync files=2, longest=0.001 s, average=0.001 s; distance=0 kB, estimate=0 kB1492pg_jsonschema-0.3.1> 2026-10-09 21:48:32.573 GMT [105] LOG:  database system is shut down1493pg_jsonschema-0.3.1>  done1494pg_jsonschema-0.3.1> server stopped1495pg_jsonschema-0.2.0>    Compiling pathsearch v0.2.01496pg_jsonschema-0.3.1>        Using PgConfig("pg15") and `pg_config` from /nix/store/bqpxbn1hjfk3fnlwfixyi68w3y7amy9k-postgresql-15.19/bin/pg_config1497pg_jsonschema-0.2.0>    Compiling regex v1.9.51498pg_jsonschema-0.3.1>     Building extension with features  pg151499pg_jsonschema-0.3.1>      Running command "/nix/store/xvdnvsc9za90knw98dsf2ci7g8ddfykb-rust-default-1.76.0/bin/cargo" "build" "--release" "--features" " pg15" "--no-default-features" "--message-format=json-render-diagnostics" "--frozen" "-j" "4"1500pg_jsonschema-0.3.1>    Compiling proc-macro2 v1.0.791501pg_jsonschema-0.3.1>    Compiling unicode-ident v1.0.121502pg_jsonschema-0.3.1>    Compiling autocfg v1.2.01503pg_jsonschema-0.3.1>    Compiling libc v0.2.1531504pg_jsonschema-0.3.1>    Compiling serde v1.0.1971505pg_jsonschema-0.3.1>    Compiling memchr v2.7.21506pg_jsonschema-0.3.1>    Compiling equivalent v1.0.11507pg_jsonschema-0.3.1>    Compiling hashbrown v0.14.31508pg_jsonschema-0.3.1>    Compiling eyre v0.6.121509pg_jsonschema-0.2.0>    Compiling cexpr v0.6.01510pg_jsonschema-0.3.1>    Compiling thiserror v1.0.581511pg_jsonschema-0.3.1>    Compiling quote v1.0.361512pg_jsonschema-0.3.1>    Compiling indexmap v2.2.61513pg_jsonschema-0.3.1>    Compiling syn v1.0.1091514pg_jsonschema-0.3.1>    Compiling syn v2.0.581515pg_jsonschema-0.3.1>    Compiling anyhow v1.0.821516pg_jsonschema-0.2.0>    Compiling url v2.4.11517pg_jsonschema-0.3.1>    Compiling num-traits v0.2.181518pg_jsonschema-0.3.1>    Compiling serde_json v1.0.1151519pg_jsonschema-0.3.1>    Compiling glob v0.3.11520pg_jsonschema-0.3.1>    Compiling tinyvec_macros v0.1.11521pg_jsonschema-0.3.1>    Compiling tinyvec v1.6.01522pg_jsonschema-0.3.1>    Compiling clang-sys v1.7.01523pg_jsonschema-0.2.0>    Compiling dirs v5.0.11524pg_jsonschema-0.2.0>    Compiling toml_datetime v0.6.31525pg_jsonschema-0.2.0>    Compiling serde_spanned v0.6.31526pg_jsonschema-0.2.0>    Compiling toml_edit v0.20.01527pg_jsonschema-0.2.0>    Compiling num-rational v0.4.11528pg_jsonschema-0.3.1>    Compiling once_cell v1.19.01529pg_jsonschema-0.3.1>    Compiling cfg-if v1.0.01530pg_jsonschema-0.3.1>    Compiling ucd-trie v0.1.61531pg_jsonschema-0.3.1>    Compiling indenter v0.3.31532pg_jsonschema-0.2.0>    Compiling num-iter v0.1.431533pg_jsonschema-0.3.1>    Compiling winnow v0.6.51534pg_jsonschema-0.3.1>    Compiling unicode-normalization v0.1.231535pg_jsonschema-0.2.0>    Compiling unicode-segmentation v1.10.11536pg_jsonschema-0.3.1>    Compiling lock_api v0.4.111537pg_jsonschema-0.3.1>    Compiling minimal-lexical v0.2.11538pg_jsonschema-0.2.0>    Compiling lazycell v1.3.01539pg_jsonschema-0.3.1>    Compiling regex-syntax v0.8.31540pg_jsonschema-0.2.0>    Compiling shlex v1.2.01541pg_jsonschema-0.2.0>    Compiling peeking_take_while v0.1.21542pg_jsonschema-0.2.0>    Compiling rustc-hash v1.1.01543pg_jsonschema-0.2.0>    Compiling bitflags v2.4.01544pg_jsonschema-0.2.0>    Compiling owo-colors v3.5.01545pg_jsonschema-0.2.0>    Compiling toml v0.8.01546pg_jsonschema-0.3.1>    Compiling percent-encoding v2.3.11547pg_jsonschema-0.3.1>    Compiling semver v1.0.221548pg_jsonschema-0.3.1>    Compiling unicode-bidi v0.3.151549pg_jsonschema-0.2.0>    Compiling cargo_toml v0.16.31550pg_jsonschema-0.3.1>    Compiling option-ext v0.2.01551pg_jsonschema-0.3.1>    Compiling dirs-sys v0.4.11552pg_jsonschema-0.2.0>    Compiling lazy_static v1.4.01553pg_jsonschema-0.2.0>    Compiling fixedbitset v0.4.21554pg_jsonschema-0.3.1>    Compiling idna v0.5.01555pg_jsonschema-0.2.0>    Compiling petgraph v0.6.41556pg_jsonschema-0.3.1>    Compiling libloading v0.8.31557pg_jsonschema-0.3.1>    Compiling regex-automata v0.4.61558pg_jsonschema-0.3.1>    Compiling form_urlencoded v1.2.11559pg_jsonschema-0.3.1>    Compiling nom v7.1.31560pg_jsonschema-0.2.0>    Compiling pgrx-pg-config v0.10.21561pg_jsonschema-0.3.1>    Compiling serde_derive v1.0.1971562pg_jsonschema-0.2.0>    Compiling convert_case v0.6.01563pg_jsonschema-0.3.1>    Compiling thiserror-impl v1.0.581564pg_jsonschema-0.2.0>    Compiling rustc_version v0.4.01565pg_jsonschema-0.2.0>    Compiling rustc_version v0.3.31566pg_jsonschema-0.3.1>    Compiling num-integer v0.1.461567pg_jsonschema-0.2.0>    Compiling aho-corasick v1.0.21568pg_jsonschema-0.2.0>    Compiling getrandom v0.2.101569pg_jsonschema-0.3.1>    Compiling num-bigint v0.4.41570pg_jsonschema-0.2.0>    Compiling memoffset v0.9.01571pg_jsonschema-0.3.1>    Compiling scopeguard v1.2.01572pg_jsonschema-0.3.1>    Compiling pest v2.7.91573pg_jsonschema-0.3.1>    Compiling ryu v1.0.171574pg_jsonschema-0.3.1>    Compiling either v1.10.01575pg_jsonschema-0.3.1>    Compiling bindgen v0.69.41576pg_jsonschema-0.2.0>    Compiling unescape v0.1.01577pg_jsonschema-0.3.1>    Compiling itoa v1.0.111578pg_jsonschema-0.2.0>    Compiling radium v0.7.01579pg_jsonschema-0.2.0>    Compiling version_check v0.9.41580pg_jsonschema-0.2.0>    Compiling parking_lot_core v0.9.81581pg_jsonschema-0.3.1>    Compiling semver-parser v0.10.21582pg_jsonschema-0.2.0>    Compiling ahash v0.8.31583pg_jsonschema-0.2.0>    Compiling pgrx-sql-entity-graph v0.10.21584pg_jsonschema-0.3.1>    Compiling semver v0.11.01585pg_jsonschema-0.3.1>    Compiling itertools v0.12.11586pg_jsonschema-0.3.1>    Compiling pathsearch v0.2.01587pg_jsonschema-0.3.1>    Compiling cexpr v0.6.01588pg_jsonschema-0.3.1>    Compiling serde_spanned v0.6.51589pg_jsonschema-0.3.1>    Compiling toml_datetime v0.6.51590pg_jsonschema-0.3.1>    Compiling toml_edit v0.22.91591pg_jsonschema-0.3.1>    Compiling regex v1.10.41592pg_jsonschema-0.3.1>    Compiling url v2.5.01593pg_jsonschema-0.2.0>    Compiling pgrx-pg-sys v0.10.21594pg_jsonschema-0.3.3>    Compiling pgrx v0.12.61595pg_jsonschema-0.3.1>    Compiling dirs v5.0.11596pg_jsonschema-0.3.1>    Compiling num-rational v0.4.11597pg_jsonschema-0.3.1>    Compiling unicode-segmentation v1.11.01598pg_jsonschema-0.3.1>    Compiling bitflags v2.5.01599pg_jsonschema-0.3.1>    Compiling fixedbitset v0.4.21600pg_jsonschema-0.3.1>    Compiling owo-colors v3.5.01601pg_jsonschema-0.3.1>    Compiling toml v0.8.121602pg_jsonschema-0.3.3>    Compiling pgrx v0.12.61603pg_jsonschema-0.3.3>    Compiling pgrx v0.12.61604pg_jsonschema-0.3.1>    Compiling cargo_toml v0.16.31605pg_jsonschema-0.3.1>    Compiling lazy_static v1.4.01606pg_jsonschema-0.3.1>    Compiling rustc-hash v1.1.01607pg_jsonschema-0.3.1>    Compiling shlex v1.3.01608pg_jsonschema-0.3.1>    Compiling same-file v1.0.61609pg_jsonschema-0.3.1>    Compiling lazycell v1.3.01610pg_jsonschema-0.3.1>    Compiling pgrx-pg-config v0.11.31611pg_jsonschema-0.2.0>    Compiling atomic-traits v0.3.01612pg_jsonschema-0.2.0>    Compiling heapless v0.7.161613pg_jsonschema-0.3.1>    Compiling walkdir v2.5.01614pg_jsonschema-0.2.0>    Compiling num-complex v0.4.31615pg_jsonschema-0.2.0>    Compiling tap v1.0.11616pg_jsonschema-0.2.0>    Compiling byteorder v1.4.31617pg_jsonschema-0.2.0>    Compiling bit-vec v0.6.31618pg_jsonschema-0.3.1>    Compiling petgraph v0.6.41619pg_jsonschema-0.2.0>    Compiling time-core v0.1.11620pg_jsonschema-0.3.1>    Compiling convert_case v0.6.01621pg_jsonschema-0.2.0>    Compiling smallvec v1.11.01622pg_jsonschema-0.3.1>    Compiling rustc_version v0.4.01623pg_jsonschema-0.2.0>    Compiling time-macros v0.2.101624pg_jsonschema-0.3.1>    Compiling rustc_version v0.3.31625pg_jsonschema-0.2.0>    Compiling bit-set v0.5.31626pg_jsonschema-0.3.3>    Compiling pg_jsonschema v0.3.3 (/build/source)1627pg_jsonschema-0.3.1>    Compiling aho-corasick v1.1.31628pg_jsonschema-0.3.1>    Compiling getrandom v0.2.141629pg_jsonschema-0.3.3>    Compiling pg_jsonschema v0.3.3 (/build/source)1630pg_jsonschema-0.3.1>    Compiling memoffset v0.9.11631pg_jsonschema-0.3.1>    Compiling unescape v0.1.01632pg_jsonschema-0.3.3>    Compiling pg_jsonschema v0.3.3 (/build/source)1633pg_jsonschema-0.2.0>    Compiling hash32 v0.2.11634pg_jsonschema-0.2.0>    Compiling wyz v0.5.11635pg_jsonschema-0.2.0>    Compiling num v0.4.11636pg_jsonschema-0.3.1>    Compiling version_check v0.9.41637pg_jsonschema-0.2.0>    Compiling pgrx-macros v0.10.21638pg_jsonschema-0.3.1>    Compiling parking_lot_core v0.9.91639pg_jsonschema-0.3.1>    Compiling radium v0.7.01640pg_jsonschema-0.3.1>    Compiling pgrx-pg-sys v0.11.31641pg_jsonschema-0.2.0>    Compiling uuid v1.4.11642pg_jsonschema-0.2.0>    Compiling spin v0.9.81643pg_jsonschema-0.2.0>    Compiling enum-map-derive v0.14.01644pg_jsonschema-0.3.1>    Compiling ahash v0.8.111645pg_jsonschema-0.3.1>    Compiling pgrx-sql-entity-graph v0.11.31646pg_jsonschema-0.2.0>    Compiling stable_deref_trait v1.2.01647pg_jsonschema-0.2.0>    Compiling funty v2.0.01648pg_jsonschema-0.2.0>    Compiling sptr v0.3.21649pg_jsonschema-0.2.0>    Compiling half v1.8.21650pg_jsonschema-0.2.0>    Compiling fraction v0.13.11651pg_jsonschema-0.3.1>    Compiling atomic-traits v0.3.01652pg_jsonschema-0.3.1>    Compiling heapless v0.7.171653pg_jsonschema-0.2.0>    Compiling serde_cbor v0.11.21654pg_jsonschema-0.3.1>    Compiling num-iter v0.1.441655pg_jsonschema-0.3.1>    Compiling num-complex v0.4.51656pg_jsonschema-0.2.0>    Compiling time v0.3.231657pg_jsonschema-0.3.1>    Compiling num-conv v0.1.01658pg_jsonschema-0.3.1>    Compiling byteorder v1.5.01659pg_jsonschema-0.2.0>    Compiling bitvec v1.0.11660pg_jsonschema-0.3.1>    Compiling tap v1.0.11661pg_jsonschema-0.3.1>    Compiling powerfmt v0.2.01662pg_jsonschema-0.3.1>    Compiling time-core v0.1.21663pg_jsonschema-0.3.1>    Compiling bit-vec v0.6.31664pg_jsonschema-0.3.1>    Compiling smallvec v1.13.21665pg_jsonschema-0.3.1>    Compiling bit-set v0.5.31666pg_jsonschema-0.3.1>    Compiling time-macros v0.2.181667pg_jsonschema-0.3.3>     Finished `dev` profile [unoptimized + debuginfo] target(s) in 1m 44s1668pg_jsonschema-0.3.3>      Writing SQL entities to /nix/store/kgx4zz9h2nsr86ra9hj5dmfadr6h80qy-pg_jsonschema-0.3.3/nix/store/bqpxbn1hjfk3fnlwfixyi68w3y7amy9k-postgresql-15.19/share/postgresql/extension/pg_jsonschema--0.3.3.sql1669pg_jsonschema-0.3.3>     Finished installing pg_jsonschema1670pg_jsonschema-0.3.3> buildPhase completed in 4 minutes 13 seconds1671pg_jsonschema-0.3.3> Running phase: installPhase1672pg_jsonschema-0.3.3> Executing buildPgrxExtension install1673pg_jsonschema-0.3.3> Running phase: fixupPhase1674pg_jsonschema-0.3.3> shrinking RPATHs of ELF executables and libraries in /nix/store/kgx4zz9h2nsr86ra9hj5dmfadr6h80qy-pg_jsonschema-0.3.31675pg_jsonschema-0.3.3> shrinking /nix/store/kgx4zz9h2nsr86ra9hj5dmfadr6h80qy-pg_jsonschema-0.3.3/lib/pg_jsonschema-0.3.3.so1676pg_jsonschema-0.3.3> checking for references to /build/ in /nix/store/kgx4zz9h2nsr86ra9hj5dmfadr6h80qy-pg_jsonschema-0.3.3...1677pg_jsonschema-0.3.3> patching script interpreter paths in /nix/store/kgx4zz9h2nsr86ra9hj5dmfadr6h80qy-pg_jsonschema-0.3.31678pg_jsonschema-0.3.3> stripping (with command strip and flags -S -p) in  /nix/store/kgx4zz9h2nsr86ra9hj5dmfadr6h80qy-pg_jsonschema-0.3.3/lib1679pg_jsonschema-0.2.0>    Compiling enum-map v2.6.31680pg_jsonschema-0.2.0>    Compiling fancy-regex v0.11.01681pg_jsonschema-0.2.0>    Compiling iso8601 v0.6.11682pg_jsonschema-0.2.0>    Compiling parking_lot v0.12.11683pg_jsonschema-0.2.0>    Compiling seahash v4.1.01684pg_jsonschema-0.2.0>    Compiling seq-macro v0.3.51685pg_jsonschema-0.2.0>    Compiling bytecount v0.6.31686pg_jsonschema-0.2.0>    Compiling base64 v0.21.21687pg_jsonschema-0.2.0>    Compiling num-cmp v0.1.01688pg_jsonschema-0.2.0>    Compiling jsonschema v0.17.11689pg_jsonschema-0.3.1>    Compiling pgrx-macros v0.11.31690pg_jsonschema-0.3.1>    Compiling deranged v0.3.111691pg_jsonschema-0.3.1>    Compiling wyz v0.5.11692pg_jsonschema-0.3.1>    Compiling hash32 v0.2.11693pg_jsonschema-0.3.1>    Compiling num v0.4.11694pg_jsonschema-0.3.1>    Compiling uuid v1.8.01695pg_jsonschema-0.3.3>     Finished `dev` profile [unoptimized + debuginfo] target(s) in 1m 47s1696pg_jsonschema-0.3.3>      Writing SQL entities to /nix/store/933bw5lr15i0p5cf4jr8m7icl7b53q4x-pg_jsonschema-0.3.3/nix/store/w828ivs2af99jmnq3vali46cgpban5pa-postgresql-17.11/share/postgresql/extension/pg_jsonschema--0.3.3.sql1697pg_jsonschema-0.3.3>     Finished installing pg_jsonschema1698pg_jsonschema-0.3.3> buildPhase completed in 4 minutes 14 seconds1699pg_jsonschema-0.3.3> Running phase: installPhase1700pg_jsonschema-0.3.3> Executing buildPgrxExtension install1701pg_jsonschema-0.3.3> Running phase: fixupPhase1702pg_jsonschema-0.3.3> shrinking RPATHs of ELF executables and libraries in /nix/store/933bw5lr15i0p5cf4jr8m7icl7b53q4x-pg_jsonschema-0.3.31703pg_jsonschema-0.3.3> shrinking /nix/store/933bw5lr15i0p5cf4jr8m7icl7b53q4x-pg_jsonschema-0.3.3/lib/pg_jsonschema-0.3.3.so1704pg_jsonschema-0.3.3> checking for references to /build/ in /nix/store/933bw5lr15i0p5cf4jr8m7icl7b53q4x-pg_jsonschema-0.3.3...1705pg_jsonschema-0.3.3> patching script interpreter paths in /nix/store/933bw5lr15i0p5cf4jr8m7icl7b53q4x-pg_jsonschema-0.3.31706pg_jsonschema-0.3.3> stripping (with command strip and flags -S -p) in  /nix/store/933bw5lr15i0p5cf4jr8m7icl7b53q4x-pg_jsonschema-0.3.3/lib1707pg_jsonschema-0.3.3>     Finished `dev` profile [unoptimized + debuginfo] target(s) in 1m 49s1708pg_jsonschema-0.3.3>      Writing SQL entities to /nix/store/4ka0dipb1nn591s34zq8smqd4gd7575l-pg_jsonschema-0.3.3/nix/store/4isspxcc39w2zbr91kphxhsixbvghgaj-postgresql-17_22/share/postgresql/extension/pg_jsonschema--0.3.3.sql1709pg_jsonschema-0.3.3>     Finished installing pg_jsonschema1710pg_jsonschema-0.3.3> buildPhase completed in 4 minutes 14 seconds1711pg_jsonschema-0.3.3> Running phase: installPhase1712pg_jsonschema-0.3.3> Executing buildPgrxExtension install1713pg_jsonschema-0.3.3> Running phase: fixupPhase1714pg_jsonschema-0.3.3> shrinking RPATHs of ELF executables and libraries in /nix/store/4ka0dipb1nn591s34zq8smqd4gd7575l-pg_jsonschema-0.3.31715pg_jsonschema-0.3.3> shrinking /nix/store/4ka0dipb1nn591s34zq8smqd4gd7575l-pg_jsonschema-0.3.3/lib/pg_jsonschema-0.3.3.so1716pg_jsonschema-0.3.3> checking for references to /build/ in /nix/store/4ka0dipb1nn591s34zq8smqd4gd7575l-pg_jsonschema-0.3.3...1717pg_jsonschema-0.3.3> patching script interpreter paths in /nix/store/4ka0dipb1nn591s34zq8smqd4gd7575l-pg_jsonschema-0.3.31718pg_jsonschema-0.3.3> stripping (with command strip and flags -S -p) in  /nix/store/4ka0dipb1nn591s34zq8smqd4gd7575l-pg_jsonschema-0.3.3/lib1719building '/nix/store/480qgchkkr5y8k6mfj1g5s01gj32bvib-pg_jsonschema.drv'1720building '/nix/store/bpfgnjlrn38i96w4fbcxcwxhwr7vq2xj-pg_jsonschema.drv'1721pg_jsonschema-0.3.1>    Compiling spin v0.9.81722pg_jsonschema-0.3.1>    Compiling enum-map-derive v0.17.01723pg_jsonschema-0.3.1>    Compiling funty v2.0.01724pg_jsonschema-0.3.1>    Compiling sptr v0.3.21725pg_jsonschema-0.3.1>    Compiling stable_deref_trait v1.2.01726pg_jsonschema-0.3.1>    Compiling zerocopy v0.7.321727pg_jsonschema-0.3.1>    Compiling half v1.8.31728pg_jsonschema-0.3.1>    Compiling fraction v0.13.11729pg_jsonschema-0.3.1>    Compiling serde_cbor v0.11.21730pg_jsonschema-0.3.1>    Compiling time v0.3.351731pg_jsonschema-0.3.1>    Compiling bitvec v1.0.11732pg_jsonschema-0.3.1>    Compiling enum-map v2.7.31733pg_jsonschema-0.3.1>    Compiling fancy-regex v0.11.01734pg_jsonschema-0.3.1>    Compiling iso8601 v0.6.11735pg_jsonschema-0.3.1>    Compiling parking_lot v0.12.11736pg_jsonschema-0.3.1>    Compiling num-cmp v0.1.01737pg_jsonschema-0.3.1>    Compiling seq-macro v0.3.51738pg_jsonschema-0.3.1>    Compiling base64 v0.21.71739pg_jsonschema-0.3.1>    Compiling seahash v4.1.01740pg_jsonschema-0.3.1>    Compiling bytecount v0.6.71741pg_jsonschema-0.3.1>    Compiling jsonschema v0.17.11742pg_jsonschema> created 5 symlinks in user environment1743pg_jsonschema> +++++ ls -A /nix/store/b8ai4l3v0jima13f041ba6k9hi56bpk8-pg_jsonschema/lib/pg_jsonschema-0.3.3.so /nix/store/b8ai4l3v0jima13f041ba6k9hi56bpk8-pg_jsonschema/lib/pg_jsonschema.so1744pg_jsonschema> +++++ wc -l1745pg_jsonschema> ++++ test 2 = 2