this derivation will be built: /nix/store/an9mrx5q8qha3v5a5miqxvllf59mdx8l-run-check-harness-psql-17.drv error: build of '/nix/store/an9mrx5q8qha3v5a5miqxvllf59mdx8l-run-check-harness-psql-17.drv' on 'ssh-ng://nixbot-remote-build@78.232.36.247' failed: Cannot build '/nix/store/an9mrx5q8qha3v5a5miqxvllf59mdx8l-run-check-harness-psql-17.drv'. Reason: builder failed with exit code 1. Output paths: /nix/store/v1lldzwn73bx8gs4zsbp6vs8vxsr2w5j-run-check-harness-psql-17 Last 25 log lines: > test roles ... ok 19 ms > test security ... ok 14 ms > test storage ... ok 26 ms > test supautils_reserved_roles ... ok 11 ms > test supautils_restrict_versions ... ok 140 ms > test vault ... ok 47 ms > test wal2json ... ok 44 ms > test z_17_ext_interface ... FAILED 153 ms > test z_17_intarray_ltree_query ... ok 18 ms > test z_17_pg_stat_monitor ... ok 10 ms > test z_17_pgvector ... ok 23 ms > test z_17_roles ... ok 21 ms > test z_17_rum ... ok 27 ms > > ======================= > 2 of 68 tests failed. > ======================= > > The differences that caused some tests to fail can be viewed in the > file "/nix/store/v1lldzwn73bx8gs4zsbp6vs8vxsr2w5j-run-check-harness-psql-17/regression_output/regression.diffs". A copy of the test summary that you see > above is saved in the file "/nix/store/v1lldzwn73bx8gs4zsbp6vs8vxsr2w5j-run-check-harness-psql-17/regression_output/regression.out". > > 2026-10-08 00:38:25 [ERROR] pg_regress tests failed > 2026-10-08 00:38:25 [ERROR] An error occurred. Exit code: 1 > 2026-10-08 00:38:25 [ERROR] Debug logs: For full logs, run: nix log /nix/store/an9mrx5q8qha3v5a5miqxvllf59mdx8l-run-check-harness-psql-17.drv error: Cannot build '/nix/store/an9mrx5q8qha3v5a5miqxvllf59mdx8l-run-check-harness-psql-17.drv'. Reason: builder failed with exit code 1. Output paths: /nix/store/v1lldzwn73bx8gs4zsbp6vs8vxsr2w5j-run-check-harness-psql-17