this derivation will be built: /nix/store/gy06p4mzid1fyf9w9rabjw21pi512amw-run-check-harness-psql-orioledb-17.drv error: Cannot build '/nix/store/gy06p4mzid1fyf9w9rabjw21pi512amw-run-check-harness-psql-orioledb-17.drv'. Reason: builder failed with exit code 1. Output paths: /nix/store/ihwmsy2la6yar4njn54b6c32kay953aa-run-check-harness-psql-orioledb-17 Last 25 log lines: > test wal2json ... ok 24 ms > test z_orioledb-17_docs-cascades-deletes ... ok 96 ms > test z_orioledb-17_docs-full-text-search ... ok 33 ms > test z_orioledb-17_docs-functions ... ok 438 ms > test z_orioledb-17_docs-indexes ... ok 28 ms > test z_orioledb-17_docs-partitioning ... ok 42 ms > test z_orioledb-17_ext_interface ... FAILED 134 ms > test z_orioledb-17_extensions_schema ... ok 10 ms > test z_orioledb-17_intarray_ltree_query ... ok 12 ms > test z_orioledb-17_pg_stat_monitor ... ok 10 ms > test z_orioledb-17_pgroonga ... ok 71 ms > test z_orioledb-17_pgvector ... ok 19 ms > test z_orioledb-17_verify_orioledb ... ok 17 ms > > ======================= > 2 of 65 tests failed. > ======================= > > The differences that caused some tests to fail can be viewed in the > file "/nix/store/ihwmsy2la6yar4njn54b6c32kay953aa-run-check-harness-psql-orioledb-17/regression_output/regression.diffs". A copy of the test summary that you see > above is saved in the file "/nix/store/ihwmsy2la6yar4njn54b6c32kay953aa-run-check-harness-psql-orioledb-17/regression_output/regression.out". > > 2026-10-08 01:08:45 [ERROR] pg_regress tests failed > 2026-10-08 01:08:45 [ERROR] An error occurred. Exit code: 1 > 2026-10-08 01:08:45 [ERROR] Debug logs: For full logs, run: nix log /nix/store/gy06p4mzid1fyf9w9rabjw21pi512amw-run-check-harness-psql-orioledb-17.drv