this derivation will be built: /nix/store/f32kyxfdv38vylqrxa46lsnm8f7yingv-run-check-harness-psql-15-slim.drv error: Cannot build '/nix/store/f32kyxfdv38vylqrxa46lsnm8f7yingv-run-check-harness-psql-15-slim.drv'. Reason: builder failed with exit code 1. Output paths: /nix/store/vi8a4kjhgscr0bg0d8jn7bjp47c36cg0-run-check-harness-psql-15-slim Last 25 log lines: > test supautils_restrict_versions ... ok 109 ms > test vault ... ok 38 ms > test wal2json ... ok 19 ms > test z_15_ext_interface ... FAILED 907 ms > test z_15_intarray_ltree_query ... ok 12 ms > test z_15_pg_stat_monitor ... ok 15 ms > test z_15_pgjwt ... ok 25 ms > test z_15_pgvector ... ok 46 ms > test z_15_plv8 ... ok 66 ms > test z_15_roles ... ok 21 ms > test z_15_rum ... ok 24 ms > test z_15_timescale ... ok 30 ms > test z_15_unhype_timescale_to_partman ... ok 14913 ms > > ======================= > 2 of 72 tests failed. > ======================= > > The differences that caused some tests to fail can be viewed in the > file "/nix/store/vi8a4kjhgscr0bg0d8jn7bjp47c36cg0-run-check-harness-psql-15-slim/regression_output/regression.diffs". A copy of the test summary that you see > above is saved in the file "/nix/store/vi8a4kjhgscr0bg0d8jn7bjp47c36cg0-run-check-harness-psql-15-slim/regression_output/regression.out". > > 2026-10-08 01:08:14 [ERROR] pg_regress tests failed > 2026-10-08 01:08:14 [ERROR] An error occurred. Exit code: 1 > 2026-10-08 01:08:14 [ERROR] Debug logs: For full logs, run: nix log /nix/store/f32kyxfdv38vylqrxa46lsnm8f7yingv-run-check-harness-psql-15-slim.drv