this derivation will be built: /nix/store/bml7nrl87n4z1hcaj897pkcz04bhb34g-run-check-harness-psql-17-slim.drv error: build of '/nix/store/bml7nrl87n4z1hcaj897pkcz04bhb34g-run-check-harness-psql-17-slim.drv' on 'ssh-ng://nixbot-remote-build@78.232.36.247' failed: Cannot build '/nix/store/bml7nrl87n4z1hcaj897pkcz04bhb34g-run-check-harness-psql-17-slim.drv'. Reason: builder failed with exit code 1. Output paths: /nix/store/ccgkcvzzdvg5wbs6srlbhglyb7f07cl5-run-check-harness-psql-17-slim Last 25 log lines: > test roles ... ok 19 ms > test security ... ok 14 ms > test storage ... ok 27 ms > test supautils_reserved_roles ... ok 11 ms > test supautils_restrict_versions ... ok 148 ms > test vault ... ok 47 ms > test wal2json ... ok 42 ms > test z_17_ext_interface ... FAILED 156 ms > test z_17_intarray_ltree_query ... ok 19 ms > test z_17_pg_stat_monitor ... ok 10 ms > test z_17_pgvector ... ok 24 ms > test z_17_roles ... ok 20 ms > test z_17_rum ... ok 27 ms > > ======================= > 2 of 68 tests failed. > ======================= > > The differences that caused some tests to fail can be viewed in the > file "/nix/store/ccgkcvzzdvg5wbs6srlbhglyb7f07cl5-run-check-harness-psql-17-slim/regression_output/regression.diffs". A copy of the test summary that you see > above is saved in the file "/nix/store/ccgkcvzzdvg5wbs6srlbhglyb7f07cl5-run-check-harness-psql-17-slim/regression_output/regression.out". > > 2026-10-08 01:01:00 [ERROR] pg_regress tests failed > 2026-10-08 01:01:00 [ERROR] An error occurred. Exit code: 1 > 2026-10-08 01:01:00 [ERROR] Debug logs: For full logs, run: nix log /nix/store/bml7nrl87n4z1hcaj897pkcz04bhb34g-run-check-harness-psql-17-slim.drv error: Cannot build '/nix/store/bml7nrl87n4z1hcaj897pkcz04bhb34g-run-check-harness-psql-17-slim.drv'. Reason: builder failed with exit code 1. Output paths: /nix/store/ccgkcvzzdvg5wbs6srlbhglyb7f07cl5-run-check-harness-psql-17-slim