this derivation will be built: /nix/store/mv3w88hlifc139a9p2488wkjm4sph7k6-run-check-harness-psql-15.drv error: build of '/nix/store/mv3w88hlifc139a9p2488wkjm4sph7k6-run-check-harness-psql-15.drv' on 'ssh-ng://nixbot-remote-build@78.232.36.247' failed: Cannot build '/nix/store/mv3w88hlifc139a9p2488wkjm4sph7k6-run-check-harness-psql-15.drv'. Reason: builder failed with exit code 1. Output paths: /nix/store/d3qals27z1jpqym6bncj6mjk58svksp0-run-check-harness-psql-15 Last 25 log lines: > test supautils_restrict_versions ... ok 152 ms > test vault ... ok 57 ms > test wal2json ... ok 46 ms > test z_15_ext_interface ... FAILED 1400 ms > test z_15_intarray_ltree_query ... ok 15 ms > test z_15_pg_stat_monitor ... ok 16 ms > test z_15_pgjwt ... ok 31 ms > test z_15_pgvector ... ok 84 ms > test z_15_plv8 ... ok 82 ms > test z_15_roles ... ok 24 ms > test z_15_rum ... ok 40 ms > test z_15_timescale ... ok 49 ms > test z_15_unhype_timescale_to_partman ... ok 18315 ms > > ======================= > 2 of 72 tests failed. > ======================= > > The differences that caused some tests to fail can be viewed in the > file "/nix/store/d3qals27z1jpqym6bncj6mjk58svksp0-run-check-harness-psql-15/regression_output/regression.diffs". A copy of the test summary that you see > above is saved in the file "/nix/store/d3qals27z1jpqym6bncj6mjk58svksp0-run-check-harness-psql-15/regression_output/regression.out". > > 2026-10-08 00:55:25 [ERROR] pg_regress tests failed > 2026-10-08 00:55:25 [ERROR] An error occurred. Exit code: 1 > 2026-10-08 00:55:25 [ERROR] Debug logs: For full logs, run: nix log /nix/store/mv3w88hlifc139a9p2488wkjm4sph7k6-run-check-harness-psql-15.drv error: Cannot build '/nix/store/mv3w88hlifc139a9p2488wkjm4sph7k6-run-check-harness-psql-15.drv'. Reason: builder failed with exit code 1. Output paths: /nix/store/d3qals27z1jpqym6bncj6mjk58svksp0-run-check-harness-psql-15