these 2 derivations will be built: /nix/store/h7sdk0lqsqrxdbl7z8sg1x1yxgjyih07-postgres-15-check-harness.drv /nix/store/3xka7sv17aw9mf76f62d8ig7vrr0kaqq-run-check-harness-psql-15.drv error: Cannot build '/nix/store/3xka7sv17aw9mf76f62d8ig7vrr0kaqq-run-check-harness-psql-15.drv'. Reason: builder failed with exit code 1. Output paths: /nix/store/bm74vfhy2zg4ayfy7y8i6v2z87nzs8wi-run-check-harness-psql-15 Last 25 log lines: > test supautils_restrict_versions ... ok 83 ms > test vault ... ok 28 ms > test wal2json ... ok 15 ms > test z_15_ext_interface ... FAILED 770 ms > test z_15_intarray_ltree_query ... ok 11 ms > test z_15_pg_stat_monitor ... ok 10 ms > test z_15_pgjwt ... ok 18 ms > test z_15_pgvector ... ok 33 ms > test z_15_plv8 ... ok 50 ms > test z_15_roles ... ok 19 ms > test z_15_rum ... ok 19 ms > test z_15_timescale ... ok 22 ms > test z_15_unhype_timescale_to_partman ... ok 13394 ms > > ======================= > 2 of 72 tests failed. > ======================= > > The differences that caused some tests to fail can be viewed in the > file "/nix/store/bm74vfhy2zg4ayfy7y8i6v2z87nzs8wi-run-check-harness-psql-15/regression_output/regression.diffs". A copy of the test summary that you see > above is saved in the file "/nix/store/bm74vfhy2zg4ayfy7y8i6v2z87nzs8wi-run-check-harness-psql-15/regression_output/regression.out". > > 2026-10-08 01:11:04 [ERROR] pg_regress tests failed > 2026-10-08 01:11:04 [ERROR] An error occurred. Exit code: 1 > 2026-10-08 01:11:04 [ERROR] Debug logs: For full logs, run: nix log /nix/store/3xka7sv17aw9mf76f62d8ig7vrr0kaqq-run-check-harness-psql-15.drv