these 2 derivations will be built: /nix/store/m2nxnnsyw7mf2hlyy3hxa8qw1r0lpxxx-postgres-17-check-harness.drv /nix/store/a63pczndwi2jry0h0k1zq6k33hj2w21i-run-check-harness-psql-17.drv error: build of '/nix/store/a63pczndwi2jry0h0k1zq6k33hj2w21i-run-check-harness-psql-17.drv' on 'ssh-ng://nixbot-remote-build@78.232.36.247' failed: Cannot build '/nix/store/a63pczndwi2jry0h0k1zq6k33hj2w21i-run-check-harness-psql-17.drv'. Reason: builder failed with exit code 1. Output paths: /nix/store/1xq0l4wpyys9v7hlv9bdgqwg4m71xc5x-run-check-harness-psql-17 Last 25 log lines: > test roles ... ok 19 ms > test security ... ok 14 ms > test storage ... ok 27 ms > test supautils_reserved_roles ... ok 11 ms > test supautils_restrict_versions ... ok 138 ms > test vault ... ok 46 ms > test wal2json ... ok 42 ms > test z_17_ext_interface ... FAILED 155 ms > test z_17_intarray_ltree_query ... ok 18 ms > test z_17_pg_stat_monitor ... ok 10 ms > test z_17_pgvector ... ok 24 ms > test z_17_roles ... ok 21 ms > test z_17_rum ... ok 27 ms > > ======================= > 2 of 68 tests failed. > ======================= > > The differences that caused some tests to fail can be viewed in the > file "/nix/store/1xq0l4wpyys9v7hlv9bdgqwg4m71xc5x-run-check-harness-psql-17/regression_output/regression.diffs". A copy of the test summary that you see > above is saved in the file "/nix/store/1xq0l4wpyys9v7hlv9bdgqwg4m71xc5x-run-check-harness-psql-17/regression_output/regression.out". > > 2026-10-08 01:05:52 [ERROR] pg_regress tests failed > 2026-10-08 01:05:52 [ERROR] An error occurred. Exit code: 1 > 2026-10-08 01:05:52 [ERROR] Debug logs: For full logs, run: nix log /nix/store/a63pczndwi2jry0h0k1zq6k33hj2w21i-run-check-harness-psql-17.drv error: Cannot build '/nix/store/a63pczndwi2jry0h0k1zq6k33hj2w21i-run-check-harness-psql-17.drv'. Reason: builder failed with exit code 1. Output paths: /nix/store/1xq0l4wpyys9v7hlv9bdgqwg4m71xc5x-run-check-harness-psql-17