these 2 derivations will be built: /nix/store/9gdjwiznv1fsbvk1lr5xrdabf44irx5v-postgres-15-check-harness.drv /nix/store/g3fyl5a0fbas35cki50ljgi6zh1f23ml-run-check-harness-psql-15.drv error: build of '/nix/store/g3fyl5a0fbas35cki50ljgi6zh1f23ml-run-check-harness-psql-15.drv' on 'ssh-ng://nixbot-remote-build@78.232.36.247' failed: Cannot build '/nix/store/g3fyl5a0fbas35cki50ljgi6zh1f23ml-run-check-harness-psql-15.drv'. Reason: builder failed with exit code 1. Output paths: /nix/store/2nq3ad7hsx3i9zda7cismjf21x77msp1-run-check-harness-psql-15 Last 25 log lines: > test supautils_restrict_versions ... ok 149 ms > test vault ... ok 54 ms > test wal2json ... ok 43 ms > test z_15_ext_interface ... FAILED 1327 ms > test z_15_intarray_ltree_query ... ok 15 ms > test z_15_pg_stat_monitor ... ok 15 ms > test z_15_pgjwt ... ok 29 ms > test z_15_pgvector ... ok 73 ms > test z_15_plv8 ... ok 77 ms > test z_15_roles ... ok 23 ms > test z_15_rum ... ok 39 ms > test z_15_timescale ... ok 47 ms > test z_15_unhype_timescale_to_partman ... ok 18884 ms > > ======================= > 2 of 72 tests failed. > ======================= > > The differences that caused some tests to fail can be viewed in the > file "/nix/store/2nq3ad7hsx3i9zda7cismjf21x77msp1-run-check-harness-psql-15/regression_output/regression.diffs". A copy of the test summary that you see > above is saved in the file "/nix/store/2nq3ad7hsx3i9zda7cismjf21x77msp1-run-check-harness-psql-15/regression_output/regression.out". > > 2026-10-08 01:00:18 [ERROR] pg_regress tests failed > 2026-10-08 01:00:18 [ERROR] An error occurred. Exit code: 1 > 2026-10-08 01:00:18 [ERROR] Debug logs: For full logs, run: nix log /nix/store/g3fyl5a0fbas35cki50ljgi6zh1f23ml-run-check-harness-psql-15.drv error: Cannot build '/nix/store/g3fyl5a0fbas35cki50ljgi6zh1f23ml-run-check-harness-psql-15.drv'. Reason: builder failed with exit code 1. Output paths: /nix/store/2nq3ad7hsx3i9zda7cismjf21x77msp1-run-check-harness-psql-15