these 3 derivations will be built: /nix/store/hiycs2k66919c01m2bjsa6ma96awhhf7-start-postgres-server-test.drv /nix/store/sl2m6fgpnslhm5dwkag226k1w50cc42c-postgres-orioledb-17-check-harness.drv /nix/store/gy06p4mzid1fyf9w9rabjw21pi512amw-run-check-harness-psql-orioledb-17.drv error: Cannot build '/nix/store/gy06p4mzid1fyf9w9rabjw21pi512amw-run-check-harness-psql-orioledb-17.drv'. Reason: builder failed with exit code 1. Output paths: /nix/store/ihwmsy2la6yar4njn54b6c32kay953aa-run-check-harness-psql-orioledb-17 Last 25 log lines: > test wal2json ... ok 17 ms > test z_orioledb-17_docs-cascades-deletes ... ok 86 ms > test z_orioledb-17_docs-full-text-search ... ok 29 ms > test z_orioledb-17_docs-functions ... ok 352 ms > test z_orioledb-17_docs-indexes ... ok 30 ms > test z_orioledb-17_docs-partitioning ... ok 40 ms > test z_orioledb-17_ext_interface ... FAILED 112 ms > test z_orioledb-17_extensions_schema ... ok 9 ms > test z_orioledb-17_intarray_ltree_query ... ok 8 ms > test z_orioledb-17_pg_stat_monitor ... ok 9 ms > test z_orioledb-17_pgroonga ... ok 54 ms > test z_orioledb-17_pgvector ... ok 19 ms > test z_orioledb-17_verify_orioledb ... ok 18 ms > > ======================= > 2 of 65 tests failed. > ======================= > > The differences that caused some tests to fail can be viewed in the > file "/nix/store/ihwmsy2la6yar4njn54b6c32kay953aa-run-check-harness-psql-orioledb-17/regression_output/regression.diffs". A copy of the test summary that you see > above is saved in the file "/nix/store/ihwmsy2la6yar4njn54b6c32kay953aa-run-check-harness-psql-orioledb-17/regression_output/regression.out". > > 2026-10-08 00:11:04 [ERROR] pg_regress tests failed > 2026-10-08 00:11:04 [ERROR] An error occurred. Exit code: 1 > 2026-10-08 00:11:04 [ERROR] Debug logs: For full logs, run: nix log /nix/store/gy06p4mzid1fyf9w9rabjw21pi512amw-run-check-harness-psql-orioledb-17.drv