this derivation will be built: /nix/store/cx46wifa99zbgnczfd8z01ii1sj3bs02-run-check-harness-psql-orioledb-17.drv this path will be fetched (4.5 KiB download, 16.3 KiB unpacked): /nix/store/wkhqgkk6m1h7nvnfhsd7wga3rx39s69c-postgres-orioledb-17-check-harness error: Cannot build '/nix/store/cx46wifa99zbgnczfd8z01ii1sj3bs02-run-check-harness-psql-orioledb-17.drv'. Reason: builder failed with exit code 1. Output paths: /nix/store/0xs5am6v818na2323g5ar3ylhwfsf901-run-check-harness-psql-orioledb-17 Last 25 log lines: > test wal2json ... ok 18 ms > test z_orioledb-17_docs-cascades-deletes ... ok 84 ms > test z_orioledb-17_docs-full-text-search ... ok 33 ms > test z_orioledb-17_docs-functions ... ok 261 ms > test z_orioledb-17_docs-indexes ... ok 28 ms > test z_orioledb-17_docs-partitioning ... ok 39 ms > test z_orioledb-17_ext_interface ... FAILED 110 ms > test z_orioledb-17_extensions_schema ... ok 9 ms > test z_orioledb-17_intarray_ltree_query ... ok 9 ms > test z_orioledb-17_pg_stat_monitor ... ok 8 ms > test z_orioledb-17_pgroonga ... ok 58 ms > test z_orioledb-17_pgvector ... ok 18 ms > test z_orioledb-17_verify_orioledb ... ok 16 ms > > ======================= > 2 of 65 tests failed. > ======================= > > The differences that caused some tests to fail can be viewed in the > file "/nix/store/0xs5am6v818na2323g5ar3ylhwfsf901-run-check-harness-psql-orioledb-17/regression_output/regression.diffs". A copy of the test summary that you see > above is saved in the file "/nix/store/0xs5am6v818na2323g5ar3ylhwfsf901-run-check-harness-psql-orioledb-17/regression_output/regression.out". > > 2026-10-07 23:27:05 [ERROR] pg_regress tests failed > 2026-10-07 23:27:05 [ERROR] An error occurred. Exit code: 1 > 2026-10-07 23:27:05 [ERROR] Debug logs: For full logs, run: nix log /nix/store/cx46wifa99zbgnczfd8z01ii1sj3bs02-run-check-harness-psql-orioledb-17.drv