this derivation will be built: /nix/store/nzbybv546dfyrvnia77kb0hg8f5122ym-run-check-harness-psql-17-slim.drv this path will be fetched (4.5 KiB download, 16.1 KiB unpacked): /nix/store/kigrbs2lm7i5j6lw6z5yyghx41kdr1l2-postgres-17-check-harness error: Cannot build '/nix/store/nzbybv546dfyrvnia77kb0hg8f5122ym-run-check-harness-psql-17-slim.drv'. Reason: builder failed with exit code 1. Output paths: /nix/store/kk0ggr6lhg4dlkc75d5hjylzc50lfz4x-run-check-harness-psql-17-slim Last 25 log lines: > test roles ... ok 11 ms > test security ... ok 11 ms > test storage ... ok 16 ms > test supautils_reserved_roles ... ok 8 ms > test supautils_restrict_versions ... ok 87 ms > test vault ... ok 29 ms > test wal2json ... ok 17 ms > test z_17_ext_interface ... FAILED 120 ms > test z_17_intarray_ltree_query ... ok 13 ms > test z_17_pg_stat_monitor ... ok 8 ms > test z_17_pgvector ... ok 17 ms > test z_17_roles ... ok 16 ms > test z_17_rum ... ok 16 ms > > ======================= > 2 of 68 tests failed. > ======================= > > The differences that caused some tests to fail can be viewed in the > file "/nix/store/kk0ggr6lhg4dlkc75d5hjylzc50lfz4x-run-check-harness-psql-17-slim/regression_output/regression.diffs". A copy of the test summary that you see > above is saved in the file "/nix/store/kk0ggr6lhg4dlkc75d5hjylzc50lfz4x-run-check-harness-psql-17-slim/regression_output/regression.out". > > 2026-10-07 23:26:30 [ERROR] pg_regress tests failed > 2026-10-07 23:26:30 [ERROR] An error occurred. Exit code: 1 > 2026-10-07 23:26:30 [ERROR] Debug logs: For full logs, run: nix log /nix/store/nzbybv546dfyrvnia77kb0hg8f5122ym-run-check-harness-psql-17-slim.drv