these 2 derivations will be built: /nix/store/di72mgqg5wm82464spi4sxx71iyl660h-postgres-17-check-harness.drv /nix/store/z8r22n6j70mghwlgm6b0fki25i1aldrd-run-check-harness-psql-17-slim.drv error: build of '/nix/store/z8r22n6j70mghwlgm6b0fki25i1aldrd-run-check-harness-psql-17-slim.drv' on 'ssh-ng://nixbot-remote-build@78.232.36.247' failed: Cannot build '/nix/store/z8r22n6j70mghwlgm6b0fki25i1aldrd-run-check-harness-psql-17-slim.drv'. Reason: builder failed with exit code 1. Output paths: /nix/store/q3wlp5xgmlbbkpc0812rrr8xs4yxgwnr-run-check-harness-psql-17-slim Last 25 log lines: > test roles ... ok 18 ms > test security ... ok 14 ms > test storage ... ok 26 ms > test supautils_reserved_roles ... ok 11 ms > test supautils_restrict_versions ... ok 225 ms > test vault ... ok 47 ms > test wal2json ... ok 68 ms > test z_17_ext_interface ... FAILED 155 ms > test z_17_intarray_ltree_query ... ok 19 ms > test z_17_pg_stat_monitor ... ok 10 ms > test z_17_pgvector ... ok 25 ms > test z_17_roles ... ok 21 ms > test z_17_rum ... ok 27 ms > > ======================= > 2 of 68 tests failed. > ======================= > > The differences that caused some tests to fail can be viewed in the > file "/nix/store/q3wlp5xgmlbbkpc0812rrr8xs4yxgwnr-run-check-harness-psql-17-slim/regression_output/regression.diffs". A copy of the test summary that you see > above is saved in the file "/nix/store/q3wlp5xgmlbbkpc0812rrr8xs4yxgwnr-run-check-harness-psql-17-slim/regression_output/regression.out". > > 2026-10-07 23:25:23 [ERROR] pg_regress tests failed > 2026-10-07 23:25:23 [ERROR] An error occurred. Exit code: 1 > 2026-10-07 23:25:23 [ERROR] Debug logs: For full logs, run: nix log /nix/store/z8r22n6j70mghwlgm6b0fki25i1aldrd-run-check-harness-psql-17-slim.drv error: Cannot build '/nix/store/z8r22n6j70mghwlgm6b0fki25i1aldrd-run-check-harness-psql-17-slim.drv'. Reason: builder failed with exit code 1. Output paths: /nix/store/q3wlp5xgmlbbkpc0812rrr8xs4yxgwnr-run-check-harness-psql-17-slim