these 2 derivations will be built: /nix/store/fxxhk1j31k8c46lzaj1p3hs9n6nzgrba-postgres-15-check-harness.drv /nix/store/x553hd40hg8gh6vgvqz1baf246l5wgi4-run-check-harness-psql-15.drv error: build of '/nix/store/x553hd40hg8gh6vgvqz1baf246l5wgi4-run-check-harness-psql-15.drv' on 'ssh-ng://nixbot-remote-build@78.232.36.247' failed: Cannot build '/nix/store/x553hd40hg8gh6vgvqz1baf246l5wgi4-run-check-harness-psql-15.drv'. Reason: builder failed with exit code 1. Output paths: /nix/store/v4nmhhy32515j4nygc0q8kzwgvvadsa5-run-check-harness-psql-15 Last 25 log lines: > test supautils_restrict_versions ... ok 165 ms > test vault ... ok 58 ms > test wal2json ... ok 50 ms > test z_15_ext_interface ... FAILED 1409 ms > test z_15_intarray_ltree_query ... ok 16 ms > test z_15_pg_stat_monitor ... ok 16 ms > test z_15_pgjwt ... ok 30 ms > test z_15_pgvector ... ok 84 ms > test z_15_plv8 ... ok 83 ms > test z_15_roles ... ok 24 ms > test z_15_rum ... ok 37 ms > test z_15_timescale ... ok 50 ms > test z_15_unhype_timescale_to_partman ... ok 19055 ms > > ======================= > 2 of 72 tests failed. > ======================= > > The differences that caused some tests to fail can be viewed in the > file "/nix/store/v4nmhhy32515j4nygc0q8kzwgvvadsa5-run-check-harness-psql-15/regression_output/regression.diffs". A copy of the test summary that you see > above is saved in the file "/nix/store/v4nmhhy32515j4nygc0q8kzwgvvadsa5-run-check-harness-psql-15/regression_output/regression.out". > > 2026-10-07 23:25:42 [ERROR] pg_regress tests failed > 2026-10-07 23:25:42 [ERROR] An error occurred. Exit code: 1 > 2026-10-07 23:25:42 [ERROR] Debug logs: For full logs, run: nix log /nix/store/x553hd40hg8gh6vgvqz1baf246l5wgi4-run-check-harness-psql-15.drv error: Cannot build '/nix/store/x553hd40hg8gh6vgvqz1baf246l5wgi4-run-check-harness-psql-15.drv'. Reason: builder failed with exit code 1. Output paths: /nix/store/v4nmhhy32515j4nygc0q8kzwgvvadsa5-run-check-harness-psql-15