this derivation will be built: /nix/store/1r9lvnsbn2p6gv8iiinazky9h519fg4v-run-check-harness-psql-orioledb-17.drv these 2 paths will be fetched (23.2 KiB download, 92.6 KiB unpacked): /nix/store/m8lh7k47c7dgnfkhvr5klbzhv2d23i6n-postgres-orioledb-17-check-harness /nix/store/6h6jy2xvdksbbmin0wkbf3dy8bz6gwxb-start-postgres-server-test error: Cannot build '/nix/store/1r9lvnsbn2p6gv8iiinazky9h519fg4v-run-check-harness-psql-orioledb-17.drv'. Reason: builder failed with exit code 1. Output paths: /nix/store/kncf67s26s89d4q9kqhrlp8jy3grrmjy-run-check-harness-psql-orioledb-17 Last 25 log lines: > test wal2json ... ok 18 ms > test z_orioledb-17_docs-cascades-deletes ... ok 83 ms > test z_orioledb-17_docs-full-text-search ... ok 29 ms > test z_orioledb-17_docs-functions ... ok 261 ms > test z_orioledb-17_docs-indexes ... ok 28 ms > test z_orioledb-17_docs-partitioning ... ok 41 ms > test z_orioledb-17_ext_interface ... FAILED 111 ms > test z_orioledb-17_extensions_schema ... FAILED 10 ms > test z_orioledb-17_intarray_ltree_query ... ok 9 ms > test z_orioledb-17_pg_stat_monitor ... ok 8 ms > test z_orioledb-17_pgroonga ... ok 55 ms > test z_orioledb-17_pgvector ... ok 18 ms > test z_orioledb-17_verify_orioledb ... ok 17 ms > > ======================= > 3 of 65 tests failed. > ======================= > > The differences that caused some tests to fail can be viewed in the > file "/nix/store/kncf67s26s89d4q9kqhrlp8jy3grrmjy-run-check-harness-psql-orioledb-17/regression_output/regression.diffs". A copy of the test summary that you see > above is saved in the file "/nix/store/kncf67s26s89d4q9kqhrlp8jy3grrmjy-run-check-harness-psql-orioledb-17/regression_output/regression.out". > > 2026-10-07 21:55:51 [ERROR] pg_regress tests failed > 2026-10-07 21:55:51 [ERROR] An error occurred. Exit code: 1 > 2026-10-07 21:55:51 [ERROR] Debug logs: For full logs, run: nix log /nix/store/1r9lvnsbn2p6gv8iiinazky9h519fg4v-run-check-harness-psql-orioledb-17.drv