this derivation will be built: /nix/store/m67qq3q84yl2hr4npgq2jswy13nqb9hk-run-check-harness-psql-17.drv these 2 paths will be fetched (23.2 KiB download, 92.4 KiB unpacked): /nix/store/xhq5l1skq3hv3xix0cgsrnly5cwm2nj8-postgres-17-check-harness /nix/store/ix4ia556k1fx2ikhz1gqgfcc5bikqahl-start-postgres-server-test error: Cannot build '/nix/store/m67qq3q84yl2hr4npgq2jswy13nqb9hk-run-check-harness-psql-17.drv'. Reason: builder failed with exit code 1. Output paths: /nix/store/g0wly52ry5zc1hwllgg3rg01ry90nhfh-run-check-harness-psql-17 Last 25 log lines: > test roles ... ok 13 ms > test security ... ok 11 ms > test storage ... ok 17 ms > test supautils_reserved_roles ... ok 9 ms > test supautils_restrict_versions ... ok 80 ms > test vault ... ok 29 ms > test wal2json ... ok 16 ms > test z_17_ext_interface ... FAILED 113 ms > test z_17_intarray_ltree_query ... ok 14 ms > test z_17_pg_stat_monitor ... ok 9 ms > test z_17_pgvector ... ok 13 ms > test z_17_roles ... ok 15 ms > test z_17_rum ... ok 14 ms > > ======================= > 2 of 68 tests failed. > ======================= > > The differences that caused some tests to fail can be viewed in the > file "/nix/store/g0wly52ry5zc1hwllgg3rg01ry90nhfh-run-check-harness-psql-17/regression_output/regression.diffs". A copy of the test summary that you see > above is saved in the file "/nix/store/g0wly52ry5zc1hwllgg3rg01ry90nhfh-run-check-harness-psql-17/regression_output/regression.out". > > 2026-10-07 21:55:40 [ERROR] pg_regress tests failed > 2026-10-07 21:55:40 [ERROR] An error occurred. Exit code: 1 > 2026-10-07 21:55:40 [ERROR] Debug logs: For full logs, run: nix log /nix/store/m67qq3q84yl2hr4npgq2jswy13nqb9hk-run-check-harness-psql-17.drv