nixbot

builds

supabase/postgres build #163 failed

branch develop · PR #2506 · commit 19f53ab45d · · took 13m 40s · eval 8m 20s

12 failed
failed attributes
status attribute duration
failed checks.aarch64-linux.psql_15 1m 10s
run-check-harness-psql-15: CREATE EXTENSION CREATE EXTENSION CREATE EXTENSION CREATE EXTENSION psql:/nix/store/ij5car617qxa8s7zv27zlhn6gxdnqrlj-prime.sql:74: ER …
run-check-harness-psql-15:
CREATE EXTENSION
CREATE EXTENSION
CREATE EXTENSION
CREATE EXTENSION
psql:/nix/store/ij5car617qxa8s7zv27zlhn6gxdnqrlj-prime.sql:74: ERROR:  type "geometry" does not exist
2026-10-07 20:33:41 [ERROR] Error executing SQL file
2026-10-07 20:33:41 [ERROR] An error occurred. Exit code: 1
2026-10-07 20:33:41 [ERROR] Debug logs:
failed checks.aarch64-linux.psql_15_slim 1m 10s
run-check-harness-psql-15-slim: CREATE EXTENSION CREATE EXTENSION CREATE EXTENSION CREATE EXTENSION psql:/nix/store/ij5car617qxa8s7zv27zlhn6gxdnqrlj-prime.sql:7 …
run-check-harness-psql-15-slim:
CREATE EXTENSION
CREATE EXTENSION
CREATE EXTENSION
CREATE EXTENSION
psql:/nix/store/ij5car617qxa8s7zv27zlhn6gxdnqrlj-prime.sql:74: ERROR:  type "geometry" does not exist
2026-10-07 20:33:41 [ERROR] Error executing SQL file
2026-10-07 20:33:41 [ERROR] An error occurred. Exit code: 1
2026-10-07 20:33:41 [ERROR] Debug logs:
failed checks.aarch64-linux.psql_17 44s
run-check-harness-psql-17: CREATE EXTENSION CREATE EXTENSION CREATE EXTENSION CREATE EXTENSION psql:/nix/store/ij5car617qxa8s7zv27zlhn6gxdnqrlj-prime.sql:74: ER …
run-check-harness-psql-17:
CREATE EXTENSION
CREATE EXTENSION
CREATE EXTENSION
CREATE EXTENSION
psql:/nix/store/ij5car617qxa8s7zv27zlhn6gxdnqrlj-prime.sql:74: ERROR:  type "geometry" does not exist
2026-10-07 20:35:44 [ERROR] Error executing SQL file
2026-10-07 20:35:44 [ERROR] An error occurred. Exit code: 1
2026-10-07 20:35:44 [ERROR] Debug logs:
failed checks.aarch64-linux.psql_17_slim 44s
run-check-harness-psql-17-slim: CREATE EXTENSION CREATE EXTENSION CREATE EXTENSION CREATE EXTENSION psql:/nix/store/ij5car617qxa8s7zv27zlhn6gxdnqrlj-prime.sql:7 …
run-check-harness-psql-17-slim:
CREATE EXTENSION
CREATE EXTENSION
CREATE EXTENSION
CREATE EXTENSION
psql:/nix/store/ij5car617qxa8s7zv27zlhn6gxdnqrlj-prime.sql:74: ERROR:  type "geometry" does not exist
2026-10-07 20:37:02 [ERROR] Error executing SQL file
2026-10-07 20:37:02 [ERROR] An error occurred. Exit code: 1
2026-10-07 20:37:02 [ERROR] Debug logs:
failed checks.aarch64-linux.psql_orioledb-17 45s
run-check-harness-psql-orioledb-17: CREATE EXTENSION CREATE EXTENSION CREATE EXTENSION CREATE EXTENSION psql:/nix/store/ij5car617qxa8s7zv27zlhn6gxdnqrlj-prime.s …
run-check-harness-psql-orioledb-17:
CREATE EXTENSION
CREATE EXTENSION
CREATE EXTENSION
CREATE EXTENSION
psql:/nix/store/ij5car617qxa8s7zv27zlhn6gxdnqrlj-prime.sql:74: ERROR:  type "geometry" does not exist
2026-10-07 20:33:16 [ERROR] Error executing SQL file
2026-10-07 20:33:16 [ERROR] An error occurred. Exit code: 1
2026-10-07 20:33:16 [ERROR] Debug logs:
failed checks.aarch64-linux.psql_orioledb-17_slim 44s
run-check-harness-psql-orioledb-17-slim: CREATE EXTENSION CREATE EXTENSION CREATE EXTENSION CREATE EXTENSION psql:/nix/store/ij5car617qxa8s7zv27zlhn6gxdnqrlj-pr …
run-check-harness-psql-orioledb-17-slim:
CREATE EXTENSION
CREATE EXTENSION
CREATE EXTENSION
CREATE EXTENSION
psql:/nix/store/ij5car617qxa8s7zv27zlhn6gxdnqrlj-prime.sql:74: ERROR:  type "geometry" does not exist
2026-10-07 20:35:44 [ERROR] Error executing SQL file
2026-10-07 20:35:44 [ERROR] An error occurred. Exit code: 1
2026-10-07 20:35:44 [ERROR] Debug logs:
failed checks.x86_64-linux.psql_15 51s
run-check-harness-psql-15: CREATE EXTENSION CREATE EXTENSION CREATE EXTENSION CREATE EXTENSION psql:/nix/store/ij5car617qxa8s7zv27zlhn6gxdnqrlj-prime.sql:74: ER …
run-check-harness-psql-15:
CREATE EXTENSION
CREATE EXTENSION
CREATE EXTENSION
CREATE EXTENSION
psql:/nix/store/ij5car617qxa8s7zv27zlhn6gxdnqrlj-prime.sql:74: ERROR:  type "geometry" does not exist
2026-10-07 20:36:48 [ERROR] Error executing SQL file
2026-10-07 20:36:48 [ERROR] An error occurred. Exit code: 1
2026-10-07 20:36:48 [ERROR] Debug logs:
failed checks.x86_64-linux.psql_15_slim 51s
run-check-harness-psql-15-slim: CREATE EXTENSION CREATE EXTENSION CREATE EXTENSION CREATE EXTENSION psql:/nix/store/ij5car617qxa8s7zv27zlhn6gxdnqrlj-prime.sql:7 …
run-check-harness-psql-15-slim:
CREATE EXTENSION
CREATE EXTENSION
CREATE EXTENSION
CREATE EXTENSION
psql:/nix/store/ij5car617qxa8s7zv27zlhn6gxdnqrlj-prime.sql:74: ERROR:  type "geometry" does not exist
2026-10-07 20:36:51 [ERROR] Error executing SQL file
2026-10-07 20:36:51 [ERROR] An error occurred. Exit code: 1
2026-10-07 20:36:51 [ERROR] Debug logs:
failed checks.x86_64-linux.psql_17 32s
run-check-harness-psql-17: CREATE EXTENSION CREATE EXTENSION CREATE EXTENSION CREATE EXTENSION psql:/nix/store/ij5car617qxa8s7zv27zlhn6gxdnqrlj-prime.sql:74: ER …
run-check-harness-psql-17:
CREATE EXTENSION
CREATE EXTENSION
CREATE EXTENSION
CREATE EXTENSION
psql:/nix/store/ij5car617qxa8s7zv27zlhn6gxdnqrlj-prime.sql:74: ERROR:  type "geometry" does not exist
2026-10-07 20:36:33 [ERROR] Error executing SQL file
2026-10-07 20:36:33 [ERROR] An error occurred. Exit code: 1
2026-10-07 20:36:33 [ERROR] Debug logs:
failed checks.x86_64-linux.psql_17_slim 33s
run-check-harness-psql-17-slim: CREATE EXTENSION CREATE EXTENSION CREATE EXTENSION CREATE EXTENSION psql:/nix/store/ij5car617qxa8s7zv27zlhn6gxdnqrlj-prime.sql:7 …
run-check-harness-psql-17-slim:
CREATE EXTENSION
CREATE EXTENSION
CREATE EXTENSION
CREATE EXTENSION
psql:/nix/store/ij5car617qxa8s7zv27zlhn6gxdnqrlj-prime.sql:74: ERROR:  type "geometry" does not exist
2026-10-07 20:35:57 [ERROR] Error executing SQL file
2026-10-07 20:35:57 [ERROR] An error occurred. Exit code: 1
2026-10-07 20:35:57 [ERROR] Debug logs:
failed checks.x86_64-linux.psql_orioledb-17 32s
run-check-harness-psql-orioledb-17: CREATE EXTENSION CREATE EXTENSION CREATE EXTENSION CREATE EXTENSION psql:/nix/store/ij5car617qxa8s7zv27zlhn6gxdnqrlj-prime.s …
run-check-harness-psql-orioledb-17:
CREATE EXTENSION
CREATE EXTENSION
CREATE EXTENSION
CREATE EXTENSION
psql:/nix/store/ij5car617qxa8s7zv27zlhn6gxdnqrlj-prime.sql:74: ERROR:  type "geometry" does not exist
2026-10-07 20:36:32 [ERROR] Error executing SQL file
2026-10-07 20:36:32 [ERROR] An error occurred. Exit code: 1
2026-10-07 20:36:32 [ERROR] Debug logs:
failed checks.x86_64-linux.psql_orioledb-17_slim 33s
run-check-harness-psql-orioledb-17-slim: CREATE EXTENSION CREATE EXTENSION CREATE EXTENSION CREATE EXTENSION psql:/nix/store/ij5car617qxa8s7zv27zlhn6gxdnqrlj-pr …
run-check-harness-psql-orioledb-17-slim:
CREATE EXTENSION
CREATE EXTENSION
CREATE EXTENSION
CREATE EXTENSION
psql:/nix/store/ij5car617qxa8s7zv27zlhn6gxdnqrlj-prime.sql:74: ERROR:  type "geometry" does not exist
2026-10-07 20:36:10 [ERROR] Error executing SQL file
2026-10-07 20:36:10 [ERROR] An error occurred. Exit code: 1
2026-10-07 20:36:10 [ERROR] Debug logs:
14 cancelled
cancelled attributes
status attribute duration
loading…
30 succeeded
succeeded attributes
status attribute duration
loading…
68 already built
skipped attributes
status attribute duration
loading…