this derivation will be built: /nix/store/kaiqpv3dppbknajp4aj4c3g4wp7079ii-run-check-harness-psql-17-slim.drv error: Cannot build '/nix/store/kaiqpv3dppbknajp4aj4c3g4wp7079ii-run-check-harness-psql-17-slim.drv'. Reason: builder failed with exit code 1. Output paths: /nix/store/2mr0ihkv6n6gsmb9m3kv49flr39x042p-run-check-harness-psql-17-slim Last 25 log lines: > test roles ... ok 13 ms > test security ... ok 11 ms > test storage ... ok 14 ms > test supautils_reserved_roles ... ok 9 ms > test supautils_restrict_versions ... ok 82 ms > test vault ... ok 27 ms > test wal2json ... ok 16 ms > test z_17_ext_interface ... FAILED 111 ms > test z_17_intarray_ltree_query ... ok 14 ms > test z_17_pg_stat_monitor ... ok 7 ms > test z_17_pgvector ... ok 12 ms > test z_17_roles ... ok 14 ms > test z_17_rum ... ok 13 ms > > ======================= > 2 of 68 tests failed. > ======================= > > The differences that caused some tests to fail can be viewed in the > file "/nix/store/2mr0ihkv6n6gsmb9m3kv49flr39x042p-run-check-harness-psql-17-slim/regression_output/regression.diffs". A copy of the test summary that you see > above is saved in the file "/nix/store/2mr0ihkv6n6gsmb9m3kv49flr39x042p-run-check-harness-psql-17-slim/regression_output/regression.out". > > 2026-10-07 20:19:07 [ERROR] pg_regress tests failed > 2026-10-07 20:19:07 [ERROR] An error occurred. Exit code: 1 > 2026-10-07 20:19:07 [ERROR] Debug logs: For full logs, run: nix log /nix/store/kaiqpv3dppbknajp4aj4c3g4wp7079ii-run-check-harness-psql-17-slim.drv