this derivation will be built: /nix/store/w0f7chhp1jxqwgw8ybkf29jm486j4knq-run-check-harness-psql-15.drv error: build of '/nix/store/w0f7chhp1jxqwgw8ybkf29jm486j4knq-run-check-harness-psql-15.drv' on 'ssh-ng://nixbot-remote-build@78.232.36.247' failed: Cannot build '/nix/store/w0f7chhp1jxqwgw8ybkf29jm486j4knq-run-check-harness-psql-15.drv'. Reason: builder failed with exit code 1. Output paths: /nix/store/yd4n3zsp49pvl8za51xgdyswhbdhwa34-run-check-harness-psql-15 Last 25 log lines: > test supautils_restrict_versions ... ok 156 ms > test vault ... ok 60 ms > test wal2json ... ok 54 ms > test z_15_ext_interface ... FAILED 1959 ms > test z_15_intarray_ltree_query ... ok 15 ms > test z_15_pg_stat_monitor ... ok 15 ms > test z_15_pgjwt ... ok 29 ms > test z_15_pgvector ... ok 77 ms > test z_15_plv8 ... ok 79 ms > test z_15_roles ... ok 24 ms > test z_15_rum ... ok 37 ms > test z_15_timescale ... ok 56 ms > test z_15_unhype_timescale_to_partman ... ok 18873 ms > > ======================= > 2 of 72 tests failed. > ======================= > > The differences that caused some tests to fail can be viewed in the > file "/nix/store/yd4n3zsp49pvl8za51xgdyswhbdhwa34-run-check-harness-psql-15/regression_output/regression.diffs". A copy of the test summary that you see > above is saved in the file "/nix/store/yd4n3zsp49pvl8za51xgdyswhbdhwa34-run-check-harness-psql-15/regression_output/regression.out". > > 2026-10-07 20:19:08 [ERROR] pg_regress tests failed > 2026-10-07 20:19:08 [ERROR] An error occurred. Exit code: 1 > 2026-10-07 20:19:08 [ERROR] Debug logs: For full logs, run: nix log /nix/store/w0f7chhp1jxqwgw8ybkf29jm486j4knq-run-check-harness-psql-15.drv error: Cannot build '/nix/store/w0f7chhp1jxqwgw8ybkf29jm486j4knq-run-check-harness-psql-15.drv'. Reason: builder failed with exit code 1. Output paths: /nix/store/yd4n3zsp49pvl8za51xgdyswhbdhwa34-run-check-harness-psql-15