this derivation will be built: /nix/store/jpgv9qzz3lip5qayc0z24vrglk4yy36y-run-check-harness-psql-orioledb-17.drv these 2 paths will be fetched (23.2 KiB download, 92.1 KiB unpacked): /nix/store/hnrxgflacqgf6z7z1hbxllcrgc1y0am5-postgres-orioledb-17-check-harness /nix/store/jjf3fl4v9gcwmgdb1c3a8qirslvfac3n-start-postgres-server-test error: Cannot build '/nix/store/jpgv9qzz3lip5qayc0z24vrglk4yy36y-run-check-harness-psql-orioledb-17.drv'. Reason: builder failed with exit code 1. Output paths: /nix/store/xmmk8llcqql2l70ymcmwn157r5sw1mld-run-check-harness-psql-orioledb-17 Last 25 log lines: > test wal2json ... ok 20 ms > test z_orioledb-17_docs-cascades-deletes ... ok 95 ms > test z_orioledb-17_docs-full-text-search ... ok 37 ms > test z_orioledb-17_docs-functions ... ok 438 ms > test z_orioledb-17_docs-indexes ... ok 38 ms > test z_orioledb-17_docs-partitioning ... ok 47 ms > test z_orioledb-17_ext_interface ... FAILED 130 ms > test z_orioledb-17_extensions_schema ... ok 13 ms > test z_orioledb-17_intarray_ltree_query ... ok 10 ms > test z_orioledb-17_pg_stat_monitor ... ok 10 ms > test z_orioledb-17_pgroonga ... ok 71 ms > test z_orioledb-17_pgvector ... ok 24 ms > test z_orioledb-17_verify_orioledb ... ok 20 ms > > ======================= > 2 of 65 tests failed. > ======================= > > The differences that caused some tests to fail can be viewed in the > file "/nix/store/xmmk8llcqql2l70ymcmwn157r5sw1mld-run-check-harness-psql-orioledb-17/regression_output/regression.diffs". A copy of the test summary that you see > above is saved in the file "/nix/store/xmmk8llcqql2l70ymcmwn157r5sw1mld-run-check-harness-psql-orioledb-17/regression_output/regression.out". > > 2026-10-07 19:30:54 [ERROR] pg_regress tests failed > 2026-10-07 19:30:54 [ERROR] An error occurred. Exit code: 1 > 2026-10-07 19:30:54 [ERROR] Debug logs: For full logs, run: nix log /nix/store/jpgv9qzz3lip5qayc0z24vrglk4yy36y-run-check-harness-psql-orioledb-17.drv