this derivation will be built: /nix/store/2m6yhc3n48xipbfpj1j3x94xlph0sj49-run-check-harness-psql-15-slim.drv these 2 paths will be fetched (23.2 KiB download, 92.0 KiB unpacked): /nix/store/s1fbvl814b5970x09l4qsyx2a8im98h6-postgres-15-check-harness /nix/store/x8zcpg05j0773a1h3kjs8m7kplwgmi14-start-postgres-server-test error: Cannot build '/nix/store/2m6yhc3n48xipbfpj1j3x94xlph0sj49-run-check-harness-psql-15-slim.drv'. Reason: builder failed with exit code 1. Output paths: /nix/store/5z312n1r4br983hqzb7ffvj2mdm5c7hi-run-check-harness-psql-15-slim Last 25 log lines: > test supautils_restrict_versions ... ok 84 ms > test vault ... ok 28 ms > test wal2json ... ok 15 ms > test z_15_ext_interface ... FAILED 637 ms > test z_15_intarray_ltree_query ... ok 13 ms > test z_15_pg_stat_monitor ... ok 11 ms > test z_15_pgjwt ... ok 19 ms > test z_15_pgvector ... ok 32 ms > test z_15_plv8 ... ok 50 ms > test z_15_roles ... ok 18 ms > test z_15_rum ... ok 21 ms > test z_15_timescale ... ok 23 ms > test z_15_unhype_timescale_to_partman ... ok 11369 ms > > ======================= > 2 of 72 tests failed. > ======================= > > The differences that caused some tests to fail can be viewed in the > file "/nix/store/5z312n1r4br983hqzb7ffvj2mdm5c7hi-run-check-harness-psql-15-slim/regression_output/regression.diffs". A copy of the test summary that you see > above is saved in the file "/nix/store/5z312n1r4br983hqzb7ffvj2mdm5c7hi-run-check-harness-psql-15-slim/regression_output/regression.out". > > 2026-10-07 19:31:24 [ERROR] pg_regress tests failed > 2026-10-07 19:31:24 [ERROR] An error occurred. Exit code: 1 > 2026-10-07 19:31:24 [ERROR] Debug logs: For full logs, run: nix log /nix/store/2m6yhc3n48xipbfpj1j3x94xlph0sj49-run-check-harness-psql-15-slim.drv