setup
checks.x86_64-linux.psql_17
· build #158
· raw
1this derivation will be built:2 /nix/store/wx42y24mha97nzg1y26f27fsz6w8d268-run-check-harness-psql-17.drv3error: Cannot build '/nix/store/wx42y24mha97nzg1y26f27fsz6w8d268-run-check-harness-psql-17.drv'.4 Reason: builder failed with exit code 1.5 Output paths:6 /nix/store/9xrzbv4v0iv51aza4py3j90w289wa2vg-run-check-harness-psql-177 Last 25 log lines:8 > test roles ... ok 12 ms9 > test security ... ok 12 ms10 > test storage ... ok 16 ms11 > test supautils_reserved_roles ... ok 8 ms12 > test supautils_restrict_versions ... ok 81 ms13 > test vault ... ok 26 ms14 > test wal2json ... ok 12 ms15 > test z_17_ext_interface ... FAILED 110 ms16 > test z_17_intarray_ltree_query ... ok 13 ms17 > test z_17_pg_stat_monitor ... ok 8 ms18 > test z_17_pgvector ... ok 14 ms19 > test z_17_roles ... ok 15 ms20 > test z_17_rum ... ok 15 ms21 >22 > =======================23 > 2 of 68 tests failed.24 > =======================25 >26 > The differences that caused some tests to fail can be viewed in the27 > file "/nix/store/9xrzbv4v0iv51aza4py3j90w289wa2vg-run-check-harness-psql-17/regression_output/regression.diffs". A copy of the test summary that you see28 > above is saved in the file "/nix/store/9xrzbv4v0iv51aza4py3j90w289wa2vg-run-check-harness-psql-17/regression_output/regression.out".29 >30 > 2026-10-07 16:57:36 [ERROR] pg_regress tests failed31 > 2026-10-07 16:57:36 [ERROR] An error occurred. Exit code: 132 > 2026-10-07 16:57:36 [ERROR] Debug logs:33 For full logs, run:34 nix log /nix/store/wx42y24mha97nzg1y26f27fsz6w8d268-run-check-harness-psql-17.drv