nixbot

builds
1this derivation will be built:2 /nix/store/a3jkv4i829jq9832w6by7j30qzc7ad8h-run-check-harness-psql-15-slim.drv3error: Cannot build '/nix/store/a3jkv4i829jq9832w6by7j30qzc7ad8h-run-check-harness-psql-15-slim.drv'.4 Reason: builder failed with exit code 1.5 Output paths:6 /nix/store/p2adh1s2gnax8bb8hklh7c6pl3c4ylqz-run-check-harness-psql-15-slim7 Last 25 log lines:8 > test supautils_restrict_versions ... ok 85 ms9 > test vault ... ok 29 ms10 > test wal2json ... ok 13 ms11 > test z_15_ext_interface ... FAILED 629 ms12 > test z_15_intarray_ltree_query ... ok 12 ms13 > test z_15_pg_stat_monitor ... ok 10 ms14 > test z_15_pgjwt ... ok 17 ms15 > test z_15_pgvector ... ok 33 ms16 > test z_15_plv8 ... ok 48 ms17 > test z_15_roles ... ok 17 ms18 > test z_15_rum ... ok 17 ms19 > test z_15_timescale ... ok 22 ms20 > test z_15_unhype_timescale_to_partman ... ok 11342 ms21 >22 > =======================23 > 2 of 72 tests failed.24 > =======================25 >26 > The differences that caused some tests to fail can be viewed in the27 > file "/nix/store/p2adh1s2gnax8bb8hklh7c6pl3c4ylqz-run-check-harness-psql-15-slim/regression_output/regression.diffs". A copy of the test summary that you see28 > above is saved in the file "/nix/store/p2adh1s2gnax8bb8hklh7c6pl3c4ylqz-run-check-harness-psql-15-slim/regression_output/regression.out".29 >30 > 2026-10-07 16:01:38 [ERROR] pg_regress tests failed31 > 2026-10-07 16:01:38 [ERROR] An error occurred. Exit code: 132 > 2026-10-07 16:01:38 [ERROR] Debug logs:33 For full logs, run:34 nix log /nix/store/a3jkv4i829jq9832w6by7j30qzc7ad8h-run-check-harness-psql-15-slim.drv