this derivation will be built: /nix/store/jxm7k4cphwialamhpyiqix0wi6rkx256-run-check-harness-psql-15-slim.drv error: build of '/nix/store/jxm7k4cphwialamhpyiqix0wi6rkx256-run-check-harness-psql-15-slim.drv' on 'ssh-ng://nixbot-remote-build@78.232.36.247' failed: Cannot build '/nix/store/jxm7k4cphwialamhpyiqix0wi6rkx256-run-check-harness-psql-15-slim.drv'. Reason: builder failed with exit code 1. Output paths: /nix/store/fy6fyymnj22gw22pq5c30mq8rs5kb142-run-check-harness-psql-15-slim Last 25 log lines: > test supautils_restrict_versions ... ok 153 ms > test vault ... ok 56 ms > test wal2json ... ok 49 ms > test z_15_ext_interface ... FAILED 1442 ms > test z_15_intarray_ltree_query ... ok 15 ms > test z_15_pg_stat_monitor ... ok 16 ms > test z_15_pgjwt ... ok 29 ms > test z_15_pgvector ... ok 115 ms > test z_15_plv8 ... ok 78 ms > test z_15_roles ... ok 24 ms > test z_15_rum ... ok 41 ms > test z_15_timescale ... ok 52 ms > test z_15_unhype_timescale_to_partman ... ok 18753 ms > > ======================= > 2 of 72 tests failed. > ======================= > > The differences that caused some tests to fail can be viewed in the > file "/nix/store/fy6fyymnj22gw22pq5c30mq8rs5kb142-run-check-harness-psql-15-slim/regression_output/regression.diffs". A copy of the test summary that you see > above is saved in the file "/nix/store/fy6fyymnj22gw22pq5c30mq8rs5kb142-run-check-harness-psql-15-slim/regression_output/regression.out". > > 2026-10-07 15:22:41 [ERROR] pg_regress tests failed > 2026-10-07 15:22:41 [ERROR] An error occurred. Exit code: 1 > 2026-10-07 15:22:41 [ERROR] Debug logs: For full logs, run: nix log /nix/store/jxm7k4cphwialamhpyiqix0wi6rkx256-run-check-harness-psql-15-slim.drv error: Cannot build '/nix/store/jxm7k4cphwialamhpyiqix0wi6rkx256-run-check-harness-psql-15-slim.drv'. Reason: builder failed with exit code 1. Output paths: /nix/store/fy6fyymnj22gw22pq5c30mq8rs5kb142-run-check-harness-psql-15-slim