failed attributes
| status |
attribute |
duration |
| failed |
checks.aarch64-linux.psql_15
|
1m 32s |
run-check-harness-psql-15:
2 of 72 tests failed.
=======================
The differences that caused some tests to fail can be viewed in the
file "/nix/store/ …
run-check-harness-psql-15:
2 of 72 tests failed.
=======================
The differences that caused some tests to fail can be viewed in the
file "/nix/store/yd4n3zsp49pvl8za51xgdyswhbdhwa34-run-check-harness-psql-15/regression_output/regression.diffs". A copy of the test summary that you see
above is saved in the file "/nix/store/yd4n3zsp49pvl8za51xgdyswhbdhwa34-run-check-harness-psql-15/regression_output/regression.out".
2026-10-07 15:22:41 [ERROR] pg_regress tests failed
2026-10-07 15:22:41 [ERROR] An error occurred. Exit code: 1
2026-10-07 15:22:41 [ERROR] Debug logs:
|
| failed |
checks.aarch64-linux.psql_15_slim
|
1m 32s |
run-check-harness-psql-15-slim:
2 of 72 tests failed.
=======================
The differences that caused some tests to fail can be viewed in the
file "/nix/s …
run-check-harness-psql-15-slim:
2 of 72 tests failed.
=======================
The differences that caused some tests to fail can be viewed in the
file "/nix/store/fy6fyymnj22gw22pq5c30mq8rs5kb142-run-check-harness-psql-15-slim/regression_output/regression.diffs". A copy of the test summary that you see
above is saved in the file "/nix/store/fy6fyymnj22gw22pq5c30mq8rs5kb142-run-check-harness-psql-15-slim/regression_output/regression.out".
2026-10-07 15:22:41 [ERROR] pg_regress tests failed
2026-10-07 15:22:41 [ERROR] An error occurred. Exit code: 1
2026-10-07 15:22:41 [ERROR] Debug logs:
|
| failed |
checks.aarch64-linux.psql_17
|
42s |
run-check-harness-psql-17:
2 of 68 tests failed.
=======================
The differences that caused some tests to fail can be viewed in the
file "/nix/store/ …
run-check-harness-psql-17:
2 of 68 tests failed.
=======================
The differences that caused some tests to fail can be viewed in the
file "/nix/store/v1lldzwn73bx8gs4zsbp6vs8vxsr2w5j-run-check-harness-psql-17/regression_output/regression.diffs". A copy of the test summary that you see
above is saved in the file "/nix/store/v1lldzwn73bx8gs4zsbp6vs8vxsr2w5j-run-check-harness-psql-17/regression_output/regression.out".
2026-10-07 15:22:12 [ERROR] pg_regress tests failed
2026-10-07 15:22:12 [ERROR] An error occurred. Exit code: 1
2026-10-07 15:22:12 [ERROR] Debug logs:
|
| failed |
checks.aarch64-linux.psql_17_slim
|
44s |
run-check-harness-psql-17-slim:
2 of 68 tests failed.
=======================
The differences that caused some tests to fail can be viewed in the
file "/nix/s …
run-check-harness-psql-17-slim:
2 of 68 tests failed.
=======================
The differences that caused some tests to fail can be viewed in the
file "/nix/store/ahnamh0a7yfyjk76j0wfyl0qphaxy8an-run-check-harness-psql-17-slim/regression_output/regression.diffs". A copy of the test summary that you see
above is saved in the file "/nix/store/ahnamh0a7yfyjk76j0wfyl0qphaxy8an-run-check-harness-psql-17-slim/regression_output/regression.out".
2026-10-07 15:21:53 [ERROR] pg_regress tests failed
2026-10-07 15:21:53 [ERROR] An error occurred. Exit code: 1
2026-10-07 15:21:53 [ERROR] Debug logs:
|
| failed |
checks.aarch64-linux.psql_orioledb-17
|
47s |
run-check-harness-psql-orioledb-17:
2 of 65 tests failed.
=======================
The differences that caused some tests to fail can be viewed in the
file "/n …
run-check-harness-psql-orioledb-17:
2 of 65 tests failed.
=======================
The differences that caused some tests to fail can be viewed in the
file "/nix/store/zbzzylwfngaji83jn4syc2wz53iyhq0j-run-check-harness-psql-orioledb-17/regression_output/regression.diffs". A copy of the test summary that you see
above is saved in the file "/nix/store/zbzzylwfngaji83jn4syc2wz53iyhq0j-run-check-harness-psql-orioledb-17/regression_output/regression.out".
2026-10-07 15:21:55 [ERROR] pg_regress tests failed
2026-10-07 15:21:55 [ERROR] An error occurred. Exit code: 1
2026-10-07 15:21:55 [ERROR] Debug logs:
|
| failed |
checks.aarch64-linux.psql_orioledb-17_slim
|
47s |
run-check-harness-psql-orioledb-17-slim:
2 of 65 tests failed.
=======================
The differences that caused some tests to fail can be viewed in the
fil …
run-check-harness-psql-orioledb-17-slim:
2 of 65 tests failed.
=======================
The differences that caused some tests to fail can be viewed in the
file "/nix/store/cjg95j005qyanra6kkrwy2rcn3ylwqik-run-check-harness-psql-orioledb-17-slim/regression_output/regression.diffs". A copy of the test summary that you see
above is saved in the file "/nix/store/cjg95j005qyanra6kkrwy2rcn3ylwqik-run-check-harness-psql-orioledb-17-slim/regression_output/regression.out".
2026-10-07 15:21:55 [ERROR] pg_regress tests failed
2026-10-07 15:21:55 [ERROR] An error occurred. Exit code: 1
2026-10-07 15:21:55 [ERROR] Debug logs:
|
| failed |
checks.x86_64-linux.psql_15
|
58s |
run-check-harness-psql-15:
2 of 72 tests failed.
=======================
The differences that caused some tests to fail can be viewed in the
file "/nix/store/ …
run-check-harness-psql-15:
2 of 72 tests failed.
=======================
The differences that caused some tests to fail can be viewed in the
file "/nix/store/4nnkh6bas4krq4avcn7zi9l1aibcilz9-run-check-harness-psql-15/regression_output/regression.diffs". A copy of the test summary that you see
above is saved in the file "/nix/store/4nnkh6bas4krq4avcn7zi9l1aibcilz9-run-check-harness-psql-15/regression_output/regression.out".
2026-10-07 15:25:27 [ERROR] pg_regress tests failed
2026-10-07 15:25:27 [ERROR] An error occurred. Exit code: 1
2026-10-07 15:25:27 [ERROR] Debug logs:
|
| failed |
checks.x86_64-linux.psql_15_slim
|
58s |
run-check-harness-psql-15-slim:
2 of 72 tests failed.
=======================
The differences that caused some tests to fail can be viewed in the
file "/nix/s …
run-check-harness-psql-15-slim:
2 of 72 tests failed.
=======================
The differences that caused some tests to fail can be viewed in the
file "/nix/store/p2adh1s2gnax8bb8hklh7c6pl3c4ylqz-run-check-harness-psql-15-slim/regression_output/regression.diffs". A copy of the test summary that you see
above is saved in the file "/nix/store/p2adh1s2gnax8bb8hklh7c6pl3c4ylqz-run-check-harness-psql-15-slim/regression_output/regression.out".
2026-10-07 15:25:27 [ERROR] pg_regress tests failed
2026-10-07 15:25:27 [ERROR] An error occurred. Exit code: 1
2026-10-07 15:25:28 [ERROR] Debug logs:
|
| failed |
checks.x86_64-linux.psql_17
|
30s |
run-check-harness-psql-17:
2 of 68 tests failed.
=======================
The differences that caused some tests to fail can be viewed in the
file "/nix/store/ …
run-check-harness-psql-17:
2 of 68 tests failed.
=======================
The differences that caused some tests to fail can be viewed in the
file "/nix/store/9xrzbv4v0iv51aza4py3j90w289wa2vg-run-check-harness-psql-17/regression_output/regression.diffs". A copy of the test summary that you see
above is saved in the file "/nix/store/9xrzbv4v0iv51aza4py3j90w289wa2vg-run-check-harness-psql-17/regression_output/regression.out".
2026-10-07 15:25:00 [ERROR] pg_regress tests failed
2026-10-07 15:25:00 [ERROR] An error occurred. Exit code: 1
2026-10-07 15:25:00 [ERROR] Debug logs:
|
| failed |
checks.x86_64-linux.psql_17_slim
|
30s |
run-check-harness-psql-17-slim:
2 of 68 tests failed.
=======================
The differences that caused some tests to fail can be viewed in the
file "/nix/s …
run-check-harness-psql-17-slim:
2 of 68 tests failed.
=======================
The differences that caused some tests to fail can be viewed in the
file "/nix/store/2mr0ihkv6n6gsmb9m3kv49flr39x042p-run-check-harness-psql-17-slim/regression_output/regression.diffs". A copy of the test summary that you see
above is saved in the file "/nix/store/2mr0ihkv6n6gsmb9m3kv49flr39x042p-run-check-harness-psql-17-slim/regression_output/regression.out".
2026-10-07 15:24:58 [ERROR] pg_regress tests failed
2026-10-07 15:24:58 [ERROR] An error occurred. Exit code: 1
2026-10-07 15:24:58 [ERROR] Debug logs:
|
| failed |
checks.x86_64-linux.psql_orioledb-17
|
31s |
run-check-harness-psql-orioledb-17:
2 of 65 tests failed.
=======================
The differences that caused some tests to fail can be viewed in the
file "/n …
run-check-harness-psql-orioledb-17:
2 of 65 tests failed.
=======================
The differences that caused some tests to fail can be viewed in the
file "/nix/store/l80pcj4x689fzyj21lqkk3al1lf2farh-run-check-harness-psql-orioledb-17/regression_output/regression.diffs". A copy of the test summary that you see
above is saved in the file "/nix/store/l80pcj4x689fzyj21lqkk3al1lf2farh-run-check-harness-psql-orioledb-17/regression_output/regression.out".
2026-10-07 15:25:00 [ERROR] pg_regress tests failed
2026-10-07 15:25:00 [ERROR] An error occurred. Exit code: 1
2026-10-07 15:25:00 [ERROR] Debug logs:
|
| failed |
checks.x86_64-linux.psql_orioledb-17_slim
|
31s |
run-check-harness-psql-orioledb-17-slim:
2 of 65 tests failed.
=======================
The differences that caused some tests to fail can be viewed in the
fil …
run-check-harness-psql-orioledb-17-slim:
2 of 65 tests failed.
=======================
The differences that caused some tests to fail can be viewed in the
file "/nix/store/4ms3jravx0wzgfrwqkz709p7bjrdzgj1-run-check-harness-psql-orioledb-17-slim/regression_output/regression.diffs". A copy of the test summary that you see
above is saved in the file "/nix/store/4ms3jravx0wzgfrwqkz709p7bjrdzgj1-run-check-harness-psql-orioledb-17-slim/regression_output/regression.out".
2026-10-07 15:25:00 [ERROR] pg_regress tests failed
2026-10-07 15:25:00 [ERROR] An error occurred. Exit code: 1
2026-10-07 15:25:00 [ERROR] Debug logs:
|