this derivation will be built: /nix/store/rcfg8pvxn6yk6d2w6jgjix48wdv2klqz-run-check-harness-psql-orioledb-17.drv error: Cannot build '/nix/store/rcfg8pvxn6yk6d2w6jgjix48wdv2klqz-run-check-harness-psql-orioledb-17.drv'. Reason: builder failed with exit code 1. Output paths: /nix/store/l80pcj4x689fzyj21lqkk3al1lf2farh-run-check-harness-psql-orioledb-17 Last 25 log lines: > test wal2json ... ok 17 ms > test z_orioledb-17_docs-cascades-deletes ... ok 86 ms > test z_orioledb-17_docs-full-text-search ... ok 32 ms > test z_orioledb-17_docs-functions ... ok 357 ms > test z_orioledb-17_docs-indexes ... ok 28 ms > test z_orioledb-17_docs-partitioning ... ok 38 ms > test z_orioledb-17_ext_interface ... FAILED 112 ms > test z_orioledb-17_extensions_schema ... ok 10 ms > test z_orioledb-17_intarray_ltree_query ... ok 8 ms > test z_orioledb-17_pg_stat_monitor ... ok 7 ms > test z_orioledb-17_pgroonga ... ok 60 ms > test z_orioledb-17_pgvector ... ok 18 ms > test z_orioledb-17_verify_orioledb ... ok 15 ms > > ======================= > 2 of 65 tests failed. > ======================= > > The differences that caused some tests to fail can be viewed in the > file "/nix/store/l80pcj4x689fzyj21lqkk3al1lf2farh-run-check-harness-psql-orioledb-17/regression_output/regression.diffs". A copy of the test summary that you see > above is saved in the file "/nix/store/l80pcj4x689fzyj21lqkk3al1lf2farh-run-check-harness-psql-orioledb-17/regression_output/regression.out". > > 2026-10-07 15:10:40 [ERROR] pg_regress tests failed > 2026-10-07 15:10:40 [ERROR] An error occurred. Exit code: 1 > 2026-10-07 15:10:40 [ERROR] Debug logs: For full logs, run: nix log /nix/store/rcfg8pvxn6yk6d2w6jgjix48wdv2klqz-run-check-harness-psql-orioledb-17.drv