setup
checks.x86_64-linux.psql_17_slim
· build #155
· raw
1this derivation will be built:2 /nix/store/kaiqpv3dppbknajp4aj4c3g4wp7079ii-run-check-harness-psql-17-slim.drv3error: Cannot build '/nix/store/kaiqpv3dppbknajp4aj4c3g4wp7079ii-run-check-harness-psql-17-slim.drv'.4 Reason: builder failed with exit code 1.5 Output paths:6 /nix/store/2mr0ihkv6n6gsmb9m3kv49flr39x042p-run-check-harness-psql-17-slim7 Last 25 log lines:8 > test roles ... ok 11 ms9 > test security ... ok 11 ms10 > test storage ... ok 15 ms11 > test supautils_reserved_roles ... ok 8 ms12 > test supautils_restrict_versions ... ok 84 ms13 > test vault ... ok 27 ms14 > test wal2json ... ok 14 ms15 > test z_17_ext_interface ... FAILED 114 ms16 > test z_17_intarray_ltree_query ... ok 16 ms17 > test z_17_pg_stat_monitor ... ok 9 ms18 > test z_17_pgvector ... ok 13 ms19 > test z_17_roles ... ok 17 ms20 > test z_17_rum ... ok 15 ms21 >22 > =======================23 > 2 of 68 tests failed.24 > =======================25 >26 > The differences that caused some tests to fail can be viewed in the27 > file "/nix/store/2mr0ihkv6n6gsmb9m3kv49flr39x042p-run-check-harness-psql-17-slim/regression_output/regression.diffs". A copy of the test summary that you see28 > above is saved in the file "/nix/store/2mr0ihkv6n6gsmb9m3kv49flr39x042p-run-check-harness-psql-17-slim/regression_output/regression.out".29 >30 > 2026-10-07 15:10:40 [ERROR] pg_regress tests failed31 > 2026-10-07 15:10:40 [ERROR] An error occurred. Exit code: 132 > 2026-10-07 15:10:40 [ERROR] Debug logs:33 For full logs, run:34 nix log /nix/store/kaiqpv3dppbknajp4aj4c3g4wp7079ii-run-check-harness-psql-17-slim.drv