setup
checks.aarch64-linux.psql_15
· build #155
· raw
1this derivation will be built:2 /nix/store/w0f7chhp1jxqwgw8ybkf29jm486j4knq-run-check-harness-psql-15.drv3error: build of '/nix/store/w0f7chhp1jxqwgw8ybkf29jm486j4knq-run-check-harness-psql-15.drv' on 'ssh-ng://nixbot-remote-build@78.232.36.247' failed: Cannot build '/nix/store/w0f7chhp1jxqwgw8ybkf29jm486j4knq-run-check-harness-psql-15.drv'.4 Reason: builder failed with exit code 1.5 Output paths:6 /nix/store/yd4n3zsp49pvl8za51xgdyswhbdhwa34-run-check-harness-psql-157 Last 25 log lines:8 > test supautils_restrict_versions ... ok 151 ms9 > test vault ... ok 60 ms10 > test wal2json ... ok 46 ms11 > test z_15_ext_interface ... FAILED 1423 ms12 > test z_15_intarray_ltree_query ... ok 16 ms13 > test z_15_pg_stat_monitor ... ok 16 ms14 > test z_15_pgjwt ... ok 30 ms15 > test z_15_pgvector ... ok 78 ms16 > test z_15_plv8 ... ok 82 ms17 > test z_15_roles ... ok 25 ms18 > test z_15_rum ... ok 37 ms19 > test z_15_timescale ... ok 52 ms20 > test z_15_unhype_timescale_to_partman ... ok 19436 ms21 >22 > =======================23 > 2 of 72 tests failed.24 > =======================25 >26 > The differences that caused some tests to fail can be viewed in the27 > file "/nix/store/yd4n3zsp49pvl8za51xgdyswhbdhwa34-run-check-harness-psql-15/regression_output/regression.diffs". A copy of the test summary that you see28 > above is saved in the file "/nix/store/yd4n3zsp49pvl8za51xgdyswhbdhwa34-run-check-harness-psql-15/regression_output/regression.out".29 >30 > 2026-10-07 15:07:44 [ERROR] pg_regress tests failed31 > 2026-10-07 15:07:44 [ERROR] An error occurred. Exit code: 132 > 2026-10-07 15:07:44 [ERROR] Debug logs:33 For full logs, run:34 nix log /nix/store/w0f7chhp1jxqwgw8ybkf29jm486j4knq-run-check-harness-psql-15.drv35error: Cannot build '/nix/store/w0f7chhp1jxqwgw8ybkf29jm486j4knq-run-check-harness-psql-15.drv'.36 Reason: builder failed with exit code 1.37 Output paths:38 /nix/store/yd4n3zsp49pvl8za51xgdyswhbdhwa34-run-check-harness-psql-15