this derivation will be built: /nix/store/dnqbv3nrd4cnnzjib9vgm0y65i7llf6w-run-check-harness-psql-orioledb-17.drv error: Cannot build '/nix/store/dnqbv3nrd4cnnzjib9vgm0y65i7llf6w-run-check-harness-psql-orioledb-17.drv'. Reason: builder failed with exit code 1. Output paths: /nix/store/dwj9660f3d4lz8379ddkcdag17zya1ga-run-check-harness-psql-orioledb-17 Last 25 log lines: > test wal2json ... ok 19 ms > test z_orioledb-17_docs-cascades-deletes ... ok 88 ms > test z_orioledb-17_docs-full-text-search ... ok 32 ms > test z_orioledb-17_docs-functions ... ok 364 ms > test z_orioledb-17_docs-indexes ... ok 30 ms > test z_orioledb-17_docs-partitioning ... ok 40 ms > test z_orioledb-17_ext_interface ... FAILED 114 ms > test z_orioledb-17_extensions_schema ... ok 10 ms > test z_orioledb-17_intarray_ltree_query ... ok 9 ms > test z_orioledb-17_pg_stat_monitor ... ok 9 ms > test z_orioledb-17_pgroonga ... ok 55 ms > test z_orioledb-17_pgvector ... ok 19 ms > test z_orioledb-17_verify_orioledb ... ok 16 ms > > ======================= > 2 of 65 tests failed. > ======================= > > The differences that caused some tests to fail can be viewed in the > file "/nix/store/dwj9660f3d4lz8379ddkcdag17zya1ga-run-check-harness-psql-orioledb-17/regression_output/regression.diffs". A copy of the test summary that you see > above is saved in the file "/nix/store/dwj9660f3d4lz8379ddkcdag17zya1ga-run-check-harness-psql-orioledb-17/regression_output/regression.out". > > 2026-10-07 14:26:40 [ERROR] pg_regress tests failed > 2026-10-07 14:26:40 [ERROR] An error occurred. Exit code: 1 > 2026-10-07 14:26:40 [ERROR] Debug logs: For full logs, run: nix log /nix/store/dnqbv3nrd4cnnzjib9vgm0y65i7llf6w-run-check-harness-psql-orioledb-17.drv